{"text_format":"1","workbook":"xlsx","n_sheets":4,"sheets":["Entrants","Score","Places","TeamResults"],"not_rendered":{"charts":0,"images":0,"macros":1,"external_links":0,"defined_names":12,"comments":0,"pivot_tables":0},"unopened":[],"bounds":{"document_bytes":16777216,"sheet_cells":100000,"rows_first":2000,"rows_last":500,"rows_between":2000,"halvings":0,"cell_chars":16384,"cell_head_chars":4096},"cells_cut":0,"cells_raw":0,"read":"whole","date_system":"1900"}

{"sheet":"Entrants","index":0,"n_rows":1000,"n_cols":4,"rows_kept":1000,"cut":false,"hidden":false,"merged":[]}
["Bib","Team","Name","Grade"]
[1,"M","Lowden"]
[2,"M","Riley"]
[3,"M","North"]
[4,"M","Munson"]
[5,"M","Muhich"]
[6,"M","Motsch"]
[7,"M","Bell"]
[8,"M","Hall"]
[9,"M","Myers"]
[10,"M","Balzer"]
[11,"M","Anderson"]
[12,"M","Hajduk"]
[13,"S","Cryer"]
[14,"M","Paugys"]
[15,"M","Boles"]
[16,"S","Miller"]
[17,"S","Chaplin"]
[18,"M","Su"]
[19,"M","Warren"]
[20,"M","Torri"]
[21,"M","Undesser"]
[22,"S","Okapal"]
[23,"M","Fawley"]
[24,"S","Graszer"]
[25,"M","Conroy, J"]
[26,"M","Johannessen"]
[27,"M","Rhoades"]
[28,"M","Conroy, S"]
[29,"M","Watson"]
[30,"M","Smith"]
[31,"M","Shrum"]
[{"$f":"IF(B33<>\"\",A32+1,\"\")","v":""}]
[""]
[""]
[""]
[""]
[""]
[""]
[""]
[""]
[""]
[""]
[""]
[""]
[""]
[""]
[""]
[""]
[""]
[""]
[""]
[""]
[""]
[""]
[""]
[""]
[""]
[""]
[""]
[""]
[""]
[""]
[""]
[""]
[{"$f":"IF(B66<>\"\",A65+1,\"\")","v":""}]
[""]
[""]
[""]
[""]
[""]
[""]
[""]
[""]
[""]
[""]
[""]
[""]
[""]
[""]
[""]
[""]
[""]
[""]
[""]
[""]
[""]
[""]
[""]
[""]
[""]
[""]
[""]
[""]
[""]
[""]
[""]
[""]
[""]
[""]
[""]
[""]
[""]
[""]
[""]
[""]
[""]
[""]
[""]
[""]
[""]
[""]
[""]
[""]
[""]
[""]
[""]
[""]
[""]
[""]
[""]
[""]
[""]
[""]
[""]
[""]
[""]
[""]
[""]
[{"$f":"IF(B130<>\"\",A129+1,\"\")","v":""}]
[""]
[""]
[""]
[""]
[""]
[""]
[""]
[""]
[""]
[""]
[""]
[""]
[""]
[""]
[""]
[""]
[""]
[""]
[""]
[""]
[""]
[""]
[""]
[""]
[""]
[""]
[""]
[""]
[""]
[""]
[{"$f":"IF(B161<>\"\",A160+1,\"\")","v":""}]
[""]
[""]
[""]
[""]
[""]
[""]
[""]
[""]
[""]
[""]
[""]
[""]
[""]
[""]
[""]
[""]
[""]
[""]
[""]
[{"$f":"IF(B181<>\"\",A180+1,\"\")","v":""}]
[""]
[""]
[""]
[""]
[""]
[""]
[""]
[""]
[""]
[""]
[""]
[""]
[""]
[""]
[{"$f":"IF(B196<>\"\",A195+1,\"\")","v":""}]
[""]
[""]
[""]
[""]
[""]
[""]
[""]
[""]
[""]
[""]
[""]
[""]
[""]
[""]
[""]
[""]
[""]
[""]
[""]
[""]
[""]
[""]
[""]
[""]
[""]
[""]
[""]
[""]
[""]
[""]
[""]
[""]
[""]
[""]
[""]
[""]
[""]
[""]
[""]
[""]
[{"$f":"IF(B237<>\"\",A236+1,\"\")","v":""}]
[""]
[""]
[""]
[""]
[""]
[""]
[""]
[""]
[""]
[""]
[""]
[""]
[""]
[""]
[""]
[""]
[""]
[""]
[""]
[""]
[""]
[""]
[""]
[""]
[""]
[""]
[""]
[""]
[""]
[""]
[""]
[""]
[""]
[""]
[""]
[""]
[""]
[""]
[""]
[""]
[""]
[""]
[""]
[""]
[""]
[""]
[""]
[""]
[""]
[""]
[""]
[""]
[""]
[""]
[""]
[""]
[""]
[""]
[""]
[""]
[""]
[""]
[""]
[{"$f":"IF(B301<>\"\",A300+1,\"\")","v":""}]
[{"$f":"IF(B302<>\"\",A301+1,\"\")","v":""}]
[{"$f":"IF(B303<>\"\",A302+1,\"\")","v":""}]
[{"$f":"IF(B304<>\"\",A303+1,\"\")","v":""}]
[{"$f":"IF(B305<>\"\",A304+1,\"\")","v":""}]
[""]
[""]
[""]
[""]
[""]
[""]
[""]
[""]
[""]
[""]
[""]
[""]
[""]
[""]
[""]
[""]
[{"$f":"IF(B322<>\"\",A321+1,\"\")","v":""}]
[{"$f":"IF(B323<>\"\",A322+1,\"\")","v":""}]
[{"$f":"IF(B324<>\"\",A323+1,\"\")","v":""}]
[""]
[""]
[""]
[""]
[""]
[""]
[""]
[""]
[""]
[""]
[""]
[""]
[""]
[""]
[""]
[""]
[""]
[""]
[""]
[""]
[""]
[""]
[""]
[""]
[""]
[""]
[""]
[""]
[""]
[""]
[""]
[""]
[""]
[""]
[""]
[""]
[""]
[""]
[""]
[""]
[""]
[""]
[""]
[""]
[""]
[""]
[""]
[""]
[""]
[""]
[""]
[""]
[""]
[""]
[""]
[""]
[""]
[""]
[""]
[""]
[""]
[""]
[""]
[{"$f":"IF(B388<>\"\",A387+1,\"\")","v":""}]
[""]
[""]
[""]
[""]
[""]
[""]
[""]
[""]
[""]
[""]
[""]
[""]
[""]
[""]
[""]
[""]
[""]
[""]
[""]
[""]
[""]
[""]
[""]
[""]
[""]
[""]
[""]
[""]
[""]
[""]
[""]
[""]
[""]
[""]
[""]
[""]
[""]
[""]
[""]
[""]
[""]
[""]
[""]
[""]
[""]
[""]
[""]
[""]
[""]
[""]
[""]
[""]
[""]
[""]
[""]
[""]
[""]
[""]
[""]
[""]
[""]
[""]
[""]
[{"$f":"IF(B452<>\"\",A451+1,\"\")","v":""}]
[""]
[""]
[""]
[""]
[""]
[""]
[""]
[""]
[""]
[""]
[""]
[""]
[""]
[""]
[""]
[""]
[""]
[""]
[""]
[""]
[""]
[""]
[""]
[""]
[""]
[""]
[""]
[""]
[""]
[""]
[""]
[""]
[""]
[""]
[""]
[""]
[""]
[""]
[""]
[""]
[""]
[""]
[""]
[""]
[""]
[""]
[""]
[""]
[""]
[""]
[""]
[""]
[""]
[""]
[""]
[""]
[""]
[""]
[""]
[""]
[""]
[""]
[""]
[{"$f":"IF(B516<>\"\",A515+1,\"\")","v":""}]
[""]
[""]
[""]
[""]
[""]
[""]
[""]
[""]
[""]
[""]
[""]
[""]
[""]
[""]
[""]
[""]
[""]
[""]
[""]
[""]
[""]
[""]
[""]
[""]
[""]
[""]
[""]
[""]
[""]
[""]
[""]
[""]
[""]
[""]
[""]
[""]
[""]
[""]
[""]
[""]
[""]
[""]
[""]
[""]
[""]
[""]
[""]
[""]
[""]
[""]
[""]
[""]
[""]
[""]
[""]
[""]
[""]
[""]
[""]
[""]
[""]
[""]
[""]
[{"$f":"IF(B580<>\"\",A579+1,\"\")","v":""}]
[""]
[""]
[""]
[""]
[""]
[""]
[""]
[""]
[""]
[""]
[""]
[""]
[""]
[""]
[""]
[""]
[""]
[""]
[""]
[""]
[""]
[""]
[""]
[""]
[""]
[""]
[""]
[""]
[""]
[""]
[""]
[""]
[""]
[""]
[""]
[""]
[""]
[""]
[""]
[""]
[""]
[""]
[""]
[""]
[""]
[""]
[""]
[""]
[""]
[""]
[""]
[""]
[""]
[""]
[""]
[""]
[""]
[""]
[""]
[""]
[""]
[""]
[""]
[{"$f":"IF(B644<>\"\",A643+1,\"\")","v":""}]
[""]
[""]
[""]
[""]
[""]
[""]
[""]
[""]
[""]
[""]
[""]
[""]
[""]
[""]
[""]
[""]
[""]
[""]
[""]
[""]
[""]
[""]
[""]
[""]
[""]
[""]
[""]
[""]
[""]
[""]
[""]
[""]
[""]
[""]
[""]
[""]
[""]
[""]
[""]
[""]
[""]
[""]
[""]
[""]
[""]
[""]
[""]
[""]
[""]
[""]
[""]
[""]
[""]
[""]
[""]
[""]
[""]
[""]
[""]
[""]
[""]
[""]
[""]
[{"$f":"IF(B708<>\"\",A707+1,\"\")","v":""}]
[""]
[""]
[""]
[""]
[""]
[""]
[""]
[""]
[""]
[""]
[""]
[""]
[""]
[""]
[""]
[""]
[""]
[""]
[""]
[""]
[""]
[""]
[""]
[""]
[""]
[""]
[""]
[""]
[""]
[""]
[""]
[""]
[""]
[""]
[""]
[""]
[""]
[""]
[""]
[""]
[""]
[""]
[""]
[""]
[""]
[""]
[""]
[""]
[""]
[""]
[""]
[""]
[""]
[""]
[""]
[""]
[""]
[""]
[""]
[""]
[""]
[""]
[""]
[{"$f":"IF(B772<>\"\",A771+1,\"\")","v":""}]
[""]
[""]
[""]
[""]
[""]
[""]
[""]
[""]
[""]
[""]
[""]
[""]
[""]
[""]
[""]
[""]
[""]
[""]
[""]
[""]
[""]
[""]
[""]
[""]
[""]
[""]
[""]
[""]
[""]
[""]
[""]
[""]
[""]
[""]
[""]
[""]
[""]
[""]
[""]
[""]
[""]
[""]
[""]
[""]
[""]
[""]
[""]
[""]
[""]
[""]
[""]
[""]
[""]
[""]
[""]
[""]
[""]
[""]
[""]
[""]
[""]
[""]
[""]
[{"$f":"IF(B836<>\"\",A835+1,\"\")","v":""}]
[""]
[""]
[""]
[""]
[""]
[""]
[""]
[""]
[""]
[""]
[""]
[""]
[""]
[""]
[""]
[""]
[""]
[""]
[""]
[""]
[""]
[""]
[""]
[""]
[""]
[""]
[""]
[""]
[""]
[""]
[""]
[""]
[""]
[""]
[""]
[""]
[""]
[""]
[""]
[""]
[""]
[""]
[""]
[""]
[""]
[""]
[""]
[""]
[""]
[""]
[""]
[""]
[""]
[""]
[""]
[""]
[""]
[""]
[""]
[""]
[""]
[""]
[""]
[{"$f":"IF(B900<>\"\",A899+1,\"\")","v":""}]
[""]
[""]
[""]
[""]
[""]
[""]
[""]
[""]
[""]
[""]
[""]
[""]
[""]
[""]
[""]
[""]
[""]
[""]
[""]
[""]
[""]
[""]
[""]
[""]
[""]
[""]
[""]
[""]
[""]
[""]
[""]
[""]
[""]
[""]
[""]
[""]
[""]
[""]
[""]
[""]
[""]
[""]
[""]
[""]
[""]
[""]
[""]
[""]
[""]
[""]
[""]
[""]
[""]
[""]
[""]
[""]
[""]
[""]
[""]
[""]
[""]
[""]
[""]
[{"$f":"IF(B964<>\"\",A963+1,\"\")","v":""}]
[""]
[""]
[""]
[""]
[""]
[""]
[""]
[""]
[""]
[""]
[""]
[""]
[""]
[""]
[""]
[""]
[""]
[""]
[""]
[""]
[""]
[""]
[""]
[""]
[""]
[""]
[""]
[""]
[""]
[""]
[""]
[""]
[""]
[""]
[""]
[""]

{"sheet":"Score","index":1,"n_rows":1000,"n_cols":4,"rows_kept":1000,"cut":false,"hidden":false,"merged":[]}
["Place","Bib","Time"]
[1,1,"12:49.00",{"$f":"IF(C2<>\"\",INT(MID(C2,1,2))*60+INT(MID(C2,4,2))+INT(MID(C2,7,2))/100,\"\")","v":769}]
[2,2,"12:51.00",{"$f":"IF(C3<>\"\",INT(MID(C3,1,2))*60+INT(MID(C3,4,2))+INT(MID(C3,7,2))/100,\"\")","v":771}]
[3,3,"13:42.00",{"$f":"IF(C4<>\"\",INT(MID(C4,1,2))*60+INT(MID(C4,4,2))+INT(MID(C4,7,2))/100,\"\")","v":822}]
[4,4,"13:48.00",828]
[5,5,"13:56.00",836]
[6,6,"13:57.00",837]
[7,7,"14:02.00",842]
[8,8,"14:11.00",851]
[9,9,"14:21.00",861]
[10,10,"14:22.00",862]
[11,11,"14:31.00",871]
[12,12,"14:45.00",885]
[13,13,"14:49.00",889]
[14,14,"14:50.00",890]
[15,15,"15:18.00",918]
[16,16,"15:26.00",926]
[17,17,"15:32.00",932]
[18,18,"15:53.00",953]
[19,19,"16:03.00",963]
[20,20,"16:31.00",991]
[21,21,"16:33.00",993]
[22,22,"17:12.00",1032]
[23,23,"17:44.00",1064]
[24,24,"17:53.00",1073]
[25,25,"17:54.00",1074]
[26,26,"18:16.00",1096]
[27,27,"18:30.00",1110]
[28,28,"18:32.00",1112]
[29,29,"19:33.00",1173]
[30,30,"20:00.00",1200]
[31,31,"20:57.00",1257]
[{"$f":"IF(B33>0,A32+1,\"\")","v":""},null,null,""]
["",null,null,""]
["",null,null,""]
["",null,null,""]
["",null,null,""]
["",null,null,""]
["",null,null,""]
["",null,null,""]
["",null,null,""]
["",null,null,""]
["",null,null,""]
["",null,null,""]
["",null,null,""]
["",null,null,""]
["",null,null,""]
["",null,null,""]
["",null,null,""]
["",null,null,""]
["",null,null,""]
["",null,null,""]
["",null,null,""]
["",null,null,""]
["",null,null,""]
["",null,null,""]
["",null,null,""]
["",null,null,""]
["",null,null,""]
["",null,null,""]
["",null,null,""]
["",null,null,""]
["",null,null,""]
["",null,null,""]
["",null,null,""]
["",null,null,""]
["",null,null,""]
[{"$f":"IF(B68>0,A67+1,\"\")","v":""},null,null,{"$f":"IF(C68<>\"\",INT(MID(C68,1,2))*60+INT(MID(C68,4,2))+INT(MID(C68,7,2))/100,\"\")","v":""}]
["",null,null,""]
["",null,null,""]
["",null,null,""]
["",null,null,""]
["",null,null,""]
["",null,null,""]
["",null,null,""]
["",null,null,""]
["",null,null,""]
["",null,null,""]
["",null,null,""]
["",null,null,""]
["",null,null,""]
["",null,null,""]
["",null,null,""]
["",null,null,""]
["",null,null,""]
["",null,null,""]
["",null,null,""]
["",null,null,""]
["",null,null,""]
["",null,null,""]
["",null,null,""]
["",null,null,""]
["",null,null,""]
["",null,null,""]
["",null,null,""]
["",null,null,""]
["",null,null,""]
["",null,null,""]
["",null,null,""]
["",null,null,""]
["",null,null,""]
["",null,null,""]
["",null,null,""]
["",null,null,""]
["",null,null,""]
["",null,null,""]
["",null,null,""]
["",null,null,""]
["",null,null,""]
["",null,null,""]
["",null,null,""]
["",null,null,""]
["",null,null,""]
["",null,null,""]
["",null,null,""]
["",null,null,""]
["",null,null,""]
["",null,null,""]
["",null,null,""]
["",null,null,""]
["",null,null,""]
["",null,null,""]
["",null,null,""]
["",null,null,""]
["",null,null,""]
["",null,null,""]
["",null,null,""]
["",null,null,""]
["",null,null,""]
["",null,null,""]
["",null,null,""]
[{"$f":"IF(B132>0,A131+1,\"\")","v":""},null,null,{"$f":"IF(C132<>\"\",INT(MID(C132,1,2))*60+INT(MID(C132,4,2))+INT(MID(C132,7,2))/100,\"\")","v":""}]
["",null,null,""]
["",null,null,""]
["",null,null,""]
["",null,null,""]
["",null,null,""]
["",null,null,""]
["",null,null,""]
["",null,null,""]
["",null,null,""]
["",null,null,""]
["",null,null,""]
["",null,null,""]
["",null,null,""]
["",null,null,""]
["",null,null,""]
["",null,null,""]
["",null,null,""]
["",null,null,""]
["",null,null,""]
["",null,null,""]
["",null,null,""]
["",null,null,""]
["",null,null,""]
["",null,null,""]
["",null,null,""]
["",null,null,""]
["",null,null,""]
["",null,null,""]
["",null,null,""]
["",null,null,""]
["",null,null,""]
["",null,null,""]
["",null,null,""]
["",null,null,""]
["",null,null,""]
["",null,null,""]
["",null,null,""]
["",null,null,""]
["",null,null,""]
["",null,null,""]
["",null,null,""]
["",null,null,""]
["",null,null,""]
["",null,null,""]
["",null,null,""]
["",null,null,""]
["",null,null,""]
["",null,null,""]
["",null,null,""]
["",null,null,""]
["",null,null,""]
["",null,null,""]
["",null,null,""]
["",null,null,""]
["",null,null,""]
["",null,null,""]
["",null,null,""]
["",null,null,""]
["",null,null,""]
["",null,null,""]
["",null,null,""]
["",null,null,""]
["",null,null,""]
[{"$f":"IF(B196>0,A195+1,\"\")","v":""},null,null,{"$f":"IF(C196<>\"\",INT(MID(C196,1,2))*60+INT(MID(C196,4,2))+INT(MID(C196,7,2))/100,\"\")","v":""}]
["",null,null,""]
["",null,null,""]
["",null,null,""]
["",null,null,""]
["",null,null,""]
["",null,null,""]
["",null,null,""]
["",null,null,""]
["",null,null,""]
["",null,null,""]
["",null,null,""]
["",null,null,""]
["",null,null,""]
["",null,null,""]
["",null,null,""]
["",null,null,""]
["",null,null,""]
["",null,null,""]
["",null,null,""]
["",null,null,""]
["",null,null,""]
["",null,null,""]
["",null,null,""]
["",null,null,""]
["",null,null,""]
["",null,null,""]
["",null,null,""]
["",null,null,""]
["",null,null,""]
["",null,null,""]
["",null,null,""]
["",null,null,""]
["",null,null,""]
["",null,null,""]
["",null,null,""]
["",null,null,""]
["",null,null,""]
["",null,null,""]
["",null,null,""]
["",null,null,""]
["",null,null,""]
["",null,null,""]
["",null,null,""]
["",null,null,""]
["",null,null,""]
["",null,null,""]
["",null,null,""]
["",null,null,""]
["",null,null,""]
["",null,null,""]
["",null,null,""]
["",null,null,""]
["",null,null,""]
["",null,null,""]
["",null,null,""]
["",null,null,""]
["",null,null,""]
["",null,null,""]
["",null,null,""]
["",null,null,""]
["",null,null,""]
["",null,null,""]
["",null,null,""]
[{"$f":"IF(B260>0,A259+1,\"\")","v":""},null,null,{"$f":"IF(C260<>\"\",INT(MID(C260,1,2))*60+INT(MID(C260,4,2))+INT(MID(C260,7,2))/100,\"\")","v":""}]
["",null,null,""]
["",null,null,""]
["",null,null,""]
["",null,null,""]
["",null,null,""]
["",null,null,""]
["",null,null,""]
["",null,null,""]
["",null,null,""]
["",null,null,""]
["",null,null,""]
["",null,null,""]
["",null,null,""]
["",null,null,""]
["",null,null,""]
["",null,null,""]
["",null,null,""]
["",null,null,""]
["",null,null,""]
["",null,null,""]
["",null,null,""]
["",null,null,""]
["",null,null,""]
["",null,null,""]
["",null,null,""]
["",null,null,""]
["",null,null,""]
["",null,null,""]
["",null,null,""]
["",null,null,""]
["",null,null,""]
["",null,null,""]
["",null,null,""]
["",null,null,""]
["",null,null,""]
["",null,null,""]
["",null,null,""]
["",null,null,""]
["",null,null,""]
["",null,null,""]
["",null,null,""]
["",null,null,""]
["",null,null,""]
["",null,null,""]
["",null,null,""]
["",null,null,""]
["",null,null,""]
["",null,null,""]
["",null,null,""]
["",null,null,""]
["",null,null,""]
["",null,null,""]
["",null,null,""]
["",null,null,""]
["",null,null,""]
["",null,null,""]
["",null,null,""]
["",null,null,""]
["",null,null,""]
["",null,null,""]
["",null,null,""]
["",null,null,""]
["",null,null,""]
[{"$f":"IF(B324>0,A323+1,\"\")","v":""},null,null,{"$f":"IF(C324<>\"\",INT(MID(C324,1,2))*60+INT(MID(C324,4,2))+INT(MID(C324,7,2))/100,\"\")","v":""}]
["",null,null,""]
["",null,null,""]
["",null,null,""]
["",null,null,""]
["",null,null,""]
["",null,null,""]
["",null,null,""]
["",null,null,""]
["",null,null,""]
["",null,null,""]
["",null,null,""]
["",null,null,""]
["",null,null,""]
["",null,null,""]
["",null,null,""]
["",null,null,""]
["",null,null,""]
["",null,null,""]
["",null,null,""]
["",null,null,""]
["",null,null,""]
["",null,null,""]
["",null,null,""]
["",null,null,""]
["",null,null,""]
["",null,null,""]
["",null,null,""]
["",null,null,""]
["",null,null,""]
["",null,null,""]
["",null,null,""]
["",null,null,""]
["",null,null,""]
["",null,null,""]
["",null,null,""]
["",null,null,""]
["",null,null,""]
["",null,null,""]
["",null,null,""]
["",null,null,""]
["",null,null,""]
["",null,null,""]
["",null,null,""]
["",null,null,""]
["",null,null,""]
["",null,null,""]
["",null,null,""]
["",null,null,""]
["",null,null,""]
["",null,null,""]
["",null,null,""]
["",null,null,""]
["",null,null,""]
["",null,null,""]
["",null,null,""]
["",null,null,""]
["",null,null,""]
["",null,null,""]
["",null,null,""]
["",null,null,""]
["",null,null,""]
["",null,null,""]
["",null,null,""]
[{"$f":"IF(B388>0,A387+1,\"\")","v":""},null,null,{"$f":"IF(C388<>\"\",INT(MID(C388,1,2))*60+INT(MID(C388,4,2))+INT(MID(C388,7,2))/100,\"\")","v":""}]
["",null,null,""]
["",null,null,""]
["",null,null,""]
["",null,null,""]
["",null,null,""]
["",null,null,""]
["",null,null,""]
["",null,null,""]
["",null,null,""]
["",null,null,""]
["",null,null,""]
["",null,null,""]
["",null,null,""]
["",null,null,""]
["",null,null,""]
["",null,null,""]
["",null,null,""]
["",null,null,""]
["",null,null,""]
["",null,null,""]
["",null,null,""]
["",null,null,""]
["",null,null,""]
["",null,null,""]
["",null,null,""]
["",null,null,""]
["",null,null,""]
["",null,null,""]
["",null,null,""]
["",null,null,""]
["",null,null,""]
["",null,null,""]
["",null,null,""]
["",null,null,""]
["",null,null,""]
["",null,null,""]
["",null,null,""]
["",null,null,""]
["",null,null,""]
["",null,null,""]
["",null,null,""]
["",null,null,""]
["",null,null,""]
["",null,null,""]
["",null,null,""]
["",null,null,""]
["",null,null,""]
["",null,null,""]
["",null,null,""]
["",null,null,""]
["",null,null,""]
["",null,null,""]
["",null,null,""]
["",null,null,""]
["",null,null,""]
["",null,null,""]
["",null,null,""]
["",null,null,""]
["",null,null,""]
["",null,null,""]
["",null,null,""]
["",null,null,""]
["",null,null,""]
[{"$f":"IF(B452>0,A451+1,\"\")","v":""},null,null,{"$f":"IF(C452<>\"\",INT(MID(C452,1,2))*60+INT(MID(C452,4,2))+INT(MID(C452,7,2))/100,\"\")","v":""}]
["",null,null,""]
["",null,null,""]
["",null,null,""]
["",null,null,""]
["",null,null,""]
["",null,null,""]
["",null,null,""]
["",null,null,""]
["",null,null,""]
["",null,null,""]
["",null,null,""]
["",null,null,""]
["",null,null,""]
["",null,null,""]
["",null,null,""]
["",null,null,""]
["",null,null,""]
["",null,null,""]
["",null,null,""]
["",null,null,""]
["",null,null,""]
["",null,null,""]
["",null,null,""]
["",null,null,""]
["",null,null,""]
["",null,null,""]
["",null,null,""]
["",null,null,""]
["",null,null,""]
["",null,null,""]
["",null,null,""]
["",null,null,""]
["",null,null,""]
["",null,null,""]
["",null,null,""]
["",null,null,""]
["",null,null,""]
["",null,null,""]
["",null,null,""]
["",null,null,""]
["",null,null,""]
["",null,null,""]
["",null,null,""]
["",null,null,""]
["",null,null,""]
["",null,null,""]
["",null,null,""]
["",null,null,""]
["",null,null,""]
["",null,null,""]
["",null,null,""]
["",null,null,""]
["",null,null,""]
["",null,null,""]
["",null,null,""]
["",null,null,""]
["",null,null,""]
["",null,null,""]
["",null,null,""]
["",null,null,""]
["",null,null,""]
["",null,null,""]
["",null,null,""]
[{"$f":"IF(B516>0,A515+1,\"\")","v":""},null,null,{"$f":"IF(C516<>\"\",INT(MID(C516,1,2))*60+INT(MID(C516,4,2))+INT(MID(C516,7,2))/100,\"\")","v":""}]
["",null,null,""]
["",null,null,""]
["",null,null,""]
["",null,null,""]
["",null,null,""]
["",null,null,""]
["",null,null,""]
["",null,null,""]
["",null,null,""]
["",null,null,""]
["",null,null,""]
["",null,null,""]
["",null,null,""]
["",null,null,""]
["",null,null,""]
["",null,null,""]
["",null,null,""]
["",null,null,""]
["",null,null,""]
["",null,null,""]
["",null,null,""]
["",null,null,""]
["",null,null,""]
["",null,null,""]
["",null,null,""]
["",null,null,""]
["",null,null,""]
["",null,null,""]
["",null,null,""]
["",null,null,""]
["",null,null,""]
["",null,null,""]
["",null,null,""]
["",null,null,""]
["",null,null,""]
["",null,null,""]
["",null,null,""]
["",null,null,""]
["",null,null,""]
["",null,null,""]
["",null,null,""]
["",null,null,""]
["",null,null,""]
["",null,null,""]
["",null,null,""]
["",null,null,""]
["",null,null,""]
["",null,null,""]
["",null,null,""]
["",null,null,""]
["",null,null,""]
["",null,null,""]
["",null,null,""]
["",null,null,""]
["",null,null,""]
["",null,null,""]
["",null,null,""]
["",null,null,""]
["",null,null,""]
["",null,null,""]
["",null,null,""]
["",null,null,""]
["",null,null,""]
[{"$f":"IF(B580>0,A579+1,\"\")","v":""},null,null,{"$f":"IF(C580<>\"\",INT(MID(C580,1,2))*60+INT(MID(C580,4,2))+INT(MID(C580,7,2))/100,\"\")","v":""}]
["",null,null,""]
["",null,null,""]
["",null,null,""]
["",null,null,""]
["",null,null,""]
["",null,null,""]
["",null,null,""]
["",null,null,""]
["",null,null,""]
["",null,null,""]
["",null,null,""]
["",null,null,""]
["",null,null,""]
["",null,null,""]
["",null,null,""]
["",null,null,""]
["",null,null,""]
["",null,null,""]
["",null,null,""]
["",null,null,""]
["",null,null,""]
["",null,null,""]
["",null,null,""]
["",null,null,""]
["",null,null,""]
["",null,null,""]
["",null,null,""]
["",null,null,""]
["",null,null,""]
["",null,null,""]
["",null,null,""]
["",null,null,""]
["",null,null,""]
["",null,null,""]
["",null,null,""]
["",null,null,""]
["",null,null,""]
["",null,null,""]
["",null,null,""]
["",null,null,""]
["",null,null,""]
["",null,null,""]
["",null,null,""]
["",null,null,""]
["",null,null,""]
["",null,null,""]
["",null,null,""]
["",null,null,""]
["",null,null,""]
["",null,null,""]
["",null,null,""]
["",null,null,""]
["",null,null,""]
["",null,null,""]
["",null,null,""]
["",null,null,""]
["",null,null,""]
["",null,null,""]
["",null,null,""]
["",null,null,""]
["",null,null,""]
["",null,null,""]
["",null,null,""]
[{"$f":"IF(B644>0,A643+1,\"\")","v":""},null,null,{"$f":"IF(C644<>\"\",INT(MID(C644,1,2))*60+INT(MID(C644,4,2))+INT(MID(C644,7,2))/100,\"\")","v":""}]
["",null,null,""]
["",null,null,""]
["",null,null,""]
["",null,null,""]
["",null,null,""]
["",null,null,""]
["",null,null,""]
["",null,null,""]
["",null,null,""]
["",null,null,""]
["",null,null,""]
["",null,null,""]
["",null,null,""]
["",null,null,""]
["",null,null,""]
["",null,null,""]
["",null,null,""]
["",null,null,""]
["",null,null,""]
["",null,null,""]
["",null,null,""]
["",null,null,""]
["",null,null,""]
["",null,null,""]
["",null,null,""]
["",null,null,""]
["",null,null,""]
["",null,null,""]
["",null,null,""]
["",null,null,""]
["",null,null,""]
["",null,null,""]
["",null,null,""]
["",null,null,""]
["",null,null,""]
["",null,null,""]
["",null,null,""]
["",null,null,""]
["",null,null,""]
["",null,null,""]
["",null,null,""]
["",null,null,""]
["",null,null,""]
["",null,null,""]
["",null,null,""]
["",null,null,""]
["",null,null,""]
["",null,null,""]
["",null,null,""]
["",null,null,""]
["",null,null,""]
["",null,null,""]
["",null,null,""]
["",null,null,""]
["",null,null,""]
["",null,null,""]
["",null,null,""]
["",null,null,""]
["",null,null,""]
["",null,null,""]
["",null,null,""]
["",null,null,""]
["",null,null,""]
[{"$f":"IF(B708>0,A707+1,\"\")","v":""},null,null,{"$f":"IF(C708<>\"\",INT(MID(C708,1,2))*60+INT(MID(C708,4,2))+INT(MID(C708,7,2))/100,\"\")","v":""}]
["",null,null,""]
["",null,null,""]
["",null,null,""]
["",null,null,""]
["",null,null,""]
["",null,null,""]
["",null,null,""]
["",null,null,""]
["",null,null,""]
["",null,null,""]
["",null,null,""]
["",null,null,""]
["",null,null,""]
["",null,null,""]
["",null,null,""]
["",null,null,""]
["",null,null,""]
["",null,null,""]
["",null,null,""]
["",null,null,""]
["",null,null,""]
["",null,null,""]
["",null,null,""]
["",null,null,""]
["",null,null,""]
["",null,null,""]
["",null,null,""]
["",null,null,""]
["",null,null,""]
["",null,null,""]
["",null,null,""]
["",null,null,""]
["",null,null,""]
["",null,null,""]
["",null,null,""]
["",null,null,""]
["",null,null,""]
["",null,null,""]
["",null,null,""]
["",null,null,""]
["",null,null,""]
["",null,null,""]
["",null,null,""]
["",null,null,""]
["",null,null,""]
["",null,null,""]
["",null,null,""]
["",null,null,""]
["",null,null,""]
["",null,null,""]
["",null,null,""]
["",null,null,""]
["",null,null,""]
["",null,null,""]
["",null,null,""]
["",null,null,""]
["",null,null,""]
["",null,null,""]
["",null,null,""]
["",null,null,""]
["",null,null,""]
["",null,null,""]
["",null,null,""]
[{"$f":"IF(B772>0,A771+1,\"\")","v":""},null,null,{"$f":"IF(C772<>\"\",INT(MID(C772,1,2))*60+INT(MID(C772,4,2))+INT(MID(C772,7,2))/100,\"\")","v":""}]
["",null,null,""]
["",null,null,""]
["",null,null,""]
["",null,null,""]
["",null,null,""]
["",null,null,""]
["",null,null,""]
["",null,null,""]
["",null,null,""]
["",null,null,""]
["",null,null,""]
["",null,null,""]
["",null,null,""]
["",null,null,""]
["",null,null,""]
["",null,null,""]
["",null,null,""]
["",null,null,""]
["",null,null,""]
["",null,null,""]
["",null,null,""]
["",null,null,""]
["",null,null,""]
["",null,null,""]
["",null,null,""]
["",null,null,""]
["",null,null,""]
["",null,null,""]
["",null,null,""]
["",null,null,""]
["",null,null,""]
["",null,null,""]
["",null,null,""]
["",null,null,""]
["",null,null,""]
["",null,null,""]
["",null,null,""]
["",null,null,""]
["",null,null,""]
["",null,null,""]
["",null,null,""]
["",null,null,""]
["",null,null,""]
["",null,null,""]
["",null,null,""]
["",null,null,""]
["",null,null,""]
["",null,null,""]
["",null,null,""]
["",null,null,""]
["",null,null,""]
["",null,null,""]
["",null,null,""]
["",null,null,""]
["",null,null,""]
["",null,null,""]
["",null,null,""]
["",null,null,""]
["",null,null,""]
["",null,null,""]
["",null,null,""]
["",null,null,""]
["",null,null,""]
[{"$f":"IF(B836>0,A835+1,\"\")","v":""},null,null,{"$f":"IF(C836<>\"\",INT(MID(C836,1,2))*60+INT(MID(C836,4,2))+INT(MID(C836,7,2))/100,\"\")","v":""}]
["",null,null,""]
["",null,null,""]
["",null,null,""]
["",null,null,""]
["",null,null,""]
["",null,null,""]
["",null,null,""]
["",null,null,""]
["",null,null,""]
["",null,null,""]
["",null,null,""]
["",null,null,""]
["",null,null,""]
["",null,null,""]
["",null,null,""]
["",null,null,""]
["",null,null,""]
["",null,null,""]
["",null,null,""]
["",null,null,""]
["",null,null,""]
["",null,null,""]
["",null,null,""]
["",null,null,""]
["",null,null,""]
["",null,null,""]
["",null,null,""]
["",null,null,""]
["",null,null,""]
["",null,null,""]
["",null,null,""]
["",null,null,""]
["",null,null,""]
["",null,null,""]
["",null,null,""]
["",null,null,""]
["",null,null,""]
["",null,null,""]
["",null,null,""]
["",null,null,""]
["",null,null,""]
["",null,null,""]
["",null,null,""]
["",null,null,""]
["",null,null,""]
["",null,null,""]
["",null,null,""]
["",null,null,""]
["",null,null,""]
["",null,null,""]
["",null,null,""]
["",null,null,""]
["",null,null,""]
["",null,null,""]
["",null,null,""]
["",null,null,""]
["",null,null,""]
["",null,null,""]
["",null,null,""]
["",null,null,""]
["",null,null,""]
["",null,null,""]
["",null,null,""]
[{"$f":"IF(B900>0,A899+1,\"\")","v":""},null,null,{"$f":"IF(C900<>\"\",INT(MID(C900,1,2))*60+INT(MID(C900,4,2))+INT(MID(C900,7,2))/100,\"\")","v":""}]
["",null,null,""]
["",null,null,""]
["",null,null,""]
["",null,null,""]
["",null,null,""]
["",null,null,""]
["",null,null,""]
["",null,null,""]
["",null,null,""]
["",null,null,""]
["",null,null,""]
["",null,null,""]
["",null,null,""]
["",null,null,""]
["",null,null,""]
["",null,null,""]
["",null,null,""]
["",null,null,""]
["",null,null,""]
["",null,null,""]
["",null,null,""]
["",null,null,""]
["",null,null,""]
["",null,null,""]
["",null,null,""]
["",null,null,""]
["",null,null,""]
["",null,null,""]
["",null,null,""]
["",null,null,""]
["",null,null,""]
["",null,null,""]
["",null,null,""]
["",null,null,""]
["",null,null,""]
["",null,null,""]
["",null,null,""]
["",null,null,""]
["",null,null,""]
["",null,null,""]
["",null,null,""]
["",null,null,""]
["",null,null,""]
["",null,null,""]
["",null,null,""]
["",null,null,""]
["",null,null,""]
["",null,null,""]
["",null,null,""]
["",null,null,""]
["",null,null,""]
["",null,null,""]
["",null,null,""]
["",null,null,""]
["",null,null,""]
["",null,null,""]
["",null,null,""]
["",null,null,""]
["",null,null,""]
["",null,null,""]
["",null,null,""]
["",null,null,""]
["",null,null,""]
[{"$f":"IF(B964>0,A963+1,\"\")","v":""},null,null,{"$f":"IF(C964<>\"\",INT(MID(C964,1,2))*60+INT(MID(C964,4,2))+INT(MID(C964,7,2))/100,\"\")","v":""}]
["",null,null,""]
["",null,null,""]
["",null,null,""]
["",null,null,""]
["",null,null,""]
["",null,null,""]
["",null,null,""]
["",null,null,""]
["",null,null,""]
["",null,null,""]
["",null,null,""]
["",null,null,""]
["",null,null,""]
["",null,null,""]
["",null,null,""]
["",null,null,""]
["",null,null,""]
["",null,null,""]
["",null,null,""]
["",null,null,""]
["",null,null,""]
["",null,null,""]
["",null,null,""]
["",null,null,""]
["",null,null,""]
["",null,null,""]
["",null,null,""]
["",null,null,""]
["",null,null,""]
["",null,null,""]
["",null,null,""]
["",null,null,""]
["",null,null,""]
["",null,null,""]
["",null,null,""]
["",null,null,""]

{"sheet":"Places","index":2,"n_rows":1000,"n_cols":7,"rows_kept":1000,"cut":false,"hidden":false,"merged":[[0,0,0,6]]}
["boys 2 mile"]
["Position","Score","Bib","Name","Team","Grade","Time"]
[{"$f":"IF(Score!B2>0,Score!A2,\"\")","v":1},{"$f":"IF(Score!B2>0,IF(COUNTIF($E$3:$E$5000,E3)<5,\"\",1),\"\")","v":1},{"$f":"IF(Score!B2>0,Score!B2,\"\")","v":1},{"$f":"IF(Score!B2>0,VLOOKUP(C3,Entrants!$A$1:$E$5000,3,FALSE),\"\")","v":"Lowden"},{"$f":"IF(Score!B2>0,VLOOKUP(C3,Entrants!$A$2:$E$5000,2,FALSE),\"\")","v":"M"},{"$f":"IF(Score!B2>0,VLOOKUP(C3,Entrants!$A$2:$E$5000,4,FALSE),\"\")","v":0},{"$f":"IF(Score!C2>0,Score!C2,\"\")","v":"12:49.00"}]
[{"$f":"IF(Score!B3>0,Score!A3,\"\")","v":2},{"$f":"IF(Score!B3>0,IF(COUNTIF($E$3:$E$5000,E4)<5,\"\",IF(COUNTIF($E$3:E4,E4)>7,\"\",MAX($B$3:B3)+1)),\"\")","v":2},{"$f":"IF(Score!B3>0,Score!B3,\"\")","v":2},{"$f":"IF(Score!B3>0,VLOOKUP(C4,Entrants!$A$2:$E$5000,3,FALSE),\"\")","v":"Riley"},{"$f":"IF(Score!B3>0,VLOOKUP(C4,Entrants!$A$2:$E$5000,2,FALSE),\"\")","v":"M"},{"$f":"IF(Score!B3>0,VLOOKUP(C4,Entrants!$A$2:$E$5000,4,FALSE),\"\")","v":0},{"$f":"IF(Score!C3>0,Score!C3,\"\")","v":"12:51.00"}]
[{"$f":"IF(Score!B4>0,Score!A4,\"\")","v":3},{"$f":"IF(Score!B4>0,IF(COUNTIF($E$3:$E$5000,E5)<5,\"\",IF(COUNTIF($E$3:E5,E5)>7,\"\",MAX($B$3:B4)+1)),\"\")","v":3},{"$f":"IF(Score!B4>0,Score!B4,\"\")","v":3},{"$f":"IF(Score!B4>0,VLOOKUP(C5,Entrants!$A$2:$E$5000,3,FALSE),\"\")","v":"North"},{"$f":"IF(Score!B4>0,VLOOKUP(C5,Entrants!$A$2:$E$5000,2,FALSE),\"\")","v":"M"},{"$f":"IF(Score!B4>0,VLOOKUP(C5,Entrants!$A$2:$E$5000,4,FALSE),\"\")","v":0},{"$f":"IF(Score!C4>0,Score!C4,\"\")","v":"13:42.00"}]
[{"$f":"IF(Score!B5>0,Score!A5,\"\")","v":4},{"$f":"IF(Score!B5>0,IF(COUNTIF($E$3:$E$5000,E6)<5,\"\",IF(COUNTIF($E$3:E6,E6)>7,\"\",MAX($B$3:B5)+1)),\"\")","v":4},{"$f":"IF(Score!B5>0,Score!B5,\"\")","v":4},{"$f":"IF(Score!B5>0,VLOOKUP(C6,Entrants!$A$2:$E$5000,3,FALSE),\"\")","v":"Munson"},{"$f":"IF(Score!B5>0,VLOOKUP(C6,Entrants!$A$2:$E$5000,2,FALSE),\"\")","v":"M"},{"$f":"IF(Score!B5>0,VLOOKUP(C6,Entrants!$A$2:$E$5000,4,FALSE),\"\")","v":0},{"$f":"IF(Score!C5>0,Score!C5,\"\")","v":"13:48.00"}]
[{"$f":"IF(Score!B6>0,Score!A6,\"\")","v":5},{"$f":"IF(Score!B6>0,IF(COUNTIF($E$3:$E$5000,E7)<5,\"\",IF(COUNTIF($E$3:E7,E7)>7,\"\",MAX($B$3:B6)+1)),\"\")","v":5},{"$f":"IF(Score!B6>0,Score!B6,\"\")","v":5},{"$f":"IF(Score!B6>0,VLOOKUP(C7,Entrants!$A$2:$E$5000,3,FALSE),\"\")","v":"Muhich"},{"$f":"IF(Score!B6>0,VLOOKUP(C7,Entrants!$A$2:$E$5000,2,FALSE),\"\")","v":"M"},{"$f":"IF(Score!B6>0,VLOOKUP(C7,Entrants!$A$2:$E$5000,4,FALSE),\"\")","v":0},{"$f":"IF(Score!C6>0,Score!C6,\"\")","v":"13:56.00"}]
[{"$f":"IF(Score!B7>0,Score!A7,\"\")","v":6},{"$f":"IF(Score!B7>0,IF(COUNTIF($E$3:$E$5000,E8)<5,\"\",IF(COUNTIF($E$3:E8,E8)>7,\"\",MAX($B$3:B7)+1)),\"\")","v":6},{"$f":"IF(Score!B7>0,Score!B7,\"\")","v":6},{"$f":"IF(Score!B7>0,VLOOKUP(C8,Entrants!$A$2:$E$5000,3,FALSE),\"\")","v":"Motsch"},{"$f":"IF(Score!B7>0,VLOOKUP(C8,Entrants!$A$2:$E$5000,2,FALSE),\"\")","v":"M"},{"$f":"IF(Score!B7>0,VLOOKUP(C8,Entrants!$A$2:$E$5000,4,FALSE),\"\")","v":0},{"$f":"IF(Score!C7>0,Score!C7,\"\")","v":"13:57.00"}]
[{"$f":"IF(Score!B8>0,Score!A8,\"\")","v":7},{"$f":"IF(Score!B8>0,IF(COUNTIF($E$3:$E$5000,E9)<5,\"\",IF(COUNTIF($E$3:E9,E9)>7,\"\",MAX($B$3:B8)+1)),\"\")","v":7},{"$f":"IF(Score!B8>0,Score!B8,\"\")","v":7},{"$f":"IF(Score!B8>0,VLOOKUP(C9,Entrants!$A$2:$E$5000,3,FALSE),\"\")","v":"Bell"},{"$f":"IF(Score!B8>0,VLOOKUP(C9,Entrants!$A$2:$E$5000,2,FALSE),\"\")","v":"M"},{"$f":"IF(Score!B8>0,VLOOKUP(C9,Entrants!$A$2:$E$5000,4,FALSE),\"\")","v":0},{"$f":"IF(Score!C8>0,Score!C8,\"\")","v":"14:02.00"}]
[{"$f":"IF(Score!B9>0,Score!A9,\"\")","v":8},{"$f":"IF(Score!B9>0,IF(COUNTIF($E$3:$E$5000,E10)<5,\"\",IF(COUNTIF($E$3:E10,E10)>7,\"\",MAX($B$3:B9)+1)),\"\")","v":""},{"$f":"IF(Score!B9>0,Score!B9,\"\")","v":8},{"$f":"IF(Score!B9>0,VLOOKUP(C10,Entrants!$A$2:$E$5000,3,FALSE),\"\")","v":"Hall"},{"$f":"IF(Score!B9>0,VLOOKUP(C10,Entrants!$A$2:$E$5000,2,FALSE),\"\")","v":"M"},{"$f":"IF(Score!B9>0,VLOOKUP(C10,Entrants!$A$2:$E$5000,4,FALSE),\"\")","v":0},{"$f":"IF(Score!C9>0,Score!C9,\"\")","v":"14:11.00"}]
[{"$f":"IF(Score!B10>0,Score!A10,\"\")","v":9},{"$f":"IF(Score!B10>0,IF(COUNTIF($E$3:$E$5000,E11)<5,\"\",IF(COUNTIF($E$3:E11,E11)>7,\"\",MAX($B$3:B10)+1)),\"\")","v":""},{"$f":"IF(Score!B10>0,Score!B10,\"\")","v":9},{"$f":"IF(Score!B10>0,VLOOKUP(C11,Entrants!$A$2:$E$5000,3,FALSE),\"\")","v":"Myers"},{"$f":"IF(Score!B10>0,VLOOKUP(C11,Entrants!$A$2:$E$5000,2,FALSE),\"\")","v":"M"},{"$f":"IF(Score!B10>0,VLOOKUP(C11,Entrants!$A$2:$E$5000,4,FALSE),\"\")","v":0},{"$f":"IF(Score!C10>0,Score!C10,\"\")","v":"14:21.00"}]
[{"$f":"IF(Score!B11>0,Score!A11,\"\")","v":10},{"$f":"IF(Score!B11>0,IF(COUNTIF($E$3:$E$5000,E12)<5,\"\",IF(COUNTIF($E$3:E12,E12)>7,\"\",MAX($B$3:B11)+1)),\"\")","v":""},{"$f":"IF(Score!B11>0,Score!B11,\"\")","v":10},{"$f":"IF(Score!B11>0,VLOOKUP(C12,Entrants!$A$2:$E$5000,3,FALSE),\"\")","v":"Balzer"},{"$f":"IF(Score!B11>0,VLOOKUP(C12,Entrants!$A$2:$E$5000,2,FALSE),\"\")","v":"M"},{"$f":"IF(Score!B11>0,VLOOKUP(C12,Entrants!$A$2:$E$5000,4,FALSE),\"\")","v":0},{"$f":"IF(Score!C11>0,Score!C11,\"\")","v":"14:22.00"}]
[{"$f":"IF(Score!B12>0,Score!A12,\"\")","v":11},{"$f":"IF(Score!B12>0,IF(COUNTIF($E$3:$E$5000,E13)<5,\"\",IF(COUNTIF($E$3:E13,E13)>7,\"\",MAX($B$3:B12)+1)),\"\")","v":""},{"$f":"IF(Score!B12>0,Score!B12,\"\")","v":11},{"$f":"IF(Score!B12>0,VLOOKUP(C13,Entrants!$A$2:$E$5000,3,FALSE),\"\")","v":"Anderson"},{"$f":"IF(Score!B12>0,VLOOKUP(C13,Entrants!$A$2:$E$5000,2,FALSE),\"\")","v":"M"},{"$f":"IF(Score!B12>0,VLOOKUP(C13,Entrants!$A$2:$E$5000,4,FALSE),\"\")","v":0},{"$f":"IF(Score!C12>0,Score!C12,\"\")","v":"14:31.00"}]
[{"$f":"IF(Score!B13>0,Score!A13,\"\")","v":12},{"$f":"IF(Score!B13>0,IF(COUNTIF($E$3:$E$5000,E14)<5,\"\",IF(COUNTIF($E$3:E14,E14)>7,\"\",MAX($B$3:B13)+1)),\"\")","v":""},{"$f":"IF(Score!B13>0,Score!B13,\"\")","v":12},{"$f":"IF(Score!B13>0,VLOOKUP(C14,Entrants!$A$2:$E$5000,3,FALSE),\"\")","v":"Hajduk"},{"$f":"IF(Score!B13>0,VLOOKUP(C14,Entrants!$A$2:$E$5000,2,FALSE),\"\")","v":"M"},{"$f":"IF(Score!B13>0,VLOOKUP(C14,Entrants!$A$2:$E$5000,4,FALSE),\"\")","v":0},{"$f":"IF(Score!C13>0,Score!C13,\"\")","v":"14:45.00"}]
[{"$f":"IF(Score!B14>0,Score!A14,\"\")","v":13},{"$f":"IF(Score!B14>0,IF(COUNTIF($E$3:$E$5000,E15)<5,\"\",IF(COUNTIF($E$3:E15,E15)>7,\"\",MAX($B$3:B14)+1)),\"\")","v":8},{"$f":"IF(Score!B14>0,Score!B14,\"\")","v":13},{"$f":"IF(Score!B14>0,VLOOKUP(C15,Entrants!$A$2:$E$5000,3,FALSE),\"\")","v":"Cryer"},{"$f":"IF(Score!B14>0,VLOOKUP(C15,Entrants!$A$2:$E$5000,2,FALSE),\"\")","v":"S"},{"$f":"IF(Score!B14>0,VLOOKUP(C15,Entrants!$A$2:$E$5000,4,FALSE),\"\")","v":0},{"$f":"IF(Score!C14>0,Score!C14,\"\")","v":"14:49.00"}]
[{"$f":"IF(Score!B15>0,Score!A15,\"\")","v":14},{"$f":"IF(Score!B15>0,IF(COUNTIF($E$3:$E$5000,E16)<5,\"\",IF(COUNTIF($E$3:E16,E16)>7,\"\",MAX($B$3:B15)+1)),\"\")","v":""},{"$f":"IF(Score!B15>0,Score!B15,\"\")","v":14},{"$f":"IF(Score!B15>0,VLOOKUP(C16,Entrants!$A$2:$E$5000,3,FALSE),\"\")","v":"Paugys"},{"$f":"IF(Score!B15>0,VLOOKUP(C16,Entrants!$A$2:$E$5000,2,FALSE),\"\")","v":"M"},{"$f":"IF(Score!B15>0,VLOOKUP(C16,Entrants!$A$2:$E$5000,4,FALSE),\"\")","v":0},{"$f":"IF(Score!C15>0,Score!C15,\"\")","v":"14:50.00"}]
[{"$f":"IF(Score!B16>0,Score!A16,\"\")","v":15},{"$f":"IF(Score!B16>0,IF(COUNTIF($E$3:$E$5000,E17)<5,\"\",IF(COUNTIF($E$3:E17,E17)>7,\"\",MAX($B$3:B16)+1)),\"\")","v":""},{"$f":"IF(Score!B16>0,Score!B16,\"\")","v":15},{"$f":"IF(Score!B16>0,VLOOKUP(C17,Entrants!$A$2:$E$5000,3,FALSE),\"\")","v":"Boles"},{"$f":"IF(Score!B16>0,VLOOKUP(C17,Entrants!$A$2:$E$5000,2,FALSE),\"\")","v":"M"},{"$f":"IF(Score!B16>0,VLOOKUP(C17,Entrants!$A$2:$E$5000,4,FALSE),\"\")","v":0},{"$f":"IF(Score!C16>0,Score!C16,\"\")","v":"15:18.00"}]
[{"$f":"IF(Score!B17>0,Score!A17,\"\")","v":16},{"$f":"IF(Score!B17>0,IF(COUNTIF($E$3:$E$5000,E18)<5,\"\",IF(COUNTIF($E$3:E18,E18)>7,\"\",MAX($B$3:B17)+1)),\"\")","v":9},{"$f":"IF(Score!B17>0,Score!B17,\"\")","v":16},{"$f":"IF(Score!B17>0,VLOOKUP(C18,Entrants!$A$2:$E$5000,3,FALSE),\"\")","v":"Miller"},{"$f":"IF(Score!B17>0,VLOOKUP(C18,Entrants!$A$2:$E$5000,2,FALSE),\"\")","v":"S"},{"$f":"IF(Score!B17>0,VLOOKUP(C18,Entrants!$A$2:$E$5000,4,FALSE),\"\")","v":0},{"$f":"IF(Score!C17>0,Score!C17,\"\")","v":"15:26.00"}]
[{"$f":"IF(Score!B18>0,Score!A18,\"\")","v":17},{"$f":"IF(Score!B18>0,IF(COUNTIF($E$3:$E$5000,E19)<5,\"\",IF(COUNTIF($E$3:E19,E19)>7,\"\",MAX($B$3:B18)+1)),\"\")","v":10},{"$f":"IF(Score!B18>0,Score!B18,\"\")","v":17},{"$f":"IF(Score!B18>0,VLOOKUP(C19,Entrants!$A$2:$E$5000,3,FALSE),\"\")","v":"Chaplin"},{"$f":"IF(Score!B18>0,VLOOKUP(C19,Entrants!$A$2:$E$5000,2,FALSE),\"\")","v":"S"},{"$f":"IF(Score!B18>0,VLOOKUP(C19,Entrants!$A$2:$E$5000,4,FALSE),\"\")","v":0},{"$f":"IF(Score!C18>0,Score!C18,\"\")","v":"15:32.00"}]
[{"$f":"IF(Score!B19>0,Score!A19,\"\")","v":18},{"$f":"IF(Score!B19>0,IF(COUNTIF($E$3:$E$5000,E20)<5,\"\",IF(COUNTIF($E$3:E20,E20)>7,\"\",MAX($B$3:B19)+1)),\"\")","v":""},{"$f":"IF(Score!B19>0,Score!B19,\"\")","v":18},{"$f":"IF(Score!B19>0,VLOOKUP(C20,Entrants!$A$2:$E$5000,3,FALSE),\"\")","v":"Su"},{"$f":"IF(Score!B19>0,VLOOKUP(C20,Entrants!$A$2:$E$5000,2,FALSE),\"\")","v":"M"},{"$f":"IF(Score!B19>0,VLOOKUP(C20,Entrants!$A$2:$E$5000,4,FALSE),\"\")","v":0},{"$f":"IF(Score!C19>0,Score!C19,\"\")","v":"15:53.00"}]
[{"$f":"IF(Score!B20>0,Score!A20,\"\")","v":19},{"$f":"IF(Score!B20>0,IF(COUNTIF($E$3:$E$5000,E21)<5,\"\",IF(COUNTIF($E$3:E21,E21)>7,\"\",MAX($B$3:B20)+1)),\"\")","v":""},{"$f":"IF(Score!B20>0,Score!B20,\"\")","v":19},{"$f":"IF(Score!B20>0,VLOOKUP(C21,Entrants!$A$2:$E$5000,3,FALSE),\"\")","v":"Warren"},{"$f":"IF(Score!B20>0,VLOOKUP(C21,Entrants!$A$2:$E$5000,2,FALSE),\"\")","v":"M"},{"$f":"IF(Score!B20>0,VLOOKUP(C21,Entrants!$A$2:$E$5000,4,FALSE),\"\")","v":0},{"$f":"IF(Score!C20>0,Score!C20,\"\")","v":"16:03.00"}]
[{"$f":"IF(Score!B21>0,Score!A21,\"\")","v":20},{"$f":"IF(Score!B21>0,IF(COUNTIF($E$3:$E$5000,E22)<5,\"\",IF(COUNTIF($E$3:E22,E22)>7,\"\",MAX($B$3:B21)+1)),\"\")","v":""},{"$f":"IF(Score!B21>0,Score!B21,\"\")","v":20},{"$f":"IF(Score!B21>0,VLOOKUP(C22,Entrants!$A$2:$E$5000,3,FALSE),\"\")","v":"Torri"},{"$f":"IF(Score!B21>0,VLOOKUP(C22,Entrants!$A$2:$E$5000,2,FALSE),\"\")","v":"M"},{"$f":"IF(Score!B21>0,VLOOKUP(C22,Entrants!$A$2:$E$5000,4,FALSE),\"\")","v":0},{"$f":"IF(Score!C21>0,Score!C21,\"\")","v":"16:31.00"}]
[{"$f":"IF(Score!B22>0,Score!A22,\"\")","v":21},{"$f":"IF(Score!B22>0,IF(COUNTIF($E$3:$E$5000,E23)<5,\"\",IF(COUNTIF($E$3:E23,E23)>7,\"\",MAX($B$3:B22)+1)),\"\")","v":""},{"$f":"IF(Score!B22>0,Score!B22,\"\")","v":21},{"$f":"IF(Score!B22>0,VLOOKUP(C23,Entrants!$A$2:$E$5000,3,FALSE),\"\")","v":"Undesser"},{"$f":"IF(Score!B22>0,VLOOKUP(C23,Entrants!$A$2:$E$5000,2,FALSE),\"\")","v":"M"},{"$f":"IF(Score!B22>0,VLOOKUP(C23,Entrants!$A$2:$E$5000,4,FALSE),\"\")","v":0},{"$f":"IF(Score!C22>0,Score!C22,\"\")","v":"16:33.00"}]
[{"$f":"IF(Score!B23>0,Score!A23,\"\")","v":22},{"$f":"IF(Score!B23>0,IF(COUNTIF($E$3:$E$5000,E24)<5,\"\",IF(COUNTIF($E$3:E24,E24)>7,\"\",MAX($B$3:B23)+1)),\"\")","v":11},{"$f":"IF(Score!B23>0,Score!B23,\"\")","v":22},{"$f":"IF(Score!B23>0,VLOOKUP(C24,Entrants!$A$2:$E$5000,3,FALSE),\"\")","v":"Okapal"},{"$f":"IF(Score!B23>0,VLOOKUP(C24,Entrants!$A$2:$E$5000,2,FALSE),\"\")","v":"S"},{"$f":"IF(Score!B23>0,VLOOKUP(C24,Entrants!$A$2:$E$5000,4,FALSE),\"\")","v":0},{"$f":"IF(Score!C23>0,Score!C23,\"\")","v":"17:12.00"}]
[{"$f":"IF(Score!B24>0,Score!A24,\"\")","v":23},{"$f":"IF(Score!B24>0,IF(COUNTIF($E$3:$E$5000,E25)<5,\"\",IF(COUNTIF($E$3:E25,E25)>7,\"\",MAX($B$3:B24)+1)),\"\")","v":""},{"$f":"IF(Score!B24>0,Score!B24,\"\")","v":23},{"$f":"IF(Score!B24>0,VLOOKUP(C25,Entrants!$A$2:$E$5000,3,FALSE),\"\")","v":"Fawley"},{"$f":"IF(Score!B24>0,VLOOKUP(C25,Entrants!$A$2:$E$5000,2,FALSE),\"\")","v":"M"},{"$f":"IF(Score!B24>0,VLOOKUP(C25,Entrants!$A$2:$E$5000,4,FALSE),\"\")","v":0},{"$f":"IF(Score!C24>0,Score!C24,\"\")","v":"17:44.00"}]
[{"$f":"IF(Score!B25>0,Score!A25,\"\")","v":24},{"$f":"IF(Score!B25>0,IF(COUNTIF($E$3:$E$5000,E26)<5,\"\",IF(COUNTIF($E$3:E26,E26)>7,\"\",MAX($B$3:B25)+1)),\"\")","v":12},{"$f":"IF(Score!B25>0,Score!B25,\"\")","v":24},{"$f":"IF(Score!B25>0,VLOOKUP(C26,Entrants!$A$2:$E$5000,3,FALSE),\"\")","v":"Graszer"},{"$f":"IF(Score!B25>0,VLOOKUP(C26,Entrants!$A$2:$E$5000,2,FALSE),\"\")","v":"S"},{"$f":"IF(Score!B25>0,VLOOKUP(C26,Entrants!$A$2:$E$5000,4,FALSE),\"\")","v":0},{"$f":"IF(Score!C25>0,Score!C25,\"\")","v":"17:53.00"}]
[{"$f":"IF(Score!B26>0,Score!A26,\"\")","v":25},{"$f":"IF(Score!B26>0,IF(COUNTIF($E$3:$E$5000,E27)<5,\"\",IF(COUNTIF($E$3:E27,E27)>7,\"\",MAX($B$3:B26)+1)),\"\")","v":""},{"$f":"IF(Score!B26>0,Score!B26,\"\")","v":25},{"$f":"IF(Score!B26>0,VLOOKUP(C27,Entrants!$A$2:$E$5000,3,FALSE),\"\")","v":"Conroy, J"},{"$f":"IF(Score!B26>0,VLOOKUP(C27,Entrants!$A$2:$E$5000,2,FALSE),\"\")","v":"M"},{"$f":"IF(Score!B26>0,VLOOKUP(C27,Entrants!$A$2:$E$5000,4,FALSE),\"\")","v":0},{"$f":"IF(Score!C26>0,Score!C26,\"\")","v":"17:54.00"}]
[{"$f":"IF(Score!B27>0,Score!A27,\"\")","v":26},{"$f":"IF(Score!B27>0,IF(COUNTIF($E$3:$E$5000,E28)<5,\"\",IF(COUNTIF($E$3:E28,E28)>7,\"\",MAX($B$3:B27)+1)),\"\")","v":""},{"$f":"IF(Score!B27>0,Score!B27,\"\")","v":26},{"$f":"IF(Score!B27>0,VLOOKUP(C28,Entrants!$A$2:$E$5000,3,FALSE),\"\")","v":"Johannessen"},{"$f":"IF(Score!B27>0,VLOOKUP(C28,Entrants!$A$2:$E$5000,2,FALSE),\"\")","v":"M"},{"$f":"IF(Score!B27>0,VLOOKUP(C28,Entrants!$A$2:$E$5000,4,FALSE),\"\")","v":0},{"$f":"IF(Score!C27>0,Score!C27,\"\")","v":"18:16.00"}]
[{"$f":"IF(Score!B28>0,Score!A28,\"\")","v":27},{"$f":"IF(Score!B28>0,IF(COUNTIF($E$3:$E$5000,E29)<5,\"\",IF(COUNTIF($E$3:E29,E29)>7,\"\",MAX($B$3:B28)+1)),\"\")","v":""},{"$f":"IF(Score!B28>0,Score!B28,\"\")","v":27},{"$f":"IF(Score!B28>0,VLOOKUP(C29,Entrants!$A$2:$E$5000,3,FALSE),\"\")","v":"Rhoades"},{"$f":"IF(Score!B28>0,VLOOKUP(C29,Entrants!$A$2:$E$5000,2,FALSE),\"\")","v":"M"},{"$f":"IF(Score!B28>0,VLOOKUP(C29,Entrants!$A$2:$E$5000,4,FALSE),\"\")","v":0},{"$f":"IF(Score!C28>0,Score!C28,\"\")","v":"18:30.00"}]
[{"$f":"IF(Score!B29>0,Score!A29,\"\")","v":28},{"$f":"IF(Score!B29>0,IF(COUNTIF($E$3:$E$5000,E30)<5,\"\",IF(COUNTIF($E$3:E30,E30)>7,\"\",MAX($B$3:B29)+1)),\"\")","v":""},{"$f":"IF(Score!B29>0,Score!B29,\"\")","v":28},{"$f":"IF(Score!B29>0,VLOOKUP(C30,Entrants!$A$2:$E$5000,3,FALSE),\"\")","v":"Conroy, S"},{"$f":"IF(Score!B29>0,VLOOKUP(C30,Entrants!$A$2:$E$5000,2,FALSE),\"\")","v":"M"},{"$f":"IF(Score!B29>0,VLOOKUP(C30,Entrants!$A$2:$E$5000,4,FALSE),\"\")","v":0},{"$f":"IF(Score!C29>0,Score!C29,\"\")","v":"18:32.00"}]
[{"$f":"IF(Score!B30>0,Score!A30,\"\")","v":29},{"$f":"IF(Score!B30>0,IF(COUNTIF($E$3:$E$5000,E31)<5,\"\",IF(COUNTIF($E$3:E31,E31)>7,\"\",MAX($B$3:B30)+1)),\"\")","v":""},{"$f":"IF(Score!B30>0,Score!B30,\"\")","v":29},{"$f":"IF(Score!B30>0,VLOOKUP(C31,Entrants!$A$2:$E$5000,3,FALSE),\"\")","v":"Watson"},{"$f":"IF(Score!B30>0,VLOOKUP(C31,Entrants!$A$2:$E$5000,2,FALSE),\"\")","v":"M"},{"$f":"IF(Score!B30>0,VLOOKUP(C31,Entrants!$A$2:$E$5000,4,FALSE),\"\")","v":0},{"$f":"IF(Score!C30>0,Score!C30,\"\")","v":"19:33.00"}]
[{"$f":"IF(Score!B31>0,Score!A31,\"\")","v":30},{"$f":"IF(Score!B31>0,IF(COUNTIF($E$3:$E$5000,E32)<5,\"\",IF(COUNTIF($E$3:E32,E32)>7,\"\",MAX($B$3:B31)+1)),\"\")","v":""},{"$f":"IF(Score!B31>0,Score!B31,\"\")","v":30},{"$f":"IF(Score!B31>0,VLOOKUP(C32,Entrants!$A$2:$E$5000,3,FALSE),\"\")","v":"Smith"},{"$f":"IF(Score!B31>0,VLOOKUP(C32,Entrants!$A$2:$E$5000,2,FALSE),\"\")","v":"M"},{"$f":"IF(Score!B31>0,VLOOKUP(C32,Entrants!$A$2:$E$5000,4,FALSE),\"\")","v":0},{"$f":"IF(Score!C31>0,Score!C31,\"\")","v":"20:00.00"}]
[{"$f":"IF(Score!B32>0,Score!A32,\"\")","v":31},{"$f":"IF(Score!B32>0,IF(COUNTIF($E$3:$E$5000,E33)<5,\"\",IF(COUNTIF($E$3:E33,E33)>7,\"\",MAX($B$3:B32)+1)),\"\")","v":""},{"$f":"IF(Score!B32>0,Score!B32,\"\")","v":31},{"$f":"IF(Score!B32>0,VLOOKUP(C33,Entrants!$A$2:$E$5000,3,FALSE),\"\")","v":"Shrum"},{"$f":"IF(Score!B32>0,VLOOKUP(C33,Entrants!$A$2:$E$5000,2,FALSE),\"\")","v":"M"},{"$f":"IF(Score!B32>0,VLOOKUP(C33,Entrants!$A$2:$E$5000,4,FALSE),\"\")","v":0},{"$f":"IF(Score!C32>0,Score!C32,\"\")","v":"20:57.00"}]
[{"$f":"IF(Score!B33>0,Score!A33,\"\")","v":""},{"$f":"IF(Score!B33>0,IF(COUNTIF($E$3:$E$5000,E34)<5,\"\",IF(COUNTIF($E$3:E34,E34)>7,\"\",MAX($B$3:B33)+1)),\"\")","v":""},{"$f":"IF(Score!B33>0,Score!B33,\"\")","v":""},{"$f":"IF(Score!B33>0,VLOOKUP(C34,Entrants!$A$2:$E$5000,3,FALSE),\"\")","v":""},{"$f":"IF(Score!B33>0,VLOOKUP(C34,Entrants!$A$2:$E$5000,2,FALSE),\"\")","v":""},{"$f":"IF(Score!B33>0,VLOOKUP(C34,Entrants!$A$2:$E$5000,4,FALSE),\"\")","v":""},{"$f":"IF(Score!C33>0,Score!C33,\"\")","v":""}]
[{"$f":"IF(Score!B34>0,Score!A34,\"\")","v":""},{"$f":"IF(Score!B34>0,IF(COUNTIF($E$3:$E$5000,E35)<5,\"\",IF(COUNTIF($E$3:E35,E35)>7,\"\",MAX($B$3:B34)+1)),\"\")","v":""},{"$f":"IF(Score!B34>0,Score!B34,\"\")","v":""},{"$f":"IF(Score!B34>0,VLOOKUP(C35,Entrants!$A$2:$E$5000,3,FALSE),\"\")","v":""},{"$f":"IF(Score!B34>0,VLOOKUP(C35,Entrants!$A$2:$E$5000,2,FALSE),\"\")","v":""},{"$f":"IF(Score!B34>0,VLOOKUP(C35,Entrants!$A$2:$E$5000,4,FALSE),\"\")","v":""},{"$f":"IF(Score!C34>0,Score!C34,\"\")","v":""}]
[{"$f":"IF(Score!B35>0,Score!A35,\"\")","v":""},{"$f":"IF(Score!B35>0,IF(COUNTIF($E$3:$E$5000,E36)<5,\"\",IF(COUNTIF($E$3:E36,E36)>7,\"\",MAX($B$3:B35)+1)),\"\")","v":""},{"$f":"IF(Score!B35>0,Score!B35,\"\")","v":""},{"$f":"IF(Score!B35>0,VLOOKUP(C36,Entrants!$A$2:$E$5000,3,FALSE),\"\")","v":""},{"$f":"IF(Score!B35>0,VLOOKUP(C36,Entrants!$A$2:$E$5000,2,FALSE),\"\")","v":""},{"$f":"IF(Score!B35>0,VLOOKUP(C36,Entrants!$A$2:$E$5000,4,FALSE),\"\")","v":""},{"$f":"IF(Score!C35>0,Score!C35,\"\")","v":""}]
[{"$f":"IF(Score!B36>0,Score!A36,\"\")","v":""},{"$f":"IF(Score!B36>0,IF(COUNTIF($E$3:$E$5000,E37)<5,\"\",IF(COUNTIF($E$3:E37,E37)>7,\"\",MAX($B$3:B36)+1)),\"\")","v":""},{"$f":"IF(Score!B36>0,Score!B36,\"\")","v":""},{"$f":"IF(Score!B36>0,VLOOKUP(C37,Entrants!$A$2:$E$5000,3,FALSE),\"\")","v":""},{"$f":"IF(Score!B36>0,VLOOKUP(C37,Entrants!$A$2:$E$5000,2,FALSE),\"\")","v":""},{"$f":"IF(Score!B36>0,VLOOKUP(C37,Entrants!$A$2:$E$5000,4,FALSE),\"\")","v":""},{"$f":"IF(Score!C36>0,Score!C36,\"\")","v":""}]
[{"$f":"IF(Score!B37>0,Score!A37,\"\")","v":""},{"$f":"IF(Score!B37>0,IF(COUNTIF($E$3:$E$5000,E38)<5,\"\",IF(COUNTIF($E$3:E38,E38)>7,\"\",MAX($B$3:B37)+1)),\"\")","v":""},{"$f":"IF(Score!B37>0,Score!B37,\"\")","v":""},{"$f":"IF(Score!B37>0,VLOOKUP(C38,Entrants!$A$2:$E$5000,3,FALSE),\"\")","v":""},{"$f":"IF(Score!B37>0,VLOOKUP(C38,Entrants!$A$2:$E$5000,2,FALSE),\"\")","v":""},{"$f":"IF(Score!B37>0,VLOOKUP(C38,Entrants!$A$2:$E$5000,4,FALSE),\"\")","v":""},{"$f":"IF(Score!C37>0,Score!C37,\"\")","v":""}]
[{"$f":"IF(Score!B38>0,Score!A38,\"\")","v":""},{"$f":"IF(Score!B38>0,IF(COUNTIF($E$3:$E$5000,E39)<5,\"\",IF(COUNTIF($E$3:E39,E39)>7,\"\",MAX($B$3:B38)+1)),\"\")","v":""},{"$f":"IF(Score!B38>0,Score!B38,\"\")","v":""},{"$f":"IF(Score!B38>0,VLOOKUP(C39,Entrants!$A$2:$E$5000,3,FALSE),\"\")","v":""},{"$f":"IF(Score!B38>0,VLOOKUP(C39,Entrants!$A$2:$E$5000,2,FALSE),\"\")","v":""},{"$f":"IF(Score!B38>0,VLOOKUP(C39,Entrants!$A$2:$E$5000,4,FALSE),\"\")","v":""},{"$f":"IF(Score!C38>0,Score!C38,\"\")","v":""}]
[{"$f":"IF(Score!B39>0,Score!A39,\"\")","v":""},{"$f":"IF(Score!B39>0,IF(COUNTIF($E$3:$E$5000,E40)<5,\"\",IF(COUNTIF($E$3:E40,E40)>7,\"\",MAX($B$3:B39)+1)),\"\")","v":""},{"$f":"IF(Score!B39>0,Score!B39,\"\")","v":""},{"$f":"IF(Score!B39>0,VLOOKUP(C40,Entrants!$A$2:$E$5000,3,FALSE),\"\")","v":""},{"$f":"IF(Score!B39>0,VLOOKUP(C40,Entrants!$A$2:$E$5000,2,FALSE),\"\")","v":""},{"$f":"IF(Score!B39>0,VLOOKUP(C40,Entrants!$A$2:$E$5000,4,FALSE),\"\")","v":""},{"$f":"IF(Score!C39>0,Score!C39,\"\")","v":""}]
[{"$f":"IF(Score!B40>0,Score!A40,\"\")","v":""},{"$f":"IF(Score!B40>0,IF(COUNTIF($E$3:$E$5000,E41)<5,\"\",IF(COUNTIF($E$3:E41,E41)>7,\"\",MAX($B$3:B40)+1)),\"\")","v":""},{"$f":"IF(Score!B40>0,Score!B40,\"\")","v":""},{"$f":"IF(Score!B40>0,VLOOKUP(C41,Entrants!$A$2:$E$5000,3,FALSE),\"\")","v":""},{"$f":"IF(Score!B40>0,VLOOKUP(C41,Entrants!$A$2:$E$5000,2,FALSE),\"\")","v":""},{"$f":"IF(Score!B40>0,VLOOKUP(C41,Entrants!$A$2:$E$5000,4,FALSE),\"\")","v":""},{"$f":"IF(Score!C40>0,Score!C40,\"\")","v":""}]
[{"$f":"IF(Score!B41>0,Score!A41,\"\")","v":""},{"$f":"IF(Score!B41>0,IF(COUNTIF($E$3:$E$5000,E42)<5,\"\",IF(COUNTIF($E$3:E42,E42)>7,\"\",MAX($B$3:B41)+1)),\"\")","v":""},{"$f":"IF(Score!B41>0,Score!B41,\"\")","v":""},{"$f":"IF(Score!B41>0,VLOOKUP(C42,Entrants!$A$2:$E$5000,3,FALSE),\"\")","v":""},{"$f":"IF(Score!B41>0,VLOOKUP(C42,Entrants!$A$2:$E$5000,2,FALSE),\"\")","v":""},{"$f":"IF(Score!B41>0,VLOOKUP(C42,Entrants!$A$2:$E$5000,4,FALSE),\"\")","v":""},{"$f":"IF(Score!C41>0,Score!C41,\"\")","v":""}]
[{"$f":"IF(Score!B42>0,Score!A42,\"\")","v":""},{"$f":"IF(Score!B42>0,IF(COUNTIF($E$3:$E$5000,E43)<5,\"\",IF(COUNTIF($E$3:E43,E43)>7,\"\",MAX($B$3:B42)+1)),\"\")","v":""},{"$f":"IF(Score!B42>0,Score!B42,\"\")","v":""},{"$f":"IF(Score!B42>0,VLOOKUP(C43,Entrants!$A$2:$E$5000,3,FALSE),\"\")","v":""},{"$f":"IF(Score!B42>0,VLOOKUP(C43,Entrants!$A$2:$E$5000,2,FALSE),\"\")","v":""},{"$f":"IF(Score!B42>0,VLOOKUP(C43,Entrants!$A$2:$E$5000,4,FALSE),\"\")","v":""},{"$f":"IF(Score!C42>0,Score!C42,\"\")","v":""}]
[{"$f":"IF(Score!B43>0,Score!A43,\"\")","v":""},{"$f":"IF(Score!B43>0,IF(COUNTIF($E$3:$E$5000,E44)<5,\"\",IF(COUNTIF($E$3:E44,E44)>7,\"\",MAX($B$3:B43)+1)),\"\")","v":""},{"$f":"IF(Score!B43>0,Score!B43,\"\")","v":""},{"$f":"IF(Score!B43>0,VLOOKUP(C44,Entrants!$A$2:$E$5000,3,FALSE),\"\")","v":""},{"$f":"IF(Score!B43>0,VLOOKUP(C44,Entrants!$A$2:$E$5000,2,FALSE),\"\")","v":""},{"$f":"IF(Score!B43>0,VLOOKUP(C44,Entrants!$A$2:$E$5000,4,FALSE),\"\")","v":""},{"$f":"IF(Score!C43>0,Score!C43,\"\")","v":""}]
[{"$f":"IF(Score!B44>0,Score!A44,\"\")","v":""},{"$f":"IF(Score!B44>0,IF(COUNTIF($E$3:$E$5000,E45)<5,\"\",IF(COUNTIF($E$3:E45,E45)>7,\"\",MAX($B$3:B44)+1)),\"\")","v":""},{"$f":"IF(Score!B44>0,Score!B44,\"\")","v":""},{"$f":"IF(Score!B44>0,VLOOKUP(C45,Entrants!$A$2:$E$5000,3,FALSE),\"\")","v":""},{"$f":"IF(Score!B44>0,VLOOKUP(C45,Entrants!$A$2:$E$5000,2,FALSE),\"\")","v":""},{"$f":"IF(Score!B44>0,VLOOKUP(C45,Entrants!$A$2:$E$5000,4,FALSE),\"\")","v":""},{"$f":"IF(Score!C44>0,Score!C44,\"\")","v":""}]
[{"$f":"IF(Score!B45>0,Score!A45,\"\")","v":""},{"$f":"IF(Score!B45>0,IF(COUNTIF($E$3:$E$5000,E46)<5,\"\",IF(COUNTIF($E$3:E46,E46)>7,\"\",MAX($B$3:B45)+1)),\"\")","v":""},{"$f":"IF(Score!B45>0,Score!B45,\"\")","v":""},{"$f":"IF(Score!B45>0,VLOOKUP(C46,Entrants!$A$2:$E$5000,3,FALSE),\"\")","v":""},{"$f":"IF(Score!B45>0,VLOOKUP(C46,Entrants!$A$2:$E$5000,2,FALSE),\"\")","v":""},{"$f":"IF(Score!B45>0,VLOOKUP(C46,Entrants!$A$2:$E$5000,4,FALSE),\"\")","v":""},{"$f":"IF(Score!C45>0,Score!C45,\"\")","v":""}]
[{"$f":"IF(Score!B46>0,Score!A46,\"\")","v":""},{"$f":"IF(Score!B46>0,IF(COUNTIF($E$3:$E$5000,E47)<5,\"\",IF(COUNTIF($E$3:E47,E47)>7,\"\",MAX($B$3:B46)+1)),\"\")","v":""},{"$f":"IF(Score!B46>0,Score!B46,\"\")","v":""},{"$f":"IF(Score!B46>0,VLOOKUP(C47,Entrants!$A$2:$E$5000,3,FALSE),\"\")","v":""},{"$f":"IF(Score!B46>0,VLOOKUP(C47,Entrants!$A$2:$E$5000,2,FALSE),\"\")","v":""},{"$f":"IF(Score!B46>0,VLOOKUP(C47,Entrants!$A$2:$E$5000,4,FALSE),\"\")","v":""},{"$f":"IF(Score!C46>0,Score!C46,\"\")","v":""}]
[{"$f":"IF(Score!B47>0,Score!A47,\"\")","v":""},{"$f":"IF(Score!B47>0,IF(COUNTIF($E$3:$E$5000,E48)<5,\"\",IF(COUNTIF($E$3:E48,E48)>7,\"\",MAX($B$3:B47)+1)),\"\")","v":""},{"$f":"IF(Score!B47>0,Score!B47,\"\")","v":""},{"$f":"IF(Score!B47>0,VLOOKUP(C48,Entrants!$A$2:$E$5000,3,FALSE),\"\")","v":""},{"$f":"IF(Score!B47>0,VLOOKUP(C48,Entrants!$A$2:$E$5000,2,FALSE),\"\")","v":""},{"$f":"IF(Score!B47>0,VLOOKUP(C48,Entrants!$A$2:$E$5000,4,FALSE),\"\")","v":""},{"$f":"IF(Score!C47>0,Score!C47,\"\")","v":""}]
[{"$f":"IF(Score!B48>0,Score!A48,\"\")","v":""},{"$f":"IF(Score!B48>0,IF(COUNTIF($E$3:$E$5000,E49)<5,\"\",IF(COUNTIF($E$3:E49,E49)>7,\"\",MAX($B$3:B48)+1)),\"\")","v":""},{"$f":"IF(Score!B48>0,Score!B48,\"\")","v":""},{"$f":"IF(Score!B48>0,VLOOKUP(C49,Entrants!$A$2:$E$5000,3,FALSE),\"\")","v":""},{"$f":"IF(Score!B48>0,VLOOKUP(C49,Entrants!$A$2:$E$5000,2,FALSE),\"\")","v":""},{"$f":"IF(Score!B48>0,VLOOKUP(C49,Entrants!$A$2:$E$5000,4,FALSE),\"\")","v":""},{"$f":"IF(Score!C48>0,Score!C48,\"\")","v":""}]
[{"$f":"IF(Score!B49>0,Score!A49,\"\")","v":""},{"$f":"IF(Score!B49>0,IF(COUNTIF($E$3:$E$5000,E50)<5,\"\",IF(COUNTIF($E$3:E50,E50)>7,\"\",MAX($B$3:B49)+1)),\"\")","v":""},{"$f":"IF(Score!B49>0,Score!B49,\"\")","v":""},{"$f":"IF(Score!B49>0,VLOOKUP(C50,Entrants!$A$2:$E$5000,3,FALSE),\"\")","v":""},{"$f":"IF(Score!B49>0,VLOOKUP(C50,Entrants!$A$2:$E$5000,2,FALSE),\"\")","v":""},{"$f":"IF(Score!B49>0,VLOOKUP(C50,Entrants!$A$2:$E$5000,4,FALSE),\"\")","v":""},{"$f":"IF(Score!C49>0,Score!C49,\"\")","v":""}]
[{"$f":"IF(Score!B50>0,Score!A50,\"\")","v":""},{"$f":"IF(Score!B50>0,IF(COUNTIF($E$3:$E$5000,E51)<5,\"\",IF(COUNTIF($E$3:E51,E51)>7,\"\",MAX($B$3:B50)+1)),\"\")","v":""},{"$f":"IF(Score!B50>0,Score!B50,\"\")","v":""},{"$f":"IF(Score!B50>0,VLOOKUP(C51,Entrants!$A$2:$E$5000,3,FALSE),\"\")","v":""},{"$f":"IF(Score!B50>0,VLOOKUP(C51,Entrants!$A$2:$E$5000,2,FALSE),\"\")","v":""},{"$f":"IF(Score!B50>0,VLOOKUP(C51,Entrants!$A$2:$E$5000,4,FALSE),\"\")","v":""},{"$f":"IF(Score!C50>0,Score!C50,\"\")","v":""}]
[{"$f":"IF(Score!B51>0,Score!A51,\"\")","v":""},{"$f":"IF(Score!B51>0,IF(COUNTIF($E$3:$E$5000,E52)<5,\"\",IF(COUNTIF($E$3:E52,E52)>7,\"\",MAX($B$3:B51)+1)),\"\")","v":""},{"$f":"IF(Score!B51>0,Score!B51,\"\")","v":""},{"$f":"IF(Score!B51>0,VLOOKUP(C52,Entrants!$A$2:$E$5000,3,FALSE),\"\")","v":""},{"$f":"IF(Score!B51>0,VLOOKUP(C52,Entrants!$A$2:$E$5000,2,FALSE),\"\")","v":""},{"$f":"IF(Score!B51>0,VLOOKUP(C52,Entrants!$A$2:$E$5000,4,FALSE),\"\")","v":""},{"$f":"IF(Score!C51>0,Score!C51,\"\")","v":""}]
[{"$f":"IF(Score!B52>0,Score!A52,\"\")","v":""},{"$f":"IF(Score!B52>0,IF(COUNTIF($E$3:$E$5000,E53)<5,\"\",IF(COUNTIF($E$3:E53,E53)>7,\"\",MAX($B$3:B52)+1)),\"\")","v":""},{"$f":"IF(Score!B52>0,Score!B52,\"\")","v":""},{"$f":"IF(Score!B52>0,VLOOKUP(C53,Entrants!$A$2:$E$5000,3,FALSE),\"\")","v":""},{"$f":"IF(Score!B52>0,VLOOKUP(C53,Entrants!$A$2:$E$5000,2,FALSE),\"\")","v":""},{"$f":"IF(Score!B52>0,VLOOKUP(C53,Entrants!$A$2:$E$5000,4,FALSE),\"\")","v":""},{"$f":"IF(Score!C52>0,Score!C52,\"\")","v":""}]
[{"$f":"IF(Score!B53>0,Score!A53,\"\")","v":""},{"$f":"IF(Score!B53>0,IF(COUNTIF($E$3:$E$5000,E54)<5,\"\",IF(COUNTIF($E$3:E54,E54)>7,\"\",MAX($B$3:B53)+1)),\"\")","v":""},{"$f":"IF(Score!B53>0,Score!B53,\"\")","v":""},{"$f":"IF(Score!B53>0,VLOOKUP(C54,Entrants!$A$2:$E$5000,3,FALSE),\"\")","v":""},{"$f":"IF(Score!B53>0,VLOOKUP(C54,Entrants!$A$2:$E$5000,2,FALSE),\"\")","v":""},{"$f":"IF(Score!B53>0,VLOOKUP(C54,Entrants!$A$2:$E$5000,4,FALSE),\"\")","v":""},{"$f":"IF(Score!C53>0,Score!C53,\"\")","v":""}]
[{"$f":"IF(Score!B54>0,Score!A54,\"\")","v":""},{"$f":"IF(Score!B54>0,IF(COUNTIF($E$3:$E$5000,E55)<5,\"\",IF(COUNTIF($E$3:E55,E55)>7,\"\",MAX($B$3:B54)+1)),\"\")","v":""},{"$f":"IF(Score!B54>0,Score!B54,\"\")","v":""},{"$f":"IF(Score!B54>0,VLOOKUP(C55,Entrants!$A$2:$E$5000,3,FALSE),\"\")","v":""},{"$f":"IF(Score!B54>0,VLOOKUP(C55,Entrants!$A$2:$E$5000,2,FALSE),\"\")","v":""},{"$f":"IF(Score!B54>0,VLOOKUP(C55,Entrants!$A$2:$E$5000,4,FALSE),\"\")","v":""},{"$f":"IF(Score!C54>0,Score!C54,\"\")","v":""}]
[{"$f":"IF(Score!B55>0,Score!A55,\"\")","v":""},{"$f":"IF(Score!B55>0,IF(COUNTIF($E$3:$E$5000,E56)<5,\"\",IF(COUNTIF($E$3:E56,E56)>7,\"\",MAX($B$3:B55)+1)),\"\")","v":""},{"$f":"IF(Score!B55>0,Score!B55,\"\")","v":""},{"$f":"IF(Score!B55>0,VLOOKUP(C56,Entrants!$A$2:$E$5000,3,FALSE),\"\")","v":""},{"$f":"IF(Score!B55>0,VLOOKUP(C56,Entrants!$A$2:$E$5000,2,FALSE),\"\")","v":""},{"$f":"IF(Score!B55>0,VLOOKUP(C56,Entrants!$A$2:$E$5000,4,FALSE),\"\")","v":""},{"$f":"IF(Score!C55>0,Score!C55,\"\")","v":""}]
[{"$f":"IF(Score!B56>0,Score!A56,\"\")","v":""},{"$f":"IF(Score!B56>0,IF(COUNTIF($E$3:$E$5000,E57)<5,\"\",IF(COUNTIF($E$3:E57,E57)>7,\"\",MAX($B$3:B56)+1)),\"\")","v":""},{"$f":"IF(Score!B56>0,Score!B56,\"\")","v":""},{"$f":"IF(Score!B56>0,VLOOKUP(C57,Entrants!$A$2:$E$5000,3,FALSE),\"\")","v":""},{"$f":"IF(Score!B56>0,VLOOKUP(C57,Entrants!$A$2:$E$5000,2,FALSE),\"\")","v":""},{"$f":"IF(Score!B56>0,VLOOKUP(C57,Entrants!$A$2:$E$5000,4,FALSE),\"\")","v":""},{"$f":"IF(Score!C56>0,Score!C56,\"\")","v":""}]
[{"$f":"IF(Score!B57>0,Score!A57,\"\")","v":""},{"$f":"IF(Score!B57>0,IF(COUNTIF($E$3:$E$5000,E58)<5,\"\",IF(COUNTIF($E$3:E58,E58)>7,\"\",MAX($B$3:B57)+1)),\"\")","v":""},{"$f":"IF(Score!B57>0,Score!B57,\"\")","v":""},{"$f":"IF(Score!B57>0,VLOOKUP(C58,Entrants!$A$2:$E$5000,3,FALSE),\"\")","v":""},{"$f":"IF(Score!B57>0,VLOOKUP(C58,Entrants!$A$2:$E$5000,2,FALSE),\"\")","v":""},{"$f":"IF(Score!B57>0,VLOOKUP(C58,Entrants!$A$2:$E$5000,4,FALSE),\"\")","v":""},{"$f":"IF(Score!C57>0,Score!C57,\"\")","v":""}]
[{"$f":"IF(Score!B58>0,Score!A58,\"\")","v":""},{"$f":"IF(Score!B58>0,IF(COUNTIF($E$3:$E$5000,E59)<5,\"\",IF(COUNTIF($E$3:E59,E59)>7,\"\",MAX($B$3:B58)+1)),\"\")","v":""},{"$f":"IF(Score!B58>0,Score!B58,\"\")","v":""},{"$f":"IF(Score!B58>0,VLOOKUP(C59,Entrants!$A$2:$E$5000,3,FALSE),\"\")","v":""},{"$f":"IF(Score!B58>0,VLOOKUP(C59,Entrants!$A$2:$E$5000,2,FALSE),\"\")","v":""},{"$f":"IF(Score!B58>0,VLOOKUP(C59,Entrants!$A$2:$E$5000,4,FALSE),\"\")","v":""},{"$f":"IF(Score!C58>0,Score!C58,\"\")","v":""}]
[{"$f":"IF(Score!B59>0,Score!A59,\"\")","v":""},{"$f":"IF(Score!B59>0,IF(COUNTIF($E$3:$E$5000,E60)<5,\"\",IF(COUNTIF($E$3:E60,E60)>7,\"\",MAX($B$3:B59)+1)),\"\")","v":""},{"$f":"IF(Score!B59>0,Score!B59,\"\")","v":""},{"$f":"IF(Score!B59>0,VLOOKUP(C60,Entrants!$A$2:$E$5000,3,FALSE),\"\")","v":""},{"$f":"IF(Score!B59>0,VLOOKUP(C60,Entrants!$A$2:$E$5000,2,FALSE),\"\")","v":""},{"$f":"IF(Score!B59>0,VLOOKUP(C60,Entrants!$A$2:$E$5000,4,FALSE),\"\")","v":""},{"$f":"IF(Score!C59>0,Score!C59,\"\")","v":""}]
[{"$f":"IF(Score!B60>0,Score!A60,\"\")","v":""},{"$f":"IF(Score!B60>0,IF(COUNTIF($E$3:$E$5000,E61)<5,\"\",IF(COUNTIF($E$3:E61,E61)>7,\"\",MAX($B$3:B60)+1)),\"\")","v":""},{"$f":"IF(Score!B60>0,Score!B60,\"\")","v":""},{"$f":"IF(Score!B60>0,VLOOKUP(C61,Entrants!$A$2:$E$5000,3,FALSE),\"\")","v":""},{"$f":"IF(Score!B60>0,VLOOKUP(C61,Entrants!$A$2:$E$5000,2,FALSE),\"\")","v":""},{"$f":"IF(Score!B60>0,VLOOKUP(C61,Entrants!$A$2:$E$5000,4,FALSE),\"\")","v":""},{"$f":"IF(Score!C60>0,Score!C60,\"\")","v":""}]
[{"$f":"IF(Score!B61>0,Score!A61,\"\")","v":""},{"$f":"IF(Score!B61>0,IF(COUNTIF($E$3:$E$5000,E62)<5,\"\",IF(COUNTIF($E$3:E62,E62)>7,\"\",MAX($B$3:B61)+1)),\"\")","v":""},{"$f":"IF(Score!B61>0,Score!B61,\"\")","v":""},{"$f":"IF(Score!B61>0,VLOOKUP(C62,Entrants!$A$2:$E$5000,3,FALSE),\"\")","v":""},{"$f":"IF(Score!B61>0,VLOOKUP(C62,Entrants!$A$2:$E$5000,2,FALSE),\"\")","v":""},{"$f":"IF(Score!B61>0,VLOOKUP(C62,Entrants!$A$2:$E$5000,4,FALSE),\"\")","v":""},{"$f":"IF(Score!C61>0,Score!C61,\"\")","v":""}]
[{"$f":"IF(Score!B62>0,Score!A62,\"\")","v":""},{"$f":"IF(Score!B62>0,IF(COUNTIF($E$3:$E$5000,E63)<5,\"\",IF(COUNTIF($E$3:E63,E63)>7,\"\",MAX($B$3:B62)+1)),\"\")","v":""},{"$f":"IF(Score!B62>0,Score!B62,\"\")","v":""},{"$f":"IF(Score!B62>0,VLOOKUP(C63,Entrants!$A$2:$E$5000,3,FALSE),\"\")","v":""},{"$f":"IF(Score!B62>0,VLOOKUP(C63,Entrants!$A$2:$E$5000,2,FALSE),\"\")","v":""},{"$f":"IF(Score!B62>0,VLOOKUP(C63,Entrants!$A$2:$E$5000,4,FALSE),\"\")","v":""},{"$f":"IF(Score!C62>0,Score!C62,\"\")","v":""}]
[{"$f":"IF(Score!B63>0,Score!A63,\"\")","v":""},{"$f":"IF(Score!B63>0,IF(COUNTIF($E$3:$E$5000,E64)<5,\"\",IF(COUNTIF($E$3:E64,E64)>7,\"\",MAX($B$3:B63)+1)),\"\")","v":""},{"$f":"IF(Score!B63>0,Score!B63,\"\")","v":""},{"$f":"IF(Score!B63>0,VLOOKUP(C64,Entrants!$A$2:$E$5000,3,FALSE),\"\")","v":""},{"$f":"IF(Score!B63>0,VLOOKUP(C64,Entrants!$A$2:$E$5000,2,FALSE),\"\")","v":""},{"$f":"IF(Score!B63>0,VLOOKUP(C64,Entrants!$A$2:$E$5000,4,FALSE),\"\")","v":""},{"$f":"IF(Score!C63>0,Score!C63,\"\")","v":""}]
[{"$f":"IF(Score!B64>0,Score!A64,\"\")","v":""},{"$f":"IF(Score!B64>0,IF(COUNTIF($E$3:$E$5000,E65)<5,\"\",IF(COUNTIF($E$3:E65,E65)>7,\"\",MAX($B$3:B64)+1)),\"\")","v":""},{"$f":"IF(Score!B64>0,Score!B64,\"\")","v":""},{"$f":"IF(Score!B64>0,VLOOKUP(C65,Entrants!$A$2:$E$5000,3,FALSE),\"\")","v":""},{"$f":"IF(Score!B64>0,VLOOKUP(C65,Entrants!$A$2:$E$5000,2,FALSE),\"\")","v":""},{"$f":"IF(Score!B64>0,VLOOKUP(C65,Entrants!$A$2:$E$5000,4,FALSE),\"\")","v":""},{"$f":"IF(Score!C64>0,Score!C64,\"\")","v":""}]
[{"$f":"IF(Score!B65>0,Score!A65,\"\")","v":""},{"$f":"IF(Score!B65>0,IF(COUNTIF($E$3:E66,E66)>7,\"\",MAX($B$3:B65)+1),\"\")","v":""},{"$f":"IF(Score!B65>0,Score!B65,\"\")","v":""},{"$f":"IF(Score!B65>0,VLOOKUP(C66,Entrants!$A$2:$E$5000,3,FALSE),\"\")","v":""},{"$f":"IF(Score!B65>0,VLOOKUP(C66,Entrants!$A$2:$E$5000,2,FALSE),\"\")","v":""},{"$f":"IF(Score!B65>0,VLOOKUP(C66,Entrants!$A$2:$E$5000,4,FALSE),\"\")","v":""},{"$f":"IF(Score!C65>0,Score!C65,\"\")","v":""}]
[{"$f":"IF(Score!B66>0,Score!A66,\"\")","v":""},{"$f":"IF(Score!B66>0,IF(COUNTIF($E$3:E67,E67)>7,\"\",MAX($B$3:B66)+1),\"\")","v":""},{"$f":"IF(Score!B66>0,Score!B66,\"\")","v":""},{"$f":"IF(Score!B66>0,VLOOKUP(C67,Entrants!$A$2:$E$5000,3,FALSE),\"\")","v":""},{"$f":"IF(Score!B66>0,VLOOKUP(C67,Entrants!$A$2:$E$5000,2,FALSE),\"\")","v":""},{"$f":"IF(Score!B66>0,VLOOKUP(C67,Entrants!$A$2:$E$5000,4,FALSE),\"\")","v":""},{"$f":"IF(Score!C66>0,Score!C66,\"\")","v":""}]
[{"$f":"IF(Score!B67>0,Score!A67,\"\")","v":""},{"$f":"IF(Score!B67>0,IF(COUNTIF($E$3:E68,E68)>7,\"\",MAX($B$3:B67)+1),\"\")","v":""},{"$f":"IF(Score!B67>0,Score!B67,\"\")","v":""},{"$f":"IF(Score!B67>0,VLOOKUP(C68,Entrants!$A$2:$E$5000,3,FALSE),\"\")","v":""},{"$f":"IF(Score!B67>0,VLOOKUP(C68,Entrants!$A$2:$E$5000,2,FALSE),\"\")","v":""},{"$f":"IF(Score!B67>0,VLOOKUP(C68,Entrants!$A$2:$E$5000,4,FALSE),\"\")","v":""},{"$f":"IF(Score!C67>0,Score!C67,\"\")","v":""}]
[{"$f":"IF(Score!B68>0,Score!A68,\"\")","v":""},{"$f":"IF(Score!B68>0,IF(COUNTIF($E$3:E69,E69)>7,\"\",MAX($B$3:B68)+1),\"\")","v":""},{"$f":"IF(Score!B68>0,Score!B68,\"\")","v":""},{"$f":"IF(Score!B68>0,VLOOKUP(C69,Entrants!$A$2:$E$5000,3,FALSE),\"\")","v":""},{"$f":"IF(Score!B68>0,VLOOKUP(C69,Entrants!$A$2:$E$5000,2,FALSE),\"\")","v":""},{"$f":"IF(Score!B68>0,VLOOKUP(C69,Entrants!$A$2:$E$5000,4,FALSE),\"\")","v":""},{"$f":"IF(Score!C68>0,Score!C68,\"\")","v":""}]
[{"$f":"IF(Score!B69>0,Score!A69,\"\")","v":""},{"$f":"IF(Score!B69>0,IF(COUNTIF($E$3:E70,E70)>7,\"\",MAX($B$3:B69)+1),\"\")","v":""},{"$f":"IF(Score!B69>0,Score!B69,\"\")","v":""},{"$f":"IF(Score!B69>0,VLOOKUP(C70,Entrants!$A$2:$E$5000,3,FALSE),\"\")","v":""},{"$f":"IF(Score!B69>0,VLOOKUP(C70,Entrants!$A$2:$E$5000,2,FALSE),\"\")","v":""},{"$f":"IF(Score!B69>0,VLOOKUP(C70,Entrants!$A$2:$E$5000,4,FALSE),\"\")","v":""},{"$f":"IF(Score!C69>0,Score!C69,\"\")","v":""}]
[{"$f":"IF(Score!B70>0,Score!A70,\"\")","v":""},{"$f":"IF(Score!B70>0,IF(COUNTIF($E$3:E71,E71)>7,\"\",MAX($B$3:B70)+1),\"\")","v":""},{"$f":"IF(Score!B70>0,Score!B70,\"\")","v":""},{"$f":"IF(Score!B70>0,VLOOKUP(C71,Entrants!$A$2:$E$5000,3,FALSE),\"\")","v":""},{"$f":"IF(Score!B70>0,VLOOKUP(C71,Entrants!$A$2:$E$5000,2,FALSE),\"\")","v":""},{"$f":"IF(Score!B70>0,VLOOKUP(C71,Entrants!$A$2:$E$5000,4,FALSE),\"\")","v":""},{"$f":"IF(Score!C70>0,Score!C70,\"\")","v":""}]
[{"$f":"IF(Score!B71>0,Score!A71,\"\")","v":""},{"$f":"IF(Score!B71>0,IF(COUNTIF($E$3:E72,E72)>7,\"\",MAX($B$3:B71)+1),\"\")","v":""},{"$f":"IF(Score!B71>0,Score!B71,\"\")","v":""},{"$f":"IF(Score!B71>0,VLOOKUP(C72,Entrants!$A$2:$E$5000,3,FALSE),\"\")","v":""},{"$f":"IF(Score!B71>0,VLOOKUP(C72,Entrants!$A$2:$E$5000,2,FALSE),\"\")","v":""},{"$f":"IF(Score!B71>0,VLOOKUP(C72,Entrants!$A$2:$E$5000,4,FALSE),\"\")","v":""},{"$f":"IF(Score!C71>0,Score!C71,\"\")","v":""}]
[{"$f":"IF(Score!B72>0,Score!A72,\"\")","v":""},{"$f":"IF(Score!B72>0,IF(COUNTIF($E$3:E73,E73)>7,\"\",MAX($B$3:B72)+1),\"\")","v":""},{"$f":"IF(Score!B72>0,Score!B72,\"\")","v":""},{"$f":"IF(Score!B72>0,VLOOKUP(C73,Entrants!$A$2:$E$5000,3,FALSE),\"\")","v":""},{"$f":"IF(Score!B72>0,VLOOKUP(C73,Entrants!$A$2:$E$5000,2,FALSE),\"\")","v":""},{"$f":"IF(Score!B72>0,VLOOKUP(C73,Entrants!$A$2:$E$5000,4,FALSE),\"\")","v":""},{"$f":"IF(Score!C72>0,Score!C72,\"\")","v":""}]
[{"$f":"IF(Score!B73>0,Score!A73,\"\")","v":""},{"$f":"IF(Score!B73>0,IF(COUNTIF($E$3:E74,E74)>7,\"\",MAX($B$3:B73)+1),\"\")","v":""},{"$f":"IF(Score!B73>0,Score!B73,\"\")","v":""},{"$f":"IF(Score!B73>0,VLOOKUP(C74,Entrants!$A$2:$E$5000,3,FALSE),\"\")","v":""},{"$f":"IF(Score!B73>0,VLOOKUP(C74,Entrants!$A$2:$E$5000,2,FALSE),\"\")","v":""},{"$f":"IF(Score!B73>0,VLOOKUP(C74,Entrants!$A$2:$E$5000,4,FALSE),\"\")","v":""},{"$f":"IF(Score!C73>0,Score!C73,\"\")","v":""}]
[{"$f":"IF(Score!B74>0,Score!A74,\"\")","v":""},{"$f":"IF(Score!B74>0,IF(COUNTIF($E$3:E75,E75)>7,\"\",MAX($B$3:B74)+1),\"\")","v":""},{"$f":"IF(Score!B74>0,Score!B74,\"\")","v":""},{"$f":"IF(Score!B74>0,VLOOKUP(C75,Entrants!$A$2:$E$5000,3,FALSE),\"\")","v":""},{"$f":"IF(Score!B74>0,VLOOKUP(C75,Entrants!$A$2:$E$5000,2,FALSE),\"\")","v":""},{"$f":"IF(Score!B74>0,VLOOKUP(C75,Entrants!$A$2:$E$5000,4,FALSE),\"\")","v":""},{"$f":"IF(Score!C74>0,Score!C74,\"\")","v":""}]
[{"$f":"IF(Score!B75>0,Score!A75,\"\")","v":""},{"$f":"IF(Score!B75>0,IF(COUNTIF($E$3:E76,E76)>7,\"\",MAX($B$3:B75)+1),\"\")","v":""},{"$f":"IF(Score!B75>0,Score!B75,\"\")","v":""},{"$f":"IF(Score!B75>0,VLOOKUP(C76,Entrants!$A$2:$E$5000,3,FALSE),\"\")","v":""},{"$f":"IF(Score!B75>0,VLOOKUP(C76,Entrants!$A$2:$E$5000,2,FALSE),\"\")","v":""},{"$f":"IF(Score!B75>0,VLOOKUP(C76,Entrants!$A$2:$E$5000,4,FALSE),\"\")","v":""},{"$f":"IF(Score!C75>0,Score!C75,\"\")","v":""}]
[{"$f":"IF(Score!B76>0,Score!A76,\"\")","v":""},{"$f":"IF(Score!B76>0,IF(COUNTIF($E$3:E77,E77)>7,\"\",MAX($B$3:B76)+1),\"\")","v":""},{"$f":"IF(Score!B76>0,Score!B76,\"\")","v":""},{"$f":"IF(Score!B76>0,VLOOKUP(C77,Entrants!$A$2:$E$5000,3,FALSE),\"\")","v":""},{"$f":"IF(Score!B76>0,VLOOKUP(C77,Entrants!$A$2:$E$5000,2,FALSE),\"\")","v":""},{"$f":"IF(Score!B76>0,VLOOKUP(C77,Entrants!$A$2:$E$5000,4,FALSE),\"\")","v":""},{"$f":"IF(Score!C76>0,Score!C76,\"\")","v":""}]
[{"$f":"IF(Score!B77>0,Score!A77,\"\")","v":""},{"$f":"IF(Score!B77>0,IF(COUNTIF($E$3:E78,E78)>7,\"\",MAX($B$3:B77)+1),\"\")","v":""},{"$f":"IF(Score!B77>0,Score!B77,\"\")","v":""},{"$f":"IF(Score!B77>0,VLOOKUP(C78,Entrants!$A$2:$E$5000,3,FALSE),\"\")","v":""},{"$f":"IF(Score!B77>0,VLOOKUP(C78,Entrants!$A$2:$E$5000,2,FALSE),\"\")","v":""},{"$f":"IF(Score!B77>0,VLOOKUP(C78,Entrants!$A$2:$E$5000,4,FALSE),\"\")","v":""},{"$f":"IF(Score!C77>0,Score!C77,\"\")","v":""}]
[{"$f":"IF(Score!B78>0,Score!A78,\"\")","v":""},{"$f":"IF(Score!B78>0,IF(COUNTIF($E$3:E79,E79)>7,\"\",MAX($B$3:B78)+1),\"\")","v":""},{"$f":"IF(Score!B78>0,Score!B78,\"\")","v":""},{"$f":"IF(Score!B78>0,VLOOKUP(C79,Entrants!$A$2:$E$5000,3,FALSE),\"\")","v":""},{"$f":"IF(Score!B78>0,VLOOKUP(C79,Entrants!$A$2:$E$5000,2,FALSE),\"\")","v":""},{"$f":"IF(Score!B78>0,VLOOKUP(C79,Entrants!$A$2:$E$5000,4,FALSE),\"\")","v":""},{"$f":"IF(Score!C78>0,Score!C78,\"\")","v":""}]
[{"$f":"IF(Score!B79>0,Score!A79,\"\")","v":""},{"$f":"IF(Score!B79>0,IF(COUNTIF($E$3:E80,E80)>7,\"\",MAX($B$3:B79)+1),\"\")","v":""},{"$f":"IF(Score!B79>0,Score!B79,\"\")","v":""},{"$f":"IF(Score!B79>0,VLOOKUP(C80,Entrants!$A$2:$E$5000,3,FALSE),\"\")","v":""},{"$f":"IF(Score!B79>0,VLOOKUP(C80,Entrants!$A$2:$E$5000,2,FALSE),\"\")","v":""},{"$f":"IF(Score!B79>0,VLOOKUP(C80,Entrants!$A$2:$E$5000,4,FALSE),\"\")","v":""},{"$f":"IF(Score!C79>0,Score!C79,\"\")","v":""}]
[{"$f":"IF(Score!B80>0,Score!A80,\"\")","v":""},{"$f":"IF(Score!B80>0,IF(COUNTIF($E$3:E81,E81)>7,\"\",MAX($B$3:B80)+1),\"\")","v":""},{"$f":"IF(Score!B80>0,Score!B80,\"\")","v":""},{"$f":"IF(Score!B80>0,VLOOKUP(C81,Entrants!$A$2:$E$5000,3,FALSE),\"\")","v":""},{"$f":"IF(Score!B80>0,VLOOKUP(C81,Entrants!$A$2:$E$5000,2,FALSE),\"\")","v":""},{"$f":"IF(Score!B80>0,VLOOKUP(C81,Entrants!$A$2:$E$5000,4,FALSE),\"\")","v":""},{"$f":"IF(Score!C80>0,Score!C80,\"\")","v":""}]
[{"$f":"IF(Score!B81>0,Score!A81,\"\")","v":""},{"$f":"IF(Score!B81>0,IF(COUNTIF($E$3:E82,E82)>7,\"\",MAX($B$3:B81)+1),\"\")","v":""},{"$f":"IF(Score!B81>0,Score!B81,\"\")","v":""},{"$f":"IF(Score!B81>0,VLOOKUP(C82,Entrants!$A$2:$E$5000,3,FALSE),\"\")","v":""},{"$f":"IF(Score!B81>0,VLOOKUP(C82,Entrants!$A$2:$E$5000,2,FALSE),\"\")","v":""},{"$f":"IF(Score!B81>0,VLOOKUP(C82,Entrants!$A$2:$E$5000,4,FALSE),\"\")","v":""},{"$f":"IF(Score!C81>0,Score!C81,\"\")","v":""}]
[{"$f":"IF(Score!B82>0,Score!A82,\"\")","v":""},{"$f":"IF(Score!B82>0,IF(COUNTIF($E$3:E83,E83)>7,\"\",MAX($B$3:B82)+1),\"\")","v":""},{"$f":"IF(Score!B82>0,Score!B82,\"\")","v":""},{"$f":"IF(Score!B82>0,VLOOKUP(C83,Entrants!$A$2:$E$5000,3,FALSE),\"\")","v":""},{"$f":"IF(Score!B82>0,VLOOKUP(C83,Entrants!$A$2:$E$5000,2,FALSE),\"\")","v":""},{"$f":"IF(Score!B82>0,VLOOKUP(C83,Entrants!$A$2:$E$5000,4,FALSE),\"\")","v":""},{"$f":"IF(Score!C82>0,Score!C82,\"\")","v":""}]
[{"$f":"IF(Score!B83>0,Score!A83,\"\")","v":""},{"$f":"IF(Score!B83>0,IF(COUNTIF($E$3:E84,E84)>7,\"\",MAX($B$3:B83)+1),\"\")","v":""},{"$f":"IF(Score!B83>0,Score!B83,\"\")","v":""},{"$f":"IF(Score!B83>0,VLOOKUP(C84,Entrants!$A$2:$E$5000,3,FALSE),\"\")","v":""},{"$f":"IF(Score!B83>0,VLOOKUP(C84,Entrants!$A$2:$E$5000,2,FALSE),\"\")","v":""},{"$f":"IF(Score!B83>0,VLOOKUP(C84,Entrants!$A$2:$E$5000,4,FALSE),\"\")","v":""},{"$f":"IF(Score!C83>0,Score!C83,\"\")","v":""}]
[{"$f":"IF(Score!B84>0,Score!A84,\"\")","v":""},{"$f":"IF(Score!B84>0,IF(COUNTIF($E$3:E85,E85)>7,\"\",MAX($B$3:B84)+1),\"\")","v":""},{"$f":"IF(Score!B84>0,Score!B84,\"\")","v":""},{"$f":"IF(Score!B84>0,VLOOKUP(C85,Entrants!$A$2:$E$5000,3,FALSE),\"\")","v":""},{"$f":"IF(Score!B84>0,VLOOKUP(C85,Entrants!$A$2:$E$5000,2,FALSE),\"\")","v":""},{"$f":"IF(Score!B84>0,VLOOKUP(C85,Entrants!$A$2:$E$5000,4,FALSE),\"\")","v":""},{"$f":"IF(Score!C84>0,Score!C84,\"\")","v":""}]
[{"$f":"IF(Score!B85>0,Score!A85,\"\")","v":""},{"$f":"IF(Score!B85>0,IF(COUNTIF($E$3:E86,E86)>7,\"\",MAX($B$3:B85)+1),\"\")","v":""},{"$f":"IF(Score!B85>0,Score!B85,\"\")","v":""},{"$f":"IF(Score!B85>0,VLOOKUP(C86,Entrants!$A$2:$E$5000,3,FALSE),\"\")","v":""},{"$f":"IF(Score!B85>0,VLOOKUP(C86,Entrants!$A$2:$E$5000,2,FALSE),\"\")","v":""},{"$f":"IF(Score!B85>0,VLOOKUP(C86,Entrants!$A$2:$E$5000,4,FALSE),\"\")","v":""},{"$f":"IF(Score!C85>0,Score!C85,\"\")","v":""}]
[{"$f":"IF(Score!B86>0,Score!A86,\"\")","v":""},{"$f":"IF(Score!B86>0,IF(COUNTIF($E$3:E87,E87)>7,\"\",MAX($B$3:B86)+1),\"\")","v":""},{"$f":"IF(Score!B86>0,Score!B86,\"\")","v":""},{"$f":"IF(Score!B86>0,VLOOKUP(C87,Entrants!$A$2:$E$5000,3,FALSE),\"\")","v":""},{"$f":"IF(Score!B86>0,VLOOKUP(C87,Entrants!$A$2:$E$5000,2,FALSE),\"\")","v":""},{"$f":"IF(Score!B86>0,VLOOKUP(C87,Entrants!$A$2:$E$5000,4,FALSE),\"\")","v":""},{"$f":"IF(Score!C86>0,Score!C86,\"\")","v":""}]
[{"$f":"IF(Score!B87>0,Score!A87,\"\")","v":""},{"$f":"IF(Score!B87>0,IF(COUNTIF($E$3:E88,E88)>7,\"\",MAX($B$3:B87)+1),\"\")","v":""},{"$f":"IF(Score!B87>0,Score!B87,\"\")","v":""},{"$f":"IF(Score!B87>0,VLOOKUP(C88,Entrants!$A$2:$E$5000,3,FALSE),\"\")","v":""},{"$f":"IF(Score!B87>0,VLOOKUP(C88,Entrants!$A$2:$E$5000,2,FALSE),\"\")","v":""},{"$f":"IF(Score!B87>0,VLOOKUP(C88,Entrants!$A$2:$E$5000,4,FALSE),\"\")","v":""},{"$f":"IF(Score!C87>0,Score!C87,\"\")","v":""}]
[{"$f":"IF(Score!B88>0,Score!A88,\"\")","v":""},{"$f":"IF(Score!B88>0,IF(COUNTIF($E$3:E89,E89)>7,\"\",MAX($B$3:B88)+1),\"\")","v":""},{"$f":"IF(Score!B88>0,Score!B88,\"\")","v":""},{"$f":"IF(Score!B88>0,VLOOKUP(C89,Entrants!$A$2:$E$5000,3,FALSE),\"\")","v":""},{"$f":"IF(Score!B88>0,VLOOKUP(C89,Entrants!$A$2:$E$5000,2,FALSE),\"\")","v":""},{"$f":"IF(Score!B88>0,VLOOKUP(C89,Entrants!$A$2:$E$5000,4,FALSE),\"\")","v":""},{"$f":"IF(Score!C88>0,Score!C88,\"\")","v":""}]
[{"$f":"IF(Score!B89>0,Score!A89,\"\")","v":""},{"$f":"IF(Score!B89>0,IF(COUNTIF($E$3:E90,E90)>7,\"\",MAX($B$3:B89)+1),\"\")","v":""},{"$f":"IF(Score!B89>0,Score!B89,\"\")","v":""},{"$f":"IF(Score!B89>0,VLOOKUP(C90,Entrants!$A$2:$E$5000,3,FALSE),\"\")","v":""},{"$f":"IF(Score!B89>0,VLOOKUP(C90,Entrants!$A$2:$E$5000,2,FALSE),\"\")","v":""},{"$f":"IF(Score!B89>0,VLOOKUP(C90,Entrants!$A$2:$E$5000,4,FALSE),\"\")","v":""},{"$f":"IF(Score!C89>0,Score!C89,\"\")","v":""}]
[{"$f":"IF(Score!B90>0,Score!A90,\"\")","v":""},{"$f":"IF(Score!B90>0,IF(COUNTIF($E$3:E91,E91)>7,\"\",MAX($B$3:B90)+1),\"\")","v":""},{"$f":"IF(Score!B90>0,Score!B90,\"\")","v":""},{"$f":"IF(Score!B90>0,VLOOKUP(C91,Entrants!$A$2:$E$5000,3,FALSE),\"\")","v":""},{"$f":"IF(Score!B90>0,VLOOKUP(C91,Entrants!$A$2:$E$5000,2,FALSE),\"\")","v":""},{"$f":"IF(Score!B90>0,VLOOKUP(C91,Entrants!$A$2:$E$5000,4,FALSE),\"\")","v":""},{"$f":"IF(Score!C90>0,Score!C90,\"\")","v":""}]
[{"$f":"IF(Score!B91>0,Score!A91,\"\")","v":""},{"$f":"IF(Score!B91>0,IF(COUNTIF($E$3:E92,E92)>7,\"\",MAX($B$3:B91)+1),\"\")","v":""},{"$f":"IF(Score!B91>0,Score!B91,\"\")","v":""},{"$f":"IF(Score!B91>0,VLOOKUP(C92,Entrants!$A$2:$E$5000,3,FALSE),\"\")","v":""},{"$f":"IF(Score!B91>0,VLOOKUP(C92,Entrants!$A$2:$E$5000,2,FALSE),\"\")","v":""},{"$f":"IF(Score!B91>0,VLOOKUP(C92,Entrants!$A$2:$E$5000,4,FALSE),\"\")","v":""},{"$f":"IF(Score!C91>0,Score!C91,\"\")","v":""}]
[{"$f":"IF(Score!B92>0,Score!A92,\"\")","v":""},{"$f":"IF(Score!B92>0,IF(COUNTIF($E$3:E93,E93)>7,\"\",MAX($B$3:B92)+1),\"\")","v":""},{"$f":"IF(Score!B92>0,Score!B92,\"\")","v":""},{"$f":"IF(Score!B92>0,VLOOKUP(C93,Entrants!$A$2:$E$5000,3,FALSE),\"\")","v":""},{"$f":"IF(Score!B92>0,VLOOKUP(C93,Entrants!$A$2:$E$5000,2,FALSE),\"\")","v":""},{"$f":"IF(Score!B92>0,VLOOKUP(C93,Entrants!$A$2:$E$5000,4,FALSE),\"\")","v":""},{"$f":"IF(Score!C92>0,Score!C92,\"\")","v":""}]
[{"$f":"IF(Score!B93>0,Score!A93,\"\")","v":""},{"$f":"IF(Score!B93>0,IF(COUNTIF($E$3:E94,E94)>7,\"\",MAX($B$3:B93)+1),\"\")","v":""},{"$f":"IF(Score!B93>0,Score!B93,\"\")","v":""},{"$f":"IF(Score!B93>0,VLOOKUP(C94,Entrants!$A$2:$E$5000,3,FALSE),\"\")","v":""},{"$f":"IF(Score!B93>0,VLOOKUP(C94,Entrants!$A$2:$E$5000,2,FALSE),\"\")","v":""},{"$f":"IF(Score!B93>0,VLOOKUP(C94,Entrants!$A$2:$E$5000,4,FALSE),\"\")","v":""},{"$f":"IF(Score!C93>0,Score!C93,\"\")","v":""}]
[{"$f":"IF(Score!B94>0,Score!A94,\"\")","v":""},{"$f":"IF(Score!B94>0,IF(COUNTIF($E$3:E95,E95)>7,\"\",MAX($B$3:B94)+1),\"\")","v":""},{"$f":"IF(Score!B94>0,Score!B94,\"\")","v":""},{"$f":"IF(Score!B94>0,VLOOKUP(C95,Entrants!$A$2:$E$5000,3,FALSE),\"\")","v":""},{"$f":"IF(Score!B94>0,VLOOKUP(C95,Entrants!$A$2:$E$5000,2,FALSE),\"\")","v":""},{"$f":"IF(Score!B94>0,VLOOKUP(C95,Entrants!$A$2:$E$5000,4,FALSE),\"\")","v":""},{"$f":"IF(Score!C94>0,Score!C94,\"\")","v":""}]
[{"$f":"IF(Score!B95>0,Score!A95,\"\")","v":""},{"$f":"IF(Score!B95>0,IF(COUNTIF($E$3:E96,E96)>7,\"\",MAX($B$3:B95)+1),\"\")","v":""},{"$f":"IF(Score!B95>0,Score!B95,\"\")","v":""},{"$f":"IF(Score!B95>0,VLOOKUP(C96,Entrants!$A$2:$E$5000,3,FALSE),\"\")","v":""},{"$f":"IF(Score!B95>0,VLOOKUP(C96,Entrants!$A$2:$E$5000,2,FALSE),\"\")","v":""},{"$f":"IF(Score!B95>0,VLOOKUP(C96,Entrants!$A$2:$E$5000,4,FALSE),\"\")","v":""},{"$f":"IF(Score!C95>0,Score!C95,\"\")","v":""}]
[{"$f":"IF(Score!B96>0,Score!A96,\"\")","v":""},{"$f":"IF(Score!B96>0,IF(COUNTIF($E$3:E97,E97)>7,\"\",MAX($B$3:B96)+1),\"\")","v":""},{"$f":"IF(Score!B96>0,Score!B96,\"\")","v":""},{"$f":"IF(Score!B96>0,VLOOKUP(C97,Entrants!$A$2:$E$5000,3,FALSE),\"\")","v":""},{"$f":"IF(Score!B96>0,VLOOKUP(C97,Entrants!$A$2:$E$5000,2,FALSE),\"\")","v":""},{"$f":"IF(Score!B96>0,VLOOKUP(C97,Entrants!$A$2:$E$5000,4,FALSE),\"\")","v":""},{"$f":"IF(Score!C96>0,Score!C96,\"\")","v":""}]
[{"$f":"IF(Score!B97>0,Score!A97,\"\")","v":""},{"$f":"IF(Score!B97>0,IF(COUNTIF($E$3:E98,E98)>7,\"\",MAX($B$3:B97)+1),\"\")","v":""},{"$f":"IF(Score!B97>0,Score!B97,\"\")","v":""},{"$f":"IF(Score!B97>0,VLOOKUP(C98,Entrants!$A$2:$E$5000,3,FALSE),\"\")","v":""},{"$f":"IF(Score!B97>0,VLOOKUP(C98,Entrants!$A$2:$E$5000,2,FALSE),\"\")","v":""},{"$f":"IF(Score!B97>0,VLOOKUP(C98,Entrants!$A$2:$E$5000,4,FALSE),\"\")","v":""},{"$f":"IF(Score!C97>0,Score!C97,\"\")","v":""}]
[{"$f":"IF(Score!B98>0,Score!A98,\"\")","v":""},{"$f":"IF(Score!B98>0,IF(COUNTIF($E$3:E99,E99)>7,\"\",MAX($B$3:B98)+1),\"\")","v":""},{"$f":"IF(Score!B98>0,Score!B98,\"\")","v":""},{"$f":"IF(Score!B98>0,VLOOKUP(C99,Entrants!$A$2:$E$5000,3,FALSE),\"\")","v":""},{"$f":"IF(Score!B98>0,VLOOKUP(C99,Entrants!$A$2:$E$5000,2,FALSE),\"\")","v":""},{"$f":"IF(Score!B98>0,VLOOKUP(C99,Entrants!$A$2:$E$5000,4,FALSE),\"\")","v":""},{"$f":"IF(Score!C98>0,Score!C98,\"\")","v":""}]
[{"$f":"IF(Score!B99>0,Score!A99,\"\")","v":""},{"$f":"IF(Score!B99>0,IF(COUNTIF($E$3:E100,E100)>7,\"\",MAX($B$3:B99)+1),\"\")","v":""},{"$f":"IF(Score!B99>0,Score!B99,\"\")","v":""},{"$f":"IF(Score!B99>0,VLOOKUP(C100,Entrants!$A$2:$E$5000,3,FALSE),\"\")","v":""},{"$f":"IF(Score!B99>0,VLOOKUP(C100,Entrants!$A$2:$E$5000,2,FALSE),\"\")","v":""},{"$f":"IF(Score!B99>0,VLOOKUP(C100,Entrants!$A$2:$E$5000,4,FALSE),\"\")","v":""},{"$f":"IF(Score!C99>0,Score!C99,\"\")","v":""}]
[{"$f":"IF(Score!B100>0,Score!A100,\"\")","v":""},{"$f":"IF(Score!B100>0,IF(COUNTIF($E$3:E101,E101)>7,\"\",MAX($B$3:B100)+1),\"\")","v":""},{"$f":"IF(Score!B100>0,Score!B100,\"\")","v":""},{"$f":"IF(Score!B100>0,VLOOKUP(C101,Entrants!$A$2:$E$5000,3,FALSE),\"\")","v":""},{"$f":"IF(Score!B100>0,VLOOKUP(C101,Entrants!$A$2:$E$5000,2,FALSE),\"\")","v":""},{"$f":"IF(Score!B100>0,VLOOKUP(C101,Entrants!$A$2:$E$5000,4,FALSE),\"\")","v":""},{"$f":"IF(Score!C100>0,Score!C100,\"\")","v":""}]
[{"$f":"IF(Score!B101>0,Score!A101,\"\")","v":""},{"$f":"IF(Score!B101>0,IF(COUNTIF($E$3:E102,E102)>7,\"\",MAX($B$3:B101)+1),\"\")","v":""},{"$f":"IF(Score!B101>0,Score!B101,\"\")","v":""},{"$f":"IF(Score!B101>0,VLOOKUP(C102,Entrants!$A$2:$E$5000,3,FALSE),\"\")","v":""},{"$f":"IF(Score!B101>0,VLOOKUP(C102,Entrants!$A$2:$E$5000,2,FALSE),\"\")","v":""},{"$f":"IF(Score!B101>0,VLOOKUP(C102,Entrants!$A$2:$E$5000,4,FALSE),\"\")","v":""},{"$f":"IF(Score!C101>0,Score!C101,\"\")","v":""}]
[{"$f":"IF(Score!B102>0,Score!A102,\"\")","v":""},{"$f":"IF(Score!B102>0,IF(COUNTIF($E$3:E103,E103)>7,\"\",MAX($B$3:B102)+1),\"\")","v":""},{"$f":"IF(Score!B102>0,Score!B102,\"\")","v":""},{"$f":"IF(Score!B102>0,VLOOKUP(C103,Entrants!$A$2:$E$5000,3,FALSE),\"\")","v":""},{"$f":"IF(Score!B102>0,VLOOKUP(C103,Entrants!$A$2:$E$5000,2,FALSE),\"\")","v":""},{"$f":"IF(Score!B102>0,VLOOKUP(C103,Entrants!$A$2:$E$5000,4,FALSE),\"\")","v":""},{"$f":"IF(Score!C102>0,Score!C102,\"\")","v":""}]
[{"$f":"IF(Score!B103>0,Score!A103,\"\")","v":""},{"$f":"IF(Score!B103>0,IF(COUNTIF($E$3:E104,E104)>7,\"\",MAX($B$3:B103)+1),\"\")","v":""},{"$f":"IF(Score!B103>0,Score!B103,\"\")","v":""},{"$f":"IF(Score!B103>0,VLOOKUP(C104,Entrants!$A$2:$E$5000,3,FALSE),\"\")","v":""},{"$f":"IF(Score!B103>0,VLOOKUP(C104,Entrants!$A$2:$E$5000,2,FALSE),\"\")","v":""},{"$f":"IF(Score!B103>0,VLOOKUP(C104,Entrants!$A$2:$E$5000,4,FALSE),\"\")","v":""},{"$f":"IF(Score!C103>0,Score!C103,\"\")","v":""}]
[{"$f":"IF(Score!B104>0,Score!A104,\"\")","v":""},{"$f":"IF(Score!B104>0,IF(COUNTIF($E$3:E105,E105)>7,\"\",MAX($B$3:B104)+1),\"\")","v":""},{"$f":"IF(Score!B104>0,Score!B104,\"\")","v":""},{"$f":"IF(Score!B104>0,VLOOKUP(C105,Entrants!$A$2:$E$5000,3,FALSE),\"\")","v":""},{"$f":"IF(Score!B104>0,VLOOKUP(C105,Entrants!$A$2:$E$5000,2,FALSE),\"\")","v":""},{"$f":"IF(Score!B104>0,VLOOKUP(C105,Entrants!$A$2:$E$5000,4,FALSE),\"\")","v":""},{"$f":"IF(Score!C104>0,Score!C104,\"\")","v":""}]
[{"$f":"IF(Score!B105>0,Score!A105,\"\")","v":""},{"$f":"IF(Score!B105>0,IF(COUNTIF($E$3:E106,E106)>7,\"\",MAX($B$3:B105)+1),\"\")","v":""},{"$f":"IF(Score!B105>0,Score!B105,\"\")","v":""},{"$f":"IF(Score!B105>0,VLOOKUP(C106,Entrants!$A$2:$E$5000,3,FALSE),\"\")","v":""},{"$f":"IF(Score!B105>0,VLOOKUP(C106,Entrants!$A$2:$E$5000,2,FALSE),\"\")","v":""},{"$f":"IF(Score!B105>0,VLOOKUP(C106,Entrants!$A$2:$E$5000,4,FALSE),\"\")","v":""},{"$f":"IF(Score!C105>0,Score!C105,\"\")","v":""}]
[{"$f":"IF(Score!B106>0,Score!A106,\"\")","v":""},{"$f":"IF(Score!B106>0,IF(COUNTIF($E$3:E107,E107)>7,\"\",MAX($B$3:B106)+1),\"\")","v":""},{"$f":"IF(Score!B106>0,Score!B106,\"\")","v":""},{"$f":"IF(Score!B106>0,VLOOKUP(C107,Entrants!$A$2:$E$5000,3,FALSE),\"\")","v":""},{"$f":"IF(Score!B106>0,VLOOKUP(C107,Entrants!$A$2:$E$5000,2,FALSE),\"\")","v":""},{"$f":"IF(Score!B106>0,VLOOKUP(C107,Entrants!$A$2:$E$5000,4,FALSE),\"\")","v":""},{"$f":"IF(Score!C106>0,Score!C106,\"\")","v":""}]
[{"$f":"IF(Score!B107>0,Score!A107,\"\")","v":""},{"$f":"IF(Score!B107>0,IF(COUNTIF($E$3:E108,E108)>7,\"\",MAX($B$3:B107)+1),\"\")","v":""},{"$f":"IF(Score!B107>0,Score!B107,\"\")","v":""},{"$f":"IF(Score!B107>0,VLOOKUP(C108,Entrants!$A$2:$E$5000,3,FALSE),\"\")","v":""},{"$f":"IF(Score!B107>0,VLOOKUP(C108,Entrants!$A$2:$E$5000,2,FALSE),\"\")","v":""},{"$f":"IF(Score!B107>0,VLOOKUP(C108,Entrants!$A$2:$E$5000,4,FALSE),\"\")","v":""},{"$f":"IF(Score!C107>0,Score!C107,\"\")","v":""}]
[{"$f":"IF(Score!B108>0,Score!A108,\"\")","v":""},{"$f":"IF(Score!B108>0,IF(COUNTIF($E$3:E109,E109)>7,\"\",MAX($B$3:B108)+1),\"\")","v":""},{"$f":"IF(Score!B108>0,Score!B108,\"\")","v":""},{"$f":"IF(Score!B108>0,VLOOKUP(C109,Entrants!$A$2:$E$5000,3,FALSE),\"\")","v":""},{"$f":"IF(Score!B108>0,VLOOKUP(C109,Entrants!$A$2:$E$5000,2,FALSE),\"\")","v":""},{"$f":"IF(Score!B108>0,VLOOKUP(C109,Entrants!$A$2:$E$5000,4,FALSE),\"\")","v":""},{"$f":"IF(Score!C108>0,Score!C108,\"\")","v":""}]
[{"$f":"IF(Score!B109>0,Score!A109,\"\")","v":""},{"$f":"IF(Score!B109>0,IF(COUNTIF($E$3:E110,E110)>7,\"\",MAX($B$3:B109)+1),\"\")","v":""},{"$f":"IF(Score!B109>0,Score!B109,\"\")","v":""},{"$f":"IF(Score!B109>0,VLOOKUP(C110,Entrants!$A$2:$E$5000,3,FALSE),\"\")","v":""},{"$f":"IF(Score!B109>0,VLOOKUP(C110,Entrants!$A$2:$E$5000,2,FALSE),\"\")","v":""},{"$f":"IF(Score!B109>0,VLOOKUP(C110,Entrants!$A$2:$E$5000,4,FALSE),\"\")","v":""},{"$f":"IF(Score!C109>0,Score!C109,\"\")","v":""}]
[{"$f":"IF(Score!B110>0,Score!A110,\"\")","v":""},{"$f":"IF(Score!B110>0,IF(COUNTIF($E$3:E111,E111)>7,\"\",MAX($B$3:B110)+1),\"\")","v":""},{"$f":"IF(Score!B110>0,Score!B110,\"\")","v":""},{"$f":"IF(Score!B110>0,VLOOKUP(C111,Entrants!$A$2:$E$5000,3,FALSE),\"\")","v":""},{"$f":"IF(Score!B110>0,VLOOKUP(C111,Entrants!$A$2:$E$5000,2,FALSE),\"\")","v":""},{"$f":"IF(Score!B110>0,VLOOKUP(C111,Entrants!$A$2:$E$5000,4,FALSE),\"\")","v":""},{"$f":"IF(Score!C110>0,Score!C110,\"\")","v":""}]
[{"$f":"IF(Score!B111>0,Score!A111,\"\")","v":""},{"$f":"IF(Score!B111>0,IF(COUNTIF($E$3:E112,E112)>7,\"\",MAX($B$3:B111)+1),\"\")","v":""},{"$f":"IF(Score!B111>0,Score!B111,\"\")","v":""},{"$f":"IF(Score!B111>0,VLOOKUP(C112,Entrants!$A$2:$E$5000,3,FALSE),\"\")","v":""},{"$f":"IF(Score!B111>0,VLOOKUP(C112,Entrants!$A$2:$E$5000,2,FALSE),\"\")","v":""},{"$f":"IF(Score!B111>0,VLOOKUP(C112,Entrants!$A$2:$E$5000,4,FALSE),\"\")","v":""},{"$f":"IF(Score!C111>0,Score!C111,\"\")","v":""}]
[{"$f":"IF(Score!B112>0,Score!A112,\"\")","v":""},{"$f":"IF(Score!B112>0,IF(COUNTIF($E$3:E113,E113)>7,\"\",MAX($B$3:B112)+1),\"\")","v":""},{"$f":"IF(Score!B112>0,Score!B112,\"\")","v":""},{"$f":"IF(Score!B112>0,VLOOKUP(C113,Entrants!$A$2:$E$5000,3,FALSE),\"\")","v":""},{"$f":"IF(Score!B112>0,VLOOKUP(C113,Entrants!$A$2:$E$5000,2,FALSE),\"\")","v":""},{"$f":"IF(Score!B112>0,VLOOKUP(C113,Entrants!$A$2:$E$5000,4,FALSE),\"\")","v":""},{"$f":"IF(Score!C112>0,Score!C112,\"\")","v":""}]
[{"$f":"IF(Score!B113>0,Score!A113,\"\")","v":""},{"$f":"IF(Score!B113>0,IF(COUNTIF($E$3:E114,E114)>7,\"\",MAX($B$3:B113)+1),\"\")","v":""},{"$f":"IF(Score!B113>0,Score!B113,\"\")","v":""},{"$f":"IF(Score!B113>0,VLOOKUP(C114,Entrants!$A$2:$E$5000,3,FALSE),\"\")","v":""},{"$f":"IF(Score!B113>0,VLOOKUP(C114,Entrants!$A$2:$E$5000,2,FALSE),\"\")","v":""},{"$f":"IF(Score!B113>0,VLOOKUP(C114,Entrants!$A$2:$E$5000,4,FALSE),\"\")","v":""},{"$f":"IF(Score!C113>0,Score!C113,\"\")","v":""}]
[{"$f":"IF(Score!B114>0,Score!A114,\"\")","v":""},{"$f":"IF(Score!B114>0,IF(COUNTIF($E$3:E115,E115)>7,\"\",MAX($B$3:B114)+1),\"\")","v":""},{"$f":"IF(Score!B114>0,Score!B114,\"\")","v":""},{"$f":"IF(Score!B114>0,VLOOKUP(C115,Entrants!$A$2:$E$5000,3,FALSE),\"\")","v":""},{"$f":"IF(Score!B114>0,VLOOKUP(C115,Entrants!$A$2:$E$5000,2,FALSE),\"\")","v":""},{"$f":"IF(Score!B114>0,VLOOKUP(C115,Entrants!$A$2:$E$5000,4,FALSE),\"\")","v":""},{"$f":"IF(Score!C114>0,Score!C114,\"\")","v":""}]
[{"$f":"IF(Score!B115>0,Score!A115,\"\")","v":""},{"$f":"IF(Score!B115>0,IF(COUNTIF($E$3:E116,E116)>7,\"\",MAX($B$3:B115)+1),\"\")","v":""},{"$f":"IF(Score!B115>0,Score!B115,\"\")","v":""},{"$f":"IF(Score!B115>0,VLOOKUP(C116,Entrants!$A$2:$E$5000,3,FALSE),\"\")","v":""},{"$f":"IF(Score!B115>0,VLOOKUP(C116,Entrants!$A$2:$E$5000,2,FALSE),\"\")","v":""},{"$f":"IF(Score!B115>0,VLOOKUP(C116,Entrants!$A$2:$E$5000,4,FALSE),\"\")","v":""},{"$f":"IF(Score!C115>0,Score!C115,\"\")","v":""}]
[{"$f":"IF(Score!B116>0,Score!A116,\"\")","v":""},{"$f":"IF(Score!B116>0,IF(COUNTIF($E$3:E117,E117)>7,\"\",MAX($B$3:B116)+1),\"\")","v":""},{"$f":"IF(Score!B116>0,Score!B116,\"\")","v":""},{"$f":"IF(Score!B116>0,VLOOKUP(C117,Entrants!$A$2:$E$5000,3,FALSE),\"\")","v":""},{"$f":"IF(Score!B116>0,VLOOKUP(C117,Entrants!$A$2:$E$5000,2,FALSE),\"\")","v":""},{"$f":"IF(Score!B116>0,VLOOKUP(C117,Entrants!$A$2:$E$5000,4,FALSE),\"\")","v":""},{"$f":"IF(Score!C116>0,Score!C116,\"\")","v":""}]
[{"$f":"IF(Score!B117>0,Score!A117,\"\")","v":""},{"$f":"IF(Score!B117>0,IF(COUNTIF($E$3:E118,E118)>7,\"\",MAX($B$3:B117)+1),\"\")","v":""},{"$f":"IF(Score!B117>0,Score!B117,\"\")","v":""},{"$f":"IF(Score!B117>0,VLOOKUP(C118,Entrants!$A$2:$E$5000,3,FALSE),\"\")","v":""},{"$f":"IF(Score!B117>0,VLOOKUP(C118,Entrants!$A$2:$E$5000,2,FALSE),\"\")","v":""},{"$f":"IF(Score!B117>0,VLOOKUP(C118,Entrants!$A$2:$E$5000,4,FALSE),\"\")","v":""},{"$f":"IF(Score!C117>0,Score!C117,\"\")","v":""}]
[{"$f":"IF(Score!B118>0,Score!A118,\"\")","v":""},{"$f":"IF(Score!B118>0,IF(COUNTIF($E$3:E119,E119)>7,\"\",MAX($B$3:B118)+1),\"\")","v":""},{"$f":"IF(Score!B118>0,Score!B118,\"\")","v":""},{"$f":"IF(Score!B118>0,VLOOKUP(C119,Entrants!$A$2:$E$5000,3,FALSE),\"\")","v":""},{"$f":"IF(Score!B118>0,VLOOKUP(C119,Entrants!$A$2:$E$5000,2,FALSE),\"\")","v":""},{"$f":"IF(Score!B118>0,VLOOKUP(C119,Entrants!$A$2:$E$5000,4,FALSE),\"\")","v":""},{"$f":"IF(Score!C118>0,Score!C118,\"\")","v":""}]
[{"$f":"IF(Score!B119>0,Score!A119,\"\")","v":""},{"$f":"IF(Score!B119>0,IF(COUNTIF($E$3:E120,E120)>7,\"\",MAX($B$3:B119)+1),\"\")","v":""},{"$f":"IF(Score!B119>0,Score!B119,\"\")","v":""},{"$f":"IF(Score!B119>0,VLOOKUP(C120,Entrants!$A$2:$E$5000,3,FALSE),\"\")","v":""},{"$f":"IF(Score!B119>0,VLOOKUP(C120,Entrants!$A$2:$E$5000,2,FALSE),\"\")","v":""},{"$f":"IF(Score!B119>0,VLOOKUP(C120,Entrants!$A$2:$E$5000,4,FALSE),\"\")","v":""},{"$f":"IF(Score!C119>0,Score!C119,\"\")","v":""}]
[{"$f":"IF(Score!B120>0,Score!A120,\"\")","v":""},{"$f":"IF(Score!B120>0,IF(COUNTIF($E$3:E121,E121)>7,\"\",MAX($B$3:B120)+1),\"\")","v":""},{"$f":"IF(Score!B120>0,Score!B120,\"\")","v":""},{"$f":"IF(Score!B120>0,VLOOKUP(C121,Entrants!$A$2:$E$5000,3,FALSE),\"\")","v":""},{"$f":"IF(Score!B120>0,VLOOKUP(C121,Entrants!$A$2:$E$5000,2,FALSE),\"\")","v":""},{"$f":"IF(Score!B120>0,VLOOKUP(C121,Entrants!$A$2:$E$5000,4,FALSE),\"\")","v":""},{"$f":"IF(Score!C120>0,Score!C120,\"\")","v":""}]
[{"$f":"IF(Score!B121>0,Score!A121,\"\")","v":""},{"$f":"IF(Score!B121>0,IF(COUNTIF($E$3:E122,E122)>7,\"\",MAX($B$3:B121)+1),\"\")","v":""},{"$f":"IF(Score!B121>0,Score!B121,\"\")","v":""},{"$f":"IF(Score!B121>0,VLOOKUP(C122,Entrants!$A$2:$E$5000,3,FALSE),\"\")","v":""},{"$f":"IF(Score!B121>0,VLOOKUP(C122,Entrants!$A$2:$E$5000,2,FALSE),\"\")","v":""},{"$f":"IF(Score!B121>0,VLOOKUP(C122,Entrants!$A$2:$E$5000,4,FALSE),\"\")","v":""},{"$f":"IF(Score!C121>0,Score!C121,\"\")","v":""}]
[{"$f":"IF(Score!B122>0,Score!A122,\"\")","v":""},{"$f":"IF(Score!B122>0,IF(COUNTIF($E$3:E123,E123)>7,\"\",MAX($B$3:B122)+1),\"\")","v":""},{"$f":"IF(Score!B122>0,Score!B122,\"\")","v":""},{"$f":"IF(Score!B122>0,VLOOKUP(C123,Entrants!$A$2:$E$5000,3,FALSE),\"\")","v":""},{"$f":"IF(Score!B122>0,VLOOKUP(C123,Entrants!$A$2:$E$5000,2,FALSE),\"\")","v":""},{"$f":"IF(Score!B122>0,VLOOKUP(C123,Entrants!$A$2:$E$5000,4,FALSE),\"\")","v":""},{"$f":"IF(Score!C122>0,Score!C122,\"\")","v":""}]
[{"$f":"IF(Score!B123>0,Score!A123,\"\")","v":""},{"$f":"IF(Score!B123>0,IF(COUNTIF($E$3:E124,E124)>7,\"\",MAX($B$3:B123)+1),\"\")","v":""},{"$f":"IF(Score!B123>0,Score!B123,\"\")","v":""},{"$f":"IF(Score!B123>0,VLOOKUP(C124,Entrants!$A$2:$E$5000,3,FALSE),\"\")","v":""},{"$f":"IF(Score!B123>0,VLOOKUP(C124,Entrants!$A$2:$E$5000,2,FALSE),\"\")","v":""},{"$f":"IF(Score!B123>0,VLOOKUP(C124,Entrants!$A$2:$E$5000,4,FALSE),\"\")","v":""},{"$f":"IF(Score!C123>0,Score!C123,\"\")","v":""}]
[{"$f":"IF(Score!B124>0,Score!A124,\"\")","v":""},{"$f":"IF(Score!B124>0,IF(COUNTIF($E$3:E125,E125)>7,\"\",MAX($B$3:B124)+1),\"\")","v":""},{"$f":"IF(Score!B124>0,Score!B124,\"\")","v":""},{"$f":"IF(Score!B124>0,VLOOKUP(C125,Entrants!$A$2:$E$5000,3,FALSE),\"\")","v":""},{"$f":"IF(Score!B124>0,VLOOKUP(C125,Entrants!$A$2:$E$5000,2,FALSE),\"\")","v":""},{"$f":"IF(Score!B124>0,VLOOKUP(C125,Entrants!$A$2:$E$5000,4,FALSE),\"\")","v":""},{"$f":"IF(Score!C124>0,Score!C124,\"\")","v":""}]
[{"$f":"IF(Score!B125>0,Score!A125,\"\")","v":""},{"$f":"IF(Score!B125>0,IF(COUNTIF($E$3:E126,E126)>7,\"\",MAX($B$3:B125)+1),\"\")","v":""},{"$f":"IF(Score!B125>0,Score!B125,\"\")","v":""},{"$f":"IF(Score!B125>0,VLOOKUP(C126,Entrants!$A$2:$E$5000,3,FALSE),\"\")","v":""},{"$f":"IF(Score!B125>0,VLOOKUP(C126,Entrants!$A$2:$E$5000,2,FALSE),\"\")","v":""},{"$f":"IF(Score!B125>0,VLOOKUP(C126,Entrants!$A$2:$E$5000,4,FALSE),\"\")","v":""},{"$f":"IF(Score!C125>0,Score!C125,\"\")","v":""}]
[{"$f":"IF(Score!B126>0,Score!A126,\"\")","v":""},{"$f":"IF(Score!B126>0,IF(COUNTIF($E$3:E127,E127)>7,\"\",MAX($B$3:B126)+1),\"\")","v":""},{"$f":"IF(Score!B126>0,Score!B126,\"\")","v":""},{"$f":"IF(Score!B126>0,VLOOKUP(C127,Entrants!$A$2:$E$5000,3,FALSE),\"\")","v":""},{"$f":"IF(Score!B126>0,VLOOKUP(C127,Entrants!$A$2:$E$5000,2,FALSE),\"\")","v":""},{"$f":"IF(Score!B126>0,VLOOKUP(C127,Entrants!$A$2:$E$5000,4,FALSE),\"\")","v":""},{"$f":"IF(Score!C126>0,Score!C126,\"\")","v":""}]
[{"$f":"IF(Score!B127>0,Score!A127,\"\")","v":""},{"$f":"IF(Score!B127>0,IF(COUNTIF($E$3:E128,E128)>7,\"\",MAX($B$3:B127)+1),\"\")","v":""},{"$f":"IF(Score!B127>0,Score!B127,\"\")","v":""},{"$f":"IF(Score!B127>0,VLOOKUP(C128,Entrants!$A$2:$E$5000,3,FALSE),\"\")","v":""},{"$f":"IF(Score!B127>0,VLOOKUP(C128,Entrants!$A$2:$E$5000,2,FALSE),\"\")","v":""},{"$f":"IF(Score!B127>0,VLOOKUP(C128,Entrants!$A$2:$E$5000,4,FALSE),\"\")","v":""},{"$f":"IF(Score!C127>0,Score!C127,\"\")","v":""}]
[{"$f":"IF(Score!B128>0,Score!A128,\"\")","v":""},{"$f":"IF(Score!B128>0,IF(COUNTIF($E$3:E129,E129)>7,\"\",MAX($B$3:B128)+1),\"\")","v":""},{"$f":"IF(Score!B128>0,Score!B128,\"\")","v":""},{"$f":"IF(Score!B128>0,VLOOKUP(C129,Entrants!$A$2:$E$5000,3,FALSE),\"\")","v":""},{"$f":"IF(Score!B128>0,VLOOKUP(C129,Entrants!$A$2:$E$5000,2,FALSE),\"\")","v":""},{"$f":"IF(Score!B128>0,VLOOKUP(C129,Entrants!$A$2:$E$5000,4,FALSE),\"\")","v":""},{"$f":"IF(Score!C128>0,Score!C128,\"\")","v":""}]
[{"$f":"IF(Score!B129>0,Score!A129,\"\")","v":""},{"$f":"IF(Score!B129>0,IF(COUNTIF($E$3:E130,E130)>7,\"\",MAX($B$3:B129)+1),\"\")","v":""},{"$f":"IF(Score!B129>0,Score!B129,\"\")","v":""},{"$f":"IF(Score!B129>0,VLOOKUP(C130,Entrants!$A$2:$E$5000,3,FALSE),\"\")","v":""},{"$f":"IF(Score!B129>0,VLOOKUP(C130,Entrants!$A$2:$E$5000,2,FALSE),\"\")","v":""},{"$f":"IF(Score!B129>0,VLOOKUP(C130,Entrants!$A$2:$E$5000,4,FALSE),\"\")","v":""},{"$f":"IF(Score!C129>0,Score!C129,\"\")","v":""}]
[{"$f":"IF(Score!B130>0,Score!A130,\"\")","v":""},{"$f":"IF(Score!B130>0,IF(COUNTIF($E$3:E131,E131)>7,\"\",MAX($B$3:B130)+1),\"\")","v":""},{"$f":"IF(Score!B130>0,Score!B130,\"\")","v":""},{"$f":"IF(Score!B130>0,VLOOKUP(C131,Entrants!$A$2:$E$5000,3,FALSE),\"\")","v":""},{"$f":"IF(Score!B130>0,VLOOKUP(C131,Entrants!$A$2:$E$5000,2,FALSE),\"\")","v":""},{"$f":"IF(Score!B130>0,VLOOKUP(C131,Entrants!$A$2:$E$5000,4,FALSE),\"\")","v":""},{"$f":"IF(Score!C130>0,Score!C130,\"\")","v":""}]
[{"$f":"IF(Score!B131>0,Score!A131,\"\")","v":""},{"$f":"IF(Score!B131>0,IF(COUNTIF($E$3:E132,E132)>7,\"\",MAX($B$3:B131)+1),\"\")","v":""},{"$f":"IF(Score!B131>0,Score!B131,\"\")","v":""},{"$f":"IF(Score!B131>0,VLOOKUP(C132,Entrants!$A$2:$E$5000,3,FALSE),\"\")","v":""},{"$f":"IF(Score!B131>0,VLOOKUP(C132,Entrants!$A$2:$E$5000,2,FALSE),\"\")","v":""},{"$f":"IF(Score!B131>0,VLOOKUP(C132,Entrants!$A$2:$E$5000,4,FALSE),\"\")","v":""},{"$f":"IF(Score!C131>0,Score!C131,\"\")","v":""}]
[{"$f":"IF(Score!B132>0,Score!A132,\"\")","v":""},{"$f":"IF(Score!B132>0,IF(COUNTIF($E$3:E133,E133)>7,\"\",MAX($B$3:B132)+1),\"\")","v":""},{"$f":"IF(Score!B132>0,Score!B132,\"\")","v":""},{"$f":"IF(Score!B132>0,VLOOKUP(C133,Entrants!$A$2:$E$5000,3,FALSE),\"\")","v":""},{"$f":"IF(Score!B132>0,VLOOKUP(C133,Entrants!$A$2:$E$5000,2,FALSE),\"\")","v":""},{"$f":"IF(Score!B132>0,VLOOKUP(C133,Entrants!$A$2:$E$5000,4,FALSE),\"\")","v":""},{"$f":"IF(Score!C132>0,Score!C132,\"\")","v":""}]
[{"$f":"IF(Score!B133>0,Score!A133,\"\")","v":""},{"$f":"IF(Score!B133>0,IF(COUNTIF($E$3:E134,E134)>7,\"\",MAX($B$3:B133)+1),\"\")","v":""},{"$f":"IF(Score!B133>0,Score!B133,\"\")","v":""},{"$f":"IF(Score!B133>0,VLOOKUP(C134,Entrants!$A$2:$E$5000,3,FALSE),\"\")","v":""},{"$f":"IF(Score!B133>0,VLOOKUP(C134,Entrants!$A$2:$E$5000,2,FALSE),\"\")","v":""},{"$f":"IF(Score!B133>0,VLOOKUP(C134,Entrants!$A$2:$E$5000,4,FALSE),\"\")","v":""},{"$f":"IF(Score!C133>0,Score!C133,\"\")","v":""}]
[{"$f":"IF(Score!B134>0,Score!A134,\"\")","v":""},{"$f":"IF(Score!B134>0,IF(COUNTIF($E$3:E135,E135)>7,\"\",MAX($B$3:B134)+1),\"\")","v":""},{"$f":"IF(Score!B134>0,Score!B134,\"\")","v":""},{"$f":"IF(Score!B134>0,VLOOKUP(C135,Entrants!$A$2:$E$5000,3,FALSE),\"\")","v":""},{"$f":"IF(Score!B134>0,VLOOKUP(C135,Entrants!$A$2:$E$5000,2,FALSE),\"\")","v":""},{"$f":"IF(Score!B134>0,VLOOKUP(C135,Entrants!$A$2:$E$5000,4,FALSE),\"\")","v":""},{"$f":"IF(Score!C134>0,Score!C134,\"\")","v":""}]
[{"$f":"IF(Score!B135>0,Score!A135,\"\")","v":""},{"$f":"IF(Score!B135>0,IF(COUNTIF($E$3:E136,E136)>7,\"\",MAX($B$3:B135)+1),\"\")","v":""},{"$f":"IF(Score!B135>0,Score!B135,\"\")","v":""},{"$f":"IF(Score!B135>0,VLOOKUP(C136,Entrants!$A$2:$E$5000,3,FALSE),\"\")","v":""},{"$f":"IF(Score!B135>0,VLOOKUP(C136,Entrants!$A$2:$E$5000,2,FALSE),\"\")","v":""},{"$f":"IF(Score!B135>0,VLOOKUP(C136,Entrants!$A$2:$E$5000,4,FALSE),\"\")","v":""},{"$f":"IF(Score!C135>0,Score!C135,\"\")","v":""}]
[{"$f":"IF(Score!B136>0,Score!A136,\"\")","v":""},{"$f":"IF(Score!B136>0,IF(COUNTIF($E$3:E137,E137)>7,\"\",MAX($B$3:B136)+1),\"\")","v":""},{"$f":"IF(Score!B136>0,Score!B136,\"\")","v":""},{"$f":"IF(Score!B136>0,VLOOKUP(C137,Entrants!$A$2:$E$5000,3,FALSE),\"\")","v":""},{"$f":"IF(Score!B136>0,VLOOKUP(C137,Entrants!$A$2:$E$5000,2,FALSE),\"\")","v":""},{"$f":"IF(Score!B136>0,VLOOKUP(C137,Entrants!$A$2:$E$5000,4,FALSE),\"\")","v":""},{"$f":"IF(Score!C136>0,Score!C136,\"\")","v":""}]
[{"$f":"IF(Score!B137>0,Score!A137,\"\")","v":""},{"$f":"IF(Score!B137>0,IF(COUNTIF($E$3:E138,E138)>7,\"\",MAX($B$3:B137)+1),\"\")","v":""},{"$f":"IF(Score!B137>0,Score!B137,\"\")","v":""},{"$f":"IF(Score!B137>0,VLOOKUP(C138,Entrants!$A$2:$E$5000,3,FALSE),\"\")","v":""},{"$f":"IF(Score!B137>0,VLOOKUP(C138,Entrants!$A$2:$E$5000,2,FALSE),\"\")","v":""},{"$f":"IF(Score!B137>0,VLOOKUP(C138,Entrants!$A$2:$E$5000,4,FALSE),\"\")","v":""},{"$f":"IF(Score!C137>0,Score!C137,\"\")","v":""}]
[{"$f":"IF(Score!B138>0,Score!A138,\"\")","v":""},{"$f":"IF(Score!B138>0,IF(COUNTIF($E$3:E139,E139)>7,\"\",MAX($B$3:B138)+1),\"\")","v":""},{"$f":"IF(Score!B138>0,Score!B138,\"\")","v":""},{"$f":"IF(Score!B138>0,VLOOKUP(C139,Entrants!$A$2:$E$5000,3,FALSE),\"\")","v":""},{"$f":"IF(Score!B138>0,VLOOKUP(C139,Entrants!$A$2:$E$5000,2,FALSE),\"\")","v":""},{"$f":"IF(Score!B138>0,VLOOKUP(C139,Entrants!$A$2:$E$5000,4,FALSE),\"\")","v":""},{"$f":"IF(Score!C138>0,Score!C138,\"\")","v":""}]
[{"$f":"IF(Score!B139>0,Score!A139,\"\")","v":""},{"$f":"IF(Score!B139>0,IF(COUNTIF($E$3:E140,E140)>7,\"\",MAX($B$3:B139)+1),\"\")","v":""},{"$f":"IF(Score!B139>0,Score!B139,\"\")","v":""},{"$f":"IF(Score!B139>0,VLOOKUP(C140,Entrants!$A$2:$E$5000,3,FALSE),\"\")","v":""},{"$f":"IF(Score!B139>0,VLOOKUP(C140,Entrants!$A$2:$E$5000,2,FALSE),\"\")","v":""},{"$f":"IF(Score!B139>0,VLOOKUP(C140,Entrants!$A$2:$E$5000,4,FALSE),\"\")","v":""},{"$f":"IF(Score!C139>0,Score!C139,\"\")","v":""}]
[{"$f":"IF(Score!B140>0,Score!A140,\"\")","v":""},{"$f":"IF(Score!B140>0,IF(COUNTIF($E$3:E141,E141)>7,\"\",MAX($B$3:B140)+1),\"\")","v":""},{"$f":"IF(Score!B140>0,Score!B140,\"\")","v":""},{"$f":"IF(Score!B140>0,VLOOKUP(C141,Entrants!$A$2:$E$5000,3,FALSE),\"\")","v":""},{"$f":"IF(Score!B140>0,VLOOKUP(C141,Entrants!$A$2:$E$5000,2,FALSE),\"\")","v":""},{"$f":"IF(Score!B140>0,VLOOKUP(C141,Entrants!$A$2:$E$5000,4,FALSE),\"\")","v":""},{"$f":"IF(Score!C140>0,Score!C140,\"\")","v":""}]
[{"$f":"IF(Score!B141>0,Score!A141,\"\")","v":""},{"$f":"IF(Score!B141>0,IF(COUNTIF($E$3:E142,E142)>7,\"\",MAX($B$3:B141)+1),\"\")","v":""},{"$f":"IF(Score!B141>0,Score!B141,\"\")","v":""},{"$f":"IF(Score!B141>0,VLOOKUP(C142,Entrants!$A$2:$E$5000,3,FALSE),\"\")","v":""},{"$f":"IF(Score!B141>0,VLOOKUP(C142,Entrants!$A$2:$E$5000,2,FALSE),\"\")","v":""},{"$f":"IF(Score!B141>0,VLOOKUP(C142,Entrants!$A$2:$E$5000,4,FALSE),\"\")","v":""},{"$f":"IF(Score!C141>0,Score!C141,\"\")","v":""}]
[{"$f":"IF(Score!B142>0,Score!A142,\"\")","v":""},{"$f":"IF(Score!B142>0,IF(COUNTIF($E$3:E143,E143)>7,\"\",MAX($B$3:B142)+1),\"\")","v":""},{"$f":"IF(Score!B142>0,Score!B142,\"\")","v":""},{"$f":"IF(Score!B142>0,VLOOKUP(C143,Entrants!$A$2:$E$5000,3,FALSE),\"\")","v":""},{"$f":"IF(Score!B142>0,VLOOKUP(C143,Entrants!$A$2:$E$5000,2,FALSE),\"\")","v":""},{"$f":"IF(Score!B142>0,VLOOKUP(C143,Entrants!$A$2:$E$5000,4,FALSE),\"\")","v":""},{"$f":"IF(Score!C142>0,Score!C142,\"\")","v":""}]
[{"$f":"IF(Score!B143>0,Score!A143,\"\")","v":""},{"$f":"IF(Score!B143>0,IF(COUNTIF($E$3:E144,E144)>7,\"\",MAX($B$3:B143)+1),\"\")","v":""},{"$f":"IF(Score!B143>0,Score!B143,\"\")","v":""},{"$f":"IF(Score!B143>0,VLOOKUP(C144,Entrants!$A$2:$E$5000,3,FALSE),\"\")","v":""},{"$f":"IF(Score!B143>0,VLOOKUP(C144,Entrants!$A$2:$E$5000,2,FALSE),\"\")","v":""},{"$f":"IF(Score!B143>0,VLOOKUP(C144,Entrants!$A$2:$E$5000,4,FALSE),\"\")","v":""},{"$f":"IF(Score!C143>0,Score!C143,\"\")","v":""}]
[{"$f":"IF(Score!B144>0,Score!A144,\"\")","v":""},{"$f":"IF(Score!B144>0,IF(COUNTIF($E$3:E145,E145)>7,\"\",MAX($B$3:B144)+1),\"\")","v":""},{"$f":"IF(Score!B144>0,Score!B144,\"\")","v":""},{"$f":"IF(Score!B144>0,VLOOKUP(C145,Entrants!$A$2:$E$5000,3,FALSE),\"\")","v":""},{"$f":"IF(Score!B144>0,VLOOKUP(C145,Entrants!$A$2:$E$5000,2,FALSE),\"\")","v":""},{"$f":"IF(Score!B144>0,VLOOKUP(C145,Entrants!$A$2:$E$5000,4,FALSE),\"\")","v":""},{"$f":"IF(Score!C144>0,Score!C144,\"\")","v":""}]
[{"$f":"IF(Score!B145>0,Score!A145,\"\")","v":""},{"$f":"IF(Score!B145>0,IF(COUNTIF($E$3:E146,E146)>7,\"\",MAX($B$3:B145)+1),\"\")","v":""},{"$f":"IF(Score!B145>0,Score!B145,\"\")","v":""},{"$f":"IF(Score!B145>0,VLOOKUP(C146,Entrants!$A$2:$E$5000,3,FALSE),\"\")","v":""},{"$f":"IF(Score!B145>0,VLOOKUP(C146,Entrants!$A$2:$E$5000,2,FALSE),\"\")","v":""},{"$f":"IF(Score!B145>0,VLOOKUP(C146,Entrants!$A$2:$E$5000,4,FALSE),\"\")","v":""},{"$f":"IF(Score!C145>0,Score!C145,\"\")","v":""}]
[{"$f":"IF(Score!B146>0,Score!A146,\"\")","v":""},{"$f":"IF(Score!B146>0,IF(COUNTIF($E$3:E147,E147)>7,\"\",MAX($B$3:B146)+1),\"\")","v":""},{"$f":"IF(Score!B146>0,Score!B146,\"\")","v":""},{"$f":"IF(Score!B146>0,VLOOKUP(C147,Entrants!$A$2:$E$5000,3,FALSE),\"\")","v":""},{"$f":"IF(Score!B146>0,VLOOKUP(C147,Entrants!$A$2:$E$5000,2,FALSE),\"\")","v":""},{"$f":"IF(Score!B146>0,VLOOKUP(C147,Entrants!$A$2:$E$5000,4,FALSE),\"\")","v":""},{"$f":"IF(Score!C146>0,Score!C146,\"\")","v":""}]
[{"$f":"IF(Score!B147>0,Score!A147,\"\")","v":""},{"$f":"IF(Score!B147>0,IF(COUNTIF($E$3:E148,E148)>7,\"\",MAX($B$3:B147)+1),\"\")","v":""},{"$f":"IF(Score!B147>0,Score!B147,\"\")","v":""},{"$f":"IF(Score!B147>0,VLOOKUP(C148,Entrants!$A$2:$E$5000,3,FALSE),\"\")","v":""},{"$f":"IF(Score!B147>0,VLOOKUP(C148,Entrants!$A$2:$E$5000,2,FALSE),\"\")","v":""},{"$f":"IF(Score!B147>0,VLOOKUP(C148,Entrants!$A$2:$E$5000,4,FALSE),\"\")","v":""},{"$f":"IF(Score!C147>0,Score!C147,\"\")","v":""}]
[{"$f":"IF(Score!B148>0,Score!A148,\"\")","v":""},{"$f":"IF(Score!B148>0,IF(COUNTIF($E$3:E149,E149)>7,\"\",MAX($B$3:B148)+1),\"\")","v":""},{"$f":"IF(Score!B148>0,Score!B148,\"\")","v":""},{"$f":"IF(Score!B148>0,VLOOKUP(C149,Entrants!$A$2:$E$5000,3,FALSE),\"\")","v":""},{"$f":"IF(Score!B148>0,VLOOKUP(C149,Entrants!$A$2:$E$5000,2,FALSE),\"\")","v":""},{"$f":"IF(Score!B148>0,VLOOKUP(C149,Entrants!$A$2:$E$5000,4,FALSE),\"\")","v":""},{"$f":"IF(Score!C148>0,Score!C148,\"\")","v":""}]
[{"$f":"IF(Score!B149>0,Score!A149,\"\")","v":""},{"$f":"IF(Score!B149>0,IF(COUNTIF($E$3:E150,E150)>7,\"\",MAX($B$3:B149)+1),\"\")","v":""},{"$f":"IF(Score!B149>0,Score!B149,\"\")","v":""},{"$f":"IF(Score!B149>0,VLOOKUP(C150,Entrants!$A$2:$E$5000,3,FALSE),\"\")","v":""},{"$f":"IF(Score!B149>0,VLOOKUP(C150,Entrants!$A$2:$E$5000,2,FALSE),\"\")","v":""},{"$f":"IF(Score!B149>0,VLOOKUP(C150,Entrants!$A$2:$E$5000,4,FALSE),\"\")","v":""},{"$f":"IF(Score!C149>0,Score!C149,\"\")","v":""}]
[{"$f":"IF(Score!B150>0,Score!A150,\"\")","v":""},{"$f":"IF(Score!B150>0,IF(COUNTIF($E$3:E151,E151)>7,\"\",MAX($B$3:B150)+1),\"\")","v":""},{"$f":"IF(Score!B150>0,Score!B150,\"\")","v":""},{"$f":"IF(Score!B150>0,VLOOKUP(C151,Entrants!$A$2:$E$5000,3,FALSE),\"\")","v":""},{"$f":"IF(Score!B150>0,VLOOKUP(C151,Entrants!$A$2:$E$5000,2,FALSE),\"\")","v":""},{"$f":"IF(Score!B150>0,VLOOKUP(C151,Entrants!$A$2:$E$5000,4,FALSE),\"\")","v":""},{"$f":"IF(Score!C150>0,Score!C150,\"\")","v":""}]
[{"$f":"IF(Score!B151>0,Score!A151,\"\")","v":""},{"$f":"IF(Score!B151>0,IF(COUNTIF($E$3:E152,E152)>7,\"\",MAX($B$3:B151)+1),\"\")","v":""},{"$f":"IF(Score!B151>0,Score!B151,\"\")","v":""},{"$f":"IF(Score!B151>0,VLOOKUP(C152,Entrants!$A$2:$E$5000,3,FALSE),\"\")","v":""},{"$f":"IF(Score!B151>0,VLOOKUP(C152,Entrants!$A$2:$E$5000,2,FALSE),\"\")","v":""},{"$f":"IF(Score!B151>0,VLOOKUP(C152,Entrants!$A$2:$E$5000,4,FALSE),\"\")","v":""},{"$f":"IF(Score!C151>0,Score!C151,\"\")","v":""}]
[{"$f":"IF(Score!B152>0,Score!A152,\"\")","v":""},{"$f":"IF(Score!B152>0,IF(COUNTIF($E$3:E153,E153)>7,\"\",MAX($B$3:B152)+1),\"\")","v":""},{"$f":"IF(Score!B152>0,Score!B152,\"\")","v":""},{"$f":"IF(Score!B152>0,VLOOKUP(C153,Entrants!$A$2:$E$5000,3,FALSE),\"\")","v":""},{"$f":"IF(Score!B152>0,VLOOKUP(C153,Entrants!$A$2:$E$5000,2,FALSE),\"\")","v":""},{"$f":"IF(Score!B152>0,VLOOKUP(C153,Entrants!$A$2:$E$5000,4,FALSE),\"\")","v":""},{"$f":"IF(Score!C152>0,Score!C152,\"\")","v":""}]
[{"$f":"IF(Score!B153>0,Score!A153,\"\")","v":""},{"$f":"IF(Score!B153>0,IF(COUNTIF($E$3:E154,E154)>7,\"\",MAX($B$3:B153)+1),\"\")","v":""},{"$f":"IF(Score!B153>0,Score!B153,\"\")","v":""},{"$f":"IF(Score!B153>0,VLOOKUP(C154,Entrants!$A$2:$E$5000,3,FALSE),\"\")","v":""},{"$f":"IF(Score!B153>0,VLOOKUP(C154,Entrants!$A$2:$E$5000,2,FALSE),\"\")","v":""},{"$f":"IF(Score!B153>0,VLOOKUP(C154,Entrants!$A$2:$E$5000,4,FALSE),\"\")","v":""},{"$f":"IF(Score!C153>0,Score!C153,\"\")","v":""}]
[{"$f":"IF(Score!B154>0,Score!A154,\"\")","v":""},{"$f":"IF(Score!B154>0,IF(COUNTIF($E$3:E155,E155)>7,\"\",MAX($B$3:B154)+1),\"\")","v":""},{"$f":"IF(Score!B154>0,Score!B154,\"\")","v":""},{"$f":"IF(Score!B154>0,VLOOKUP(C155,Entrants!$A$2:$E$5000,3,FALSE),\"\")","v":""},{"$f":"IF(Score!B154>0,VLOOKUP(C155,Entrants!$A$2:$E$5000,2,FALSE),\"\")","v":""},{"$f":"IF(Score!B154>0,VLOOKUP(C155,Entrants!$A$2:$E$5000,4,FALSE),\"\")","v":""},{"$f":"IF(Score!C154>0,Score!C154,\"\")","v":""}]
[{"$f":"IF(Score!B155>0,Score!A155,\"\")","v":""},{"$f":"IF(Score!B155>0,IF(COUNTIF($E$3:E156,E156)>7,\"\",MAX($B$3:B155)+1),\"\")","v":""},{"$f":"IF(Score!B155>0,Score!B155,\"\")","v":""},{"$f":"IF(Score!B155>0,VLOOKUP(C156,Entrants!$A$2:$E$5000,3,FALSE),\"\")","v":""},{"$f":"IF(Score!B155>0,VLOOKUP(C156,Entrants!$A$2:$E$5000,2,FALSE),\"\")","v":""},{"$f":"IF(Score!B155>0,VLOOKUP(C156,Entrants!$A$2:$E$5000,4,FALSE),\"\")","v":""},{"$f":"IF(Score!C155>0,Score!C155,\"\")","v":""}]
[{"$f":"IF(Score!B156>0,Score!A156,\"\")","v":""},{"$f":"IF(Score!B156>0,IF(COUNTIF($E$3:E157,E157)>7,\"\",MAX($B$3:B156)+1),\"\")","v":""},{"$f":"IF(Score!B156>0,Score!B156,\"\")","v":""},{"$f":"IF(Score!B156>0,VLOOKUP(C157,Entrants!$A$2:$E$5000,3,FALSE),\"\")","v":""},{"$f":"IF(Score!B156>0,VLOOKUP(C157,Entrants!$A$2:$E$5000,2,FALSE),\"\")","v":""},{"$f":"IF(Score!B156>0,VLOOKUP(C157,Entrants!$A$2:$E$5000,4,FALSE),\"\")","v":""},{"$f":"IF(Score!C156>0,Score!C156,\"\")","v":""}]
[{"$f":"IF(Score!B157>0,Score!A157,\"\")","v":""},{"$f":"IF(Score!B157>0,IF(COUNTIF($E$3:E158,E158)>7,\"\",MAX($B$3:B157)+1),\"\")","v":""},{"$f":"IF(Score!B157>0,Score!B157,\"\")","v":""},{"$f":"IF(Score!B157>0,VLOOKUP(C158,Entrants!$A$2:$E$5000,3,FALSE),\"\")","v":""},{"$f":"IF(Score!B157>0,VLOOKUP(C158,Entrants!$A$2:$E$5000,2,FALSE),\"\")","v":""},{"$f":"IF(Score!B157>0,VLOOKUP(C158,Entrants!$A$2:$E$5000,4,FALSE),\"\")","v":""},{"$f":"IF(Score!C157>0,Score!C157,\"\")","v":""}]
[{"$f":"IF(Score!B158>0,Score!A158,\"\")","v":""},{"$f":"IF(Score!B158>0,IF(COUNTIF($E$3:E159,E159)>7,\"\",MAX($B$3:B158)+1),\"\")","v":""},{"$f":"IF(Score!B158>0,Score!B158,\"\")","v":""},{"$f":"IF(Score!B158>0,VLOOKUP(C159,Entrants!$A$2:$E$5000,3,FALSE),\"\")","v":""},{"$f":"IF(Score!B158>0,VLOOKUP(C159,Entrants!$A$2:$E$5000,2,FALSE),\"\")","v":""},{"$f":"IF(Score!B158>0,VLOOKUP(C159,Entrants!$A$2:$E$5000,4,FALSE),\"\")","v":""},{"$f":"IF(Score!C158>0,Score!C158,\"\")","v":""}]
[{"$f":"IF(Score!B159>0,Score!A159,\"\")","v":""},{"$f":"IF(Score!B159>0,IF(COUNTIF($E$3:E160,E160)>7,\"\",MAX($B$3:B159)+1),\"\")","v":""},{"$f":"IF(Score!B159>0,Score!B159,\"\")","v":""},{"$f":"IF(Score!B159>0,VLOOKUP(C160,Entrants!$A$2:$E$5000,3,FALSE),\"\")","v":""},{"$f":"IF(Score!B159>0,VLOOKUP(C160,Entrants!$A$2:$E$5000,2,FALSE),\"\")","v":""},{"$f":"IF(Score!B159>0,VLOOKUP(C160,Entrants!$A$2:$E$5000,4,FALSE),\"\")","v":""},{"$f":"IF(Score!C159>0,Score!C159,\"\")","v":""}]
[{"$f":"IF(Score!B160>0,Score!A160,\"\")","v":""},{"$f":"IF(Score!B160>0,IF(COUNTIF($E$3:E161,E161)>7,\"\",MAX($B$3:B160)+1),\"\")","v":""},{"$f":"IF(Score!B160>0,Score!B160,\"\")","v":""},{"$f":"IF(Score!B160>0,VLOOKUP(C161,Entrants!$A$2:$E$5000,3,FALSE),\"\")","v":""},{"$f":"IF(Score!B160>0,VLOOKUP(C161,Entrants!$A$2:$E$5000,2,FALSE),\"\")","v":""},{"$f":"IF(Score!B160>0,VLOOKUP(C161,Entrants!$A$2:$E$5000,4,FALSE),\"\")","v":""},{"$f":"IF(Score!C160>0,Score!C160,\"\")","v":""}]
[{"$f":"IF(Score!B161>0,Score!A161,\"\")","v":""},{"$f":"IF(Score!B161>0,IF(COUNTIF($E$3:E162,E162)>7,\"\",MAX($B$3:B161)+1),\"\")","v":""},{"$f":"IF(Score!B161>0,Score!B161,\"\")","v":""},{"$f":"IF(Score!B161>0,VLOOKUP(C162,Entrants!$A$2:$E$5000,3,FALSE),\"\")","v":""},{"$f":"IF(Score!B161>0,VLOOKUP(C162,Entrants!$A$2:$E$5000,2,FALSE),\"\")","v":""},{"$f":"IF(Score!B161>0,VLOOKUP(C162,Entrants!$A$2:$E$5000,4,FALSE),\"\")","v":""},{"$f":"IF(Score!C161>0,Score!C161,\"\")","v":""}]
[{"$f":"IF(Score!B162>0,Score!A162,\"\")","v":""},{"$f":"IF(Score!B162>0,IF(COUNTIF($E$3:E163,E163)>7,\"\",MAX($B$3:B162)+1),\"\")","v":""},{"$f":"IF(Score!B162>0,Score!B162,\"\")","v":""},{"$f":"IF(Score!B162>0,VLOOKUP(C163,Entrants!$A$2:$E$5000,3,FALSE),\"\")","v":""},{"$f":"IF(Score!B162>0,VLOOKUP(C163,Entrants!$A$2:$E$5000,2,FALSE),\"\")","v":""},{"$f":"IF(Score!B162>0,VLOOKUP(C163,Entrants!$A$2:$E$5000,4,FALSE),\"\")","v":""},{"$f":"IF(Score!C162>0,Score!C162,\"\")","v":""}]
[{"$f":"IF(Score!B163>0,Score!A163,\"\")","v":""},{"$f":"IF(Score!B163>0,IF(COUNTIF($E$3:E164,E164)>7,\"\",MAX($B$3:B163)+1),\"\")","v":""},{"$f":"IF(Score!B163>0,Score!B163,\"\")","v":""},{"$f":"IF(Score!B163>0,VLOOKUP(C164,Entrants!$A$2:$E$5000,3,FALSE),\"\")","v":""},{"$f":"IF(Score!B163>0,VLOOKUP(C164,Entrants!$A$2:$E$5000,2,FALSE),\"\")","v":""},{"$f":"IF(Score!B163>0,VLOOKUP(C164,Entrants!$A$2:$E$5000,4,FALSE),\"\")","v":""},{"$f":"IF(Score!C163>0,Score!C163,\"\")","v":""}]
[{"$f":"IF(Score!B164>0,Score!A164,\"\")","v":""},{"$f":"IF(Score!B164>0,IF(COUNTIF($E$3:E165,E165)>7,\"\",MAX($B$3:B164)+1),\"\")","v":""},{"$f":"IF(Score!B164>0,Score!B164,\"\")","v":""},{"$f":"IF(Score!B164>0,VLOOKUP(C165,Entrants!$A$2:$E$5000,3,FALSE),\"\")","v":""},{"$f":"IF(Score!B164>0,VLOOKUP(C165,Entrants!$A$2:$E$5000,2,FALSE),\"\")","v":""},{"$f":"IF(Score!B164>0,VLOOKUP(C165,Entrants!$A$2:$E$5000,4,FALSE),\"\")","v":""},{"$f":"IF(Score!C164>0,Score!C164,\"\")","v":""}]
[{"$f":"IF(Score!B165>0,Score!A165,\"\")","v":""},{"$f":"IF(Score!B165>0,IF(COUNTIF($E$3:E166,E166)>7,\"\",MAX($B$3:B165)+1),\"\")","v":""},{"$f":"IF(Score!B165>0,Score!B165,\"\")","v":""},{"$f":"IF(Score!B165>0,VLOOKUP(C166,Entrants!$A$2:$E$5000,3,FALSE),\"\")","v":""},{"$f":"IF(Score!B165>0,VLOOKUP(C166,Entrants!$A$2:$E$5000,2,FALSE),\"\")","v":""},{"$f":"IF(Score!B165>0,VLOOKUP(C166,Entrants!$A$2:$E$5000,4,FALSE),\"\")","v":""},{"$f":"IF(Score!C165>0,Score!C165,\"\")","v":""}]
[{"$f":"IF(Score!B166>0,Score!A166,\"\")","v":""},{"$f":"IF(Score!B166>0,IF(COUNTIF($E$3:E167,E167)>7,\"\",MAX($B$3:B166)+1),\"\")","v":""},{"$f":"IF(Score!B166>0,Score!B166,\"\")","v":""},{"$f":"IF(Score!B166>0,VLOOKUP(C167,Entrants!$A$2:$E$5000,3,FALSE),\"\")","v":""},{"$f":"IF(Score!B166>0,VLOOKUP(C167,Entrants!$A$2:$E$5000,2,FALSE),\"\")","v":""},{"$f":"IF(Score!B166>0,VLOOKUP(C167,Entrants!$A$2:$E$5000,4,FALSE),\"\")","v":""},{"$f":"IF(Score!C166>0,Score!C166,\"\")","v":""}]
[{"$f":"IF(Score!B167>0,Score!A167,\"\")","v":""},{"$f":"IF(Score!B167>0,IF(COUNTIF($E$3:E168,E168)>7,\"\",MAX($B$3:B167)+1),\"\")","v":""},{"$f":"IF(Score!B167>0,Score!B167,\"\")","v":""},{"$f":"IF(Score!B167>0,VLOOKUP(C168,Entrants!$A$2:$E$5000,3,FALSE),\"\")","v":""},{"$f":"IF(Score!B167>0,VLOOKUP(C168,Entrants!$A$2:$E$5000,2,FALSE),\"\")","v":""},{"$f":"IF(Score!B167>0,VLOOKUP(C168,Entrants!$A$2:$E$5000,4,FALSE),\"\")","v":""},{"$f":"IF(Score!C167>0,Score!C167,\"\")","v":""}]
[{"$f":"IF(Score!B168>0,Score!A168,\"\")","v":""},{"$f":"IF(Score!B168>0,IF(COUNTIF($E$3:E169,E169)>7,\"\",MAX($B$3:B168)+1),\"\")","v":""},{"$f":"IF(Score!B168>0,Score!B168,\"\")","v":""},{"$f":"IF(Score!B168>0,VLOOKUP(C169,Entrants!$A$2:$E$5000,3,FALSE),\"\")","v":""},{"$f":"IF(Score!B168>0,VLOOKUP(C169,Entrants!$A$2:$E$5000,2,FALSE),\"\")","v":""},{"$f":"IF(Score!B168>0,VLOOKUP(C169,Entrants!$A$2:$E$5000,4,FALSE),\"\")","v":""},{"$f":"IF(Score!C168>0,Score!C168,\"\")","v":""}]
[{"$f":"IF(Score!B169>0,Score!A169,\"\")","v":""},{"$f":"IF(Score!B169>0,IF(COUNTIF($E$3:E170,E170)>7,\"\",MAX($B$3:B169)+1),\"\")","v":""},{"$f":"IF(Score!B169>0,Score!B169,\"\")","v":""},{"$f":"IF(Score!B169>0,VLOOKUP(C170,Entrants!$A$2:$E$5000,3,FALSE),\"\")","v":""},{"$f":"IF(Score!B169>0,VLOOKUP(C170,Entrants!$A$2:$E$5000,2,FALSE),\"\")","v":""},{"$f":"IF(Score!B169>0,VLOOKUP(C170,Entrants!$A$2:$E$5000,4,FALSE),\"\")","v":""},{"$f":"IF(Score!C169>0,Score!C169,\"\")","v":""}]
[{"$f":"IF(Score!B170>0,Score!A170,\"\")","v":""},{"$f":"IF(Score!B170>0,IF(COUNTIF($E$3:E171,E171)>7,\"\",MAX($B$3:B170)+1),\"\")","v":""},{"$f":"IF(Score!B170>0,Score!B170,\"\")","v":""},{"$f":"IF(Score!B170>0,VLOOKUP(C171,Entrants!$A$2:$E$5000,3,FALSE),\"\")","v":""},{"$f":"IF(Score!B170>0,VLOOKUP(C171,Entrants!$A$2:$E$5000,2,FALSE),\"\")","v":""},{"$f":"IF(Score!B170>0,VLOOKUP(C171,Entrants!$A$2:$E$5000,4,FALSE),\"\")","v":""},{"$f":"IF(Score!C170>0,Score!C170,\"\")","v":""}]
[{"$f":"IF(Score!B171>0,Score!A171,\"\")","v":""},{"$f":"IF(Score!B171>0,IF(COUNTIF($E$3:E172,E172)>7,\"\",MAX($B$3:B171)+1),\"\")","v":""},{"$f":"IF(Score!B171>0,Score!B171,\"\")","v":""},{"$f":"IF(Score!B171>0,VLOOKUP(C172,Entrants!$A$2:$E$5000,3,FALSE),\"\")","v":""},{"$f":"IF(Score!B171>0,VLOOKUP(C172,Entrants!$A$2:$E$5000,2,FALSE),\"\")","v":""},{"$f":"IF(Score!B171>0,VLOOKUP(C172,Entrants!$A$2:$E$5000,4,FALSE),\"\")","v":""},{"$f":"IF(Score!C171>0,Score!C171,\"\")","v":""}]
[{"$f":"IF(Score!B172>0,Score!A172,\"\")","v":""},{"$f":"IF(Score!B172>0,IF(COUNTIF($E$3:E173,E173)>7,\"\",MAX($B$3:B172)+1),\"\")","v":""},{"$f":"IF(Score!B172>0,Score!B172,\"\")","v":""},{"$f":"IF(Score!B172>0,VLOOKUP(C173,Entrants!$A$2:$E$5000,3,FALSE),\"\")","v":""},{"$f":"IF(Score!B172>0,VLOOKUP(C173,Entrants!$A$2:$E$5000,2,FALSE),\"\")","v":""},{"$f":"IF(Score!B172>0,VLOOKUP(C173,Entrants!$A$2:$E$5000,4,FALSE),\"\")","v":""},{"$f":"IF(Score!C172>0,Score!C172,\"\")","v":""}]
[{"$f":"IF(Score!B173>0,Score!A173,\"\")","v":""},{"$f":"IF(Score!B173>0,IF(COUNTIF($E$3:E174,E174)>7,\"\",MAX($B$3:B173)+1),\"\")","v":""},{"$f":"IF(Score!B173>0,Score!B173,\"\")","v":""},{"$f":"IF(Score!B173>0,VLOOKUP(C174,Entrants!$A$2:$E$5000,3,FALSE),\"\")","v":""},{"$f":"IF(Score!B173>0,VLOOKUP(C174,Entrants!$A$2:$E$5000,2,FALSE),\"\")","v":""},{"$f":"IF(Score!B173>0,VLOOKUP(C174,Entrants!$A$2:$E$5000,4,FALSE),\"\")","v":""},{"$f":"IF(Score!C173>0,Score!C173,\"\")","v":""}]
[{"$f":"IF(Score!B174>0,Score!A174,\"\")","v":""},{"$f":"IF(Score!B174>0,IF(COUNTIF($E$3:E175,E175)>7,\"\",MAX($B$3:B174)+1),\"\")","v":""},{"$f":"IF(Score!B174>0,Score!B174,\"\")","v":""},{"$f":"IF(Score!B174>0,VLOOKUP(C175,Entrants!$A$2:$E$5000,3,FALSE),\"\")","v":""},{"$f":"IF(Score!B174>0,VLOOKUP(C175,Entrants!$A$2:$E$5000,2,FALSE),\"\")","v":""},{"$f":"IF(Score!B174>0,VLOOKUP(C175,Entrants!$A$2:$E$5000,4,FALSE),\"\")","v":""},{"$f":"IF(Score!C174>0,Score!C174,\"\")","v":""}]
[{"$f":"IF(Score!B175>0,Score!A175,\"\")","v":""},{"$f":"IF(Score!B175>0,IF(COUNTIF($E$3:E176,E176)>7,\"\",MAX($B$3:B175)+1),\"\")","v":""},{"$f":"IF(Score!B175>0,Score!B175,\"\")","v":""},{"$f":"IF(Score!B175>0,VLOOKUP(C176,Entrants!$A$2:$E$5000,3,FALSE),\"\")","v":""},{"$f":"IF(Score!B175>0,VLOOKUP(C176,Entrants!$A$2:$E$5000,2,FALSE),\"\")","v":""},{"$f":"IF(Score!B175>0,VLOOKUP(C176,Entrants!$A$2:$E$5000,4,FALSE),\"\")","v":""},{"$f":"IF(Score!C175>0,Score!C175,\"\")","v":""}]
[{"$f":"IF(Score!B176>0,Score!A176,\"\")","v":""},{"$f":"IF(Score!B176>0,IF(COUNTIF($E$3:E177,E177)>7,\"\",MAX($B$3:B176)+1),\"\")","v":""},{"$f":"IF(Score!B176>0,Score!B176,\"\")","v":""},{"$f":"IF(Score!B176>0,VLOOKUP(C177,Entrants!$A$2:$E$5000,3,FALSE),\"\")","v":""},{"$f":"IF(Score!B176>0,VLOOKUP(C177,Entrants!$A$2:$E$5000,2,FALSE),\"\")","v":""},{"$f":"IF(Score!B176>0,VLOOKUP(C177,Entrants!$A$2:$E$5000,4,FALSE),\"\")","v":""},{"$f":"IF(Score!C176>0,Score!C176,\"\")","v":""}]
[{"$f":"IF(Score!B177>0,Score!A177,\"\")","v":""},{"$f":"IF(Score!B177>0,IF(COUNTIF($E$3:E178,E178)>7,\"\",MAX($B$3:B177)+1),\"\")","v":""},{"$f":"IF(Score!B177>0,Score!B177,\"\")","v":""},{"$f":"IF(Score!B177>0,VLOOKUP(C178,Entrants!$A$2:$E$5000,3,FALSE),\"\")","v":""},{"$f":"IF(Score!B177>0,VLOOKUP(C178,Entrants!$A$2:$E$5000,2,FALSE),\"\")","v":""},{"$f":"IF(Score!B177>0,VLOOKUP(C178,Entrants!$A$2:$E$5000,4,FALSE),\"\")","v":""},{"$f":"IF(Score!C177>0,Score!C177,\"\")","v":""}]
[{"$f":"IF(Score!B178>0,Score!A178,\"\")","v":""},{"$f":"IF(Score!B178>0,IF(COUNTIF($E$3:E179,E179)>7,\"\",MAX($B$3:B178)+1),\"\")","v":""},{"$f":"IF(Score!B178>0,Score!B178,\"\")","v":""},{"$f":"IF(Score!B178>0,VLOOKUP(C179,Entrants!$A$2:$E$5000,3,FALSE),\"\")","v":""},{"$f":"IF(Score!B178>0,VLOOKUP(C179,Entrants!$A$2:$E$5000,2,FALSE),\"\")","v":""},{"$f":"IF(Score!B178>0,VLOOKUP(C179,Entrants!$A$2:$E$5000,4,FALSE),\"\")","v":""},{"$f":"IF(Score!C178>0,Score!C178,\"\")","v":""}]
[{"$f":"IF(Score!B179>0,Score!A179,\"\")","v":""},{"$f":"IF(Score!B179>0,IF(COUNTIF($E$3:E180,E180)>7,\"\",MAX($B$3:B179)+1),\"\")","v":""},{"$f":"IF(Score!B179>0,Score!B179,\"\")","v":""},{"$f":"IF(Score!B179>0,VLOOKUP(C180,Entrants!$A$2:$E$5000,3,FALSE),\"\")","v":""},{"$f":"IF(Score!B179>0,VLOOKUP(C180,Entrants!$A$2:$E$5000,2,FALSE),\"\")","v":""},{"$f":"IF(Score!B179>0,VLOOKUP(C180,Entrants!$A$2:$E$5000,4,FALSE),\"\")","v":""},{"$f":"IF(Score!C179>0,Score!C179,\"\")","v":""}]
[{"$f":"IF(Score!B180>0,Score!A180,\"\")","v":""},{"$f":"IF(Score!B180>0,IF(COUNTIF($E$3:E181,E181)>7,\"\",MAX($B$3:B180)+1),\"\")","v":""},{"$f":"IF(Score!B180>0,Score!B180,\"\")","v":""},{"$f":"IF(Score!B180>0,VLOOKUP(C181,Entrants!$A$2:$E$5000,3,FALSE),\"\")","v":""},{"$f":"IF(Score!B180>0,VLOOKUP(C181,Entrants!$A$2:$E$5000,2,FALSE),\"\")","v":""},{"$f":"IF(Score!B180>0,VLOOKUP(C181,Entrants!$A$2:$E$5000,4,FALSE),\"\")","v":""},{"$f":"IF(Score!C180>0,Score!C180,\"\")","v":""}]
[{"$f":"IF(Score!B181>0,Score!A181,\"\")","v":""},{"$f":"IF(Score!B181>0,IF(COUNTIF($E$3:E182,E182)>7,\"\",MAX($B$3:B181)+1),\"\")","v":""},{"$f":"IF(Score!B181>0,Score!B181,\"\")","v":""},{"$f":"IF(Score!B181>0,VLOOKUP(C182,Entrants!$A$2:$E$5000,3,FALSE),\"\")","v":""},{"$f":"IF(Score!B181>0,VLOOKUP(C182,Entrants!$A$2:$E$5000,2,FALSE),\"\")","v":""},{"$f":"IF(Score!B181>0,VLOOKUP(C182,Entrants!$A$2:$E$5000,4,FALSE),\"\")","v":""},{"$f":"IF(Score!C181>0,Score!C181,\"\")","v":""}]
[{"$f":"IF(Score!B182>0,Score!A182,\"\")","v":""},{"$f":"IF(Score!B182>0,IF(COUNTIF($E$3:E183,E183)>7,\"\",MAX($B$3:B182)+1),\"\")","v":""},{"$f":"IF(Score!B182>0,Score!B182,\"\")","v":""},{"$f":"IF(Score!B182>0,VLOOKUP(C183,Entrants!$A$2:$E$5000,3,FALSE),\"\")","v":""},{"$f":"IF(Score!B182>0,VLOOKUP(C183,Entrants!$A$2:$E$5000,2,FALSE),\"\")","v":""},{"$f":"IF(Score!B182>0,VLOOKUP(C183,Entrants!$A$2:$E$5000,4,FALSE),\"\")","v":""},{"$f":"IF(Score!C182>0,Score!C182,\"\")","v":""}]
[{"$f":"IF(Score!B183>0,Score!A183,\"\")","v":""},{"$f":"IF(Score!B183>0,IF(COUNTIF($E$3:E184,E184)>7,\"\",MAX($B$3:B183)+1),\"\")","v":""},{"$f":"IF(Score!B183>0,Score!B183,\"\")","v":""},{"$f":"IF(Score!B183>0,VLOOKUP(C184,Entrants!$A$2:$E$5000,3,FALSE),\"\")","v":""},{"$f":"IF(Score!B183>0,VLOOKUP(C184,Entrants!$A$2:$E$5000,2,FALSE),\"\")","v":""},{"$f":"IF(Score!B183>0,VLOOKUP(C184,Entrants!$A$2:$E$5000,4,FALSE),\"\")","v":""},{"$f":"IF(Score!C183>0,Score!C183,\"\")","v":""}]
[{"$f":"IF(Score!B184>0,Score!A184,\"\")","v":""},{"$f":"IF(Score!B184>0,IF(COUNTIF($E$3:E185,E185)>7,\"\",MAX($B$3:B184)+1),\"\")","v":""},{"$f":"IF(Score!B184>0,Score!B184,\"\")","v":""},{"$f":"IF(Score!B184>0,VLOOKUP(C185,Entrants!$A$2:$E$5000,3,FALSE),\"\")","v":""},{"$f":"IF(Score!B184>0,VLOOKUP(C185,Entrants!$A$2:$E$5000,2,FALSE),\"\")","v":""},{"$f":"IF(Score!B184>0,VLOOKUP(C185,Entrants!$A$2:$E$5000,4,FALSE),\"\")","v":""},{"$f":"IF(Score!C184>0,Score!C184,\"\")","v":""}]
[{"$f":"IF(Score!B185>0,Score!A185,\"\")","v":""},{"$f":"IF(Score!B185>0,IF(COUNTIF($E$3:E186,E186)>7,\"\",MAX($B$3:B185)+1),\"\")","v":""},{"$f":"IF(Score!B185>0,Score!B185,\"\")","v":""},{"$f":"IF(Score!B185>0,VLOOKUP(C186,Entrants!$A$2:$E$5000,3,FALSE),\"\")","v":""},{"$f":"IF(Score!B185>0,VLOOKUP(C186,Entrants!$A$2:$E$5000,2,FALSE),\"\")","v":""},{"$f":"IF(Score!B185>0,VLOOKUP(C186,Entrants!$A$2:$E$5000,4,FALSE),\"\")","v":""},{"$f":"IF(Score!C185>0,Score!C185,\"\")","v":""}]
[{"$f":"IF(Score!B186>0,Score!A186,\"\")","v":""},{"$f":"IF(Score!B186>0,IF(COUNTIF($E$3:E187,E187)>7,\"\",MAX($B$3:B186)+1),\"\")","v":""},{"$f":"IF(Score!B186>0,Score!B186,\"\")","v":""},{"$f":"IF(Score!B186>0,VLOOKUP(C187,Entrants!$A$2:$E$5000,3,FALSE),\"\")","v":""},{"$f":"IF(Score!B186>0,VLOOKUP(C187,Entrants!$A$2:$E$5000,2,FALSE),\"\")","v":""},{"$f":"IF(Score!B186>0,VLOOKUP(C187,Entrants!$A$2:$E$5000,4,FALSE),\"\")","v":""},{"$f":"IF(Score!C186>0,Score!C186,\"\")","v":""}]
[{"$f":"IF(Score!B187>0,Score!A187,\"\")","v":""},{"$f":"IF(Score!B187>0,IF(COUNTIF($E$3:E188,E188)>7,\"\",MAX($B$3:B187)+1),\"\")","v":""},{"$f":"IF(Score!B187>0,Score!B187,\"\")","v":""},{"$f":"IF(Score!B187>0,VLOOKUP(C188,Entrants!$A$2:$E$5000,3,FALSE),\"\")","v":""},{"$f":"IF(Score!B187>0,VLOOKUP(C188,Entrants!$A$2:$E$5000,2,FALSE),\"\")","v":""},{"$f":"IF(Score!B187>0,VLOOKUP(C188,Entrants!$A$2:$E$5000,4,FALSE),\"\")","v":""},{"$f":"IF(Score!C187>0,Score!C187,\"\")","v":""}]
[{"$f":"IF(Score!B188>0,Score!A188,\"\")","v":""},{"$f":"IF(Score!B188>0,IF(COUNTIF($E$3:E189,E189)>7,\"\",MAX($B$3:B188)+1),\"\")","v":""},{"$f":"IF(Score!B188>0,Score!B188,\"\")","v":""},{"$f":"IF(Score!B188>0,VLOOKUP(C189,Entrants!$A$2:$E$5000,3,FALSE),\"\")","v":""},{"$f":"IF(Score!B188>0,VLOOKUP(C189,Entrants!$A$2:$E$5000,2,FALSE),\"\")","v":""},{"$f":"IF(Score!B188>0,VLOOKUP(C189,Entrants!$A$2:$E$5000,4,FALSE),\"\")","v":""},{"$f":"IF(Score!C188>0,Score!C188,\"\")","v":""}]
[{"$f":"IF(Score!B189>0,Score!A189,\"\")","v":""},{"$f":"IF(Score!B189>0,IF(COUNTIF($E$3:E190,E190)>7,\"\",MAX($B$3:B189)+1),\"\")","v":""},{"$f":"IF(Score!B189>0,Score!B189,\"\")","v":""},{"$f":"IF(Score!B189>0,VLOOKUP(C190,Entrants!$A$2:$E$5000,3,FALSE),\"\")","v":""},{"$f":"IF(Score!B189>0,VLOOKUP(C190,Entrants!$A$2:$E$5000,2,FALSE),\"\")","v":""},{"$f":"IF(Score!B189>0,VLOOKUP(C190,Entrants!$A$2:$E$5000,4,FALSE),\"\")","v":""},{"$f":"IF(Score!C189>0,Score!C189,\"\")","v":""}]
[{"$f":"IF(Score!B190>0,Score!A190,\"\")","v":""},{"$f":"IF(Score!B190>0,IF(COUNTIF($E$3:E191,E191)>7,\"\",MAX($B$3:B190)+1),\"\")","v":""},{"$f":"IF(Score!B190>0,Score!B190,\"\")","v":""},{"$f":"IF(Score!B190>0,VLOOKUP(C191,Entrants!$A$2:$E$5000,3,FALSE),\"\")","v":""},{"$f":"IF(Score!B190>0,VLOOKUP(C191,Entrants!$A$2:$E$5000,2,FALSE),\"\")","v":""},{"$f":"IF(Score!B190>0,VLOOKUP(C191,Entrants!$A$2:$E$5000,4,FALSE),\"\")","v":""},{"$f":"IF(Score!C190>0,Score!C190,\"\")","v":""}]
[{"$f":"IF(Score!B191>0,Score!A191,\"\")","v":""},{"$f":"IF(Score!B191>0,IF(COUNTIF($E$3:E192,E192)>7,\"\",MAX($B$3:B191)+1),\"\")","v":""},{"$f":"IF(Score!B191>0,Score!B191,\"\")","v":""},{"$f":"IF(Score!B191>0,VLOOKUP(C192,Entrants!$A$2:$E$5000,3,FALSE),\"\")","v":""},{"$f":"IF(Score!B191>0,VLOOKUP(C192,Entrants!$A$2:$E$5000,2,FALSE),\"\")","v":""},{"$f":"IF(Score!B191>0,VLOOKUP(C192,Entrants!$A$2:$E$5000,4,FALSE),\"\")","v":""},{"$f":"IF(Score!C191>0,Score!C191,\"\")","v":""}]
[{"$f":"IF(Score!B192>0,Score!A192,\"\")","v":""},{"$f":"IF(Score!B192>0,IF(COUNTIF($E$3:E193,E193)>7,\"\",MAX($B$3:B192)+1),\"\")","v":""},{"$f":"IF(Score!B192>0,Score!B192,\"\")","v":""},{"$f":"IF(Score!B192>0,VLOOKUP(C193,Entrants!$A$2:$E$5000,3,FALSE),\"\")","v":""},{"$f":"IF(Score!B192>0,VLOOKUP(C193,Entrants!$A$2:$E$5000,2,FALSE),\"\")","v":""},{"$f":"IF(Score!B192>0,VLOOKUP(C193,Entrants!$A$2:$E$5000,4,FALSE),\"\")","v":""},{"$f":"IF(Score!C192>0,Score!C192,\"\")","v":""}]
[{"$f":"IF(Score!B193>0,Score!A193,\"\")","v":""},{"$f":"IF(Score!B193>0,IF(COUNTIF($E$3:E194,E194)>7,\"\",MAX($B$3:B193)+1),\"\")","v":""},{"$f":"IF(Score!B193>0,Score!B193,\"\")","v":""},{"$f":"IF(Score!B193>0,VLOOKUP(C194,Entrants!$A$2:$E$5000,3,FALSE),\"\")","v":""},{"$f":"IF(Score!B193>0,VLOOKUP(C194,Entrants!$A$2:$E$5000,2,FALSE),\"\")","v":""},{"$f":"IF(Score!B193>0,VLOOKUP(C194,Entrants!$A$2:$E$5000,4,FALSE),\"\")","v":""},{"$f":"IF(Score!C193>0,Score!C193,\"\")","v":""}]
[{"$f":"IF(Score!B194>0,Score!A194,\"\")","v":""},{"$f":"IF(Score!B194>0,IF(COUNTIF($E$3:E195,E195)>7,\"\",MAX($B$3:B194)+1),\"\")","v":""},{"$f":"IF(Score!B194>0,Score!B194,\"\")","v":""},{"$f":"IF(Score!B194>0,VLOOKUP(C195,Entrants!$A$2:$E$5000,3,FALSE),\"\")","v":""},{"$f":"IF(Score!B194>0,VLOOKUP(C195,Entrants!$A$2:$E$5000,2,FALSE),\"\")","v":""},{"$f":"IF(Score!B194>0,VLOOKUP(C195,Entrants!$A$2:$E$5000,4,FALSE),\"\")","v":""},{"$f":"IF(Score!C194>0,Score!C194,\"\")","v":""}]
[{"$f":"IF(Score!B195>0,Score!A195,\"\")","v":""},{"$f":"IF(Score!B195>0,IF(COUNTIF($E$3:E196,E196)>7,\"\",MAX($B$3:B195)+1),\"\")","v":""},{"$f":"IF(Score!B195>0,Score!B195,\"\")","v":""},{"$f":"IF(Score!B195>0,VLOOKUP(C196,Entrants!$A$2:$E$5000,3,FALSE),\"\")","v":""},{"$f":"IF(Score!B195>0,VLOOKUP(C196,Entrants!$A$2:$E$5000,2,FALSE),\"\")","v":""},{"$f":"IF(Score!B195>0,VLOOKUP(C196,Entrants!$A$2:$E$5000,4,FALSE),\"\")","v":""},{"$f":"IF(Score!C195>0,Score!C195,\"\")","v":""}]
[{"$f":"IF(Score!B196>0,Score!A196,\"\")","v":""},{"$f":"IF(Score!B196>0,IF(COUNTIF($E$3:E197,E197)>7,\"\",MAX($B$3:B196)+1),\"\")","v":""},{"$f":"IF(Score!B196>0,Score!B196,\"\")","v":""},{"$f":"IF(Score!B196>0,VLOOKUP(C197,Entrants!$A$2:$E$5000,3,FALSE),\"\")","v":""},{"$f":"IF(Score!B196>0,VLOOKUP(C197,Entrants!$A$2:$E$5000,2,FALSE),\"\")","v":""},{"$f":"IF(Score!B196>0,VLOOKUP(C197,Entrants!$A$2:$E$5000,4,FALSE),\"\")","v":""},{"$f":"IF(Score!C196>0,Score!C196,\"\")","v":""}]
[{"$f":"IF(Score!B197>0,Score!A197,\"\")","v":""},{"$f":"IF(Score!B197>0,IF(COUNTIF($E$3:E198,E198)>7,\"\",MAX($B$3:B197)+1),\"\")","v":""},{"$f":"IF(Score!B197>0,Score!B197,\"\")","v":""},{"$f":"IF(Score!B197>0,VLOOKUP(C198,Entrants!$A$2:$E$5000,3,FALSE),\"\")","v":""},{"$f":"IF(Score!B197>0,VLOOKUP(C198,Entrants!$A$2:$E$5000,2,FALSE),\"\")","v":""},{"$f":"IF(Score!B197>0,VLOOKUP(C198,Entrants!$A$2:$E$5000,4,FALSE),\"\")","v":""},{"$f":"IF(Score!C197>0,Score!C197,\"\")","v":""}]
[{"$f":"IF(Score!B198>0,Score!A198,\"\")","v":""},{"$f":"IF(Score!B198>0,IF(COUNTIF($E$3:E199,E199)>7,\"\",MAX($B$3:B198)+1),\"\")","v":""},{"$f":"IF(Score!B198>0,Score!B198,\"\")","v":""},{"$f":"IF(Score!B198>0,VLOOKUP(C199,Entrants!$A$2:$E$5000,3,FALSE),\"\")","v":""},{"$f":"IF(Score!B198>0,VLOOKUP(C199,Entrants!$A$2:$E$5000,2,FALSE),\"\")","v":""},{"$f":"IF(Score!B198>0,VLOOKUP(C199,Entrants!$A$2:$E$5000,4,FALSE),\"\")","v":""},{"$f":"IF(Score!C198>0,Score!C198,\"\")","v":""}]
[{"$f":"IF(Score!B199>0,Score!A199,\"\")","v":""},{"$f":"IF(Score!B199>0,IF(COUNTIF($E$3:E200,E200)>7,\"\",MAX($B$3:B199)+1),\"\")","v":""},{"$f":"IF(Score!B199>0,Score!B199,\"\")","v":""},{"$f":"IF(Score!B199>0,VLOOKUP(C200,Entrants!$A$2:$E$5000,3,FALSE),\"\")","v":""},{"$f":"IF(Score!B199>0,VLOOKUP(C200,Entrants!$A$2:$E$5000,2,FALSE),\"\")","v":""},{"$f":"IF(Score!B199>0,VLOOKUP(C200,Entrants!$A$2:$E$5000,4,FALSE),\"\")","v":""},{"$f":"IF(Score!C199>0,Score!C199,\"\")","v":""}]
[{"$f":"IF(Score!B200>0,Score!A200,\"\")","v":""},{"$f":"IF(Score!B200>0,IF(COUNTIF($E$3:E201,E201)>7,\"\",MAX($B$3:B200)+1),\"\")","v":""},{"$f":"IF(Score!B200>0,Score!B200,\"\")","v":""},{"$f":"IF(Score!B200>0,VLOOKUP(C201,Entrants!$A$2:$E$5000,3,FALSE),\"\")","v":""},{"$f":"IF(Score!B200>0,VLOOKUP(C201,Entrants!$A$2:$E$5000,2,FALSE),\"\")","v":""},{"$f":"IF(Score!B200>0,VLOOKUP(C201,Entrants!$A$2:$E$5000,4,FALSE),\"\")","v":""},{"$f":"IF(Score!C200>0,Score!C200,\"\")","v":""}]
[{"$f":"IF(Score!B201>0,Score!A201,\"\")","v":""},{"$f":"IF(Score!B201>0,IF(COUNTIF($E$3:E202,E202)>7,\"\",MAX($B$3:B201)+1),\"\")","v":""},{"$f":"IF(Score!B201>0,Score!B201,\"\")","v":""},{"$f":"IF(Score!B201>0,VLOOKUP(C202,Entrants!$A$2:$E$5000,3,FALSE),\"\")","v":""},{"$f":"IF(Score!B201>0,VLOOKUP(C202,Entrants!$A$2:$E$5000,2,FALSE),\"\")","v":""},{"$f":"IF(Score!B201>0,VLOOKUP(C202,Entrants!$A$2:$E$5000,4,FALSE),\"\")","v":""},{"$f":"IF(Score!C201>0,Score!C201,\"\")","v":""}]
[{"$f":"IF(Score!B202>0,Score!A202,\"\")","v":""},{"$f":"IF(Score!B202>0,IF(COUNTIF($E$3:E203,E203)>7,\"\",MAX($B$3:B202)+1),\"\")","v":""},{"$f":"IF(Score!B202>0,Score!B202,\"\")","v":""},{"$f":"IF(Score!B202>0,VLOOKUP(C203,Entrants!$A$2:$E$5000,3,FALSE),\"\")","v":""},{"$f":"IF(Score!B202>0,VLOOKUP(C203,Entrants!$A$2:$E$5000,2,FALSE),\"\")","v":""},{"$f":"IF(Score!B202>0,VLOOKUP(C203,Entrants!$A$2:$E$5000,4,FALSE),\"\")","v":""},{"$f":"IF(Score!C202>0,Score!C202,\"\")","v":""}]
[{"$f":"IF(Score!B203>0,Score!A203,\"\")","v":""},{"$f":"IF(Score!B203>0,IF(COUNTIF($E$3:E204,E204)>7,\"\",MAX($B$3:B203)+1),\"\")","v":""},{"$f":"IF(Score!B203>0,Score!B203,\"\")","v":""},{"$f":"IF(Score!B203>0,VLOOKUP(C204,Entrants!$A$2:$E$5000,3,FALSE),\"\")","v":""},{"$f":"IF(Score!B203>0,VLOOKUP(C204,Entrants!$A$2:$E$5000,2,FALSE),\"\")","v":""},{"$f":"IF(Score!B203>0,VLOOKUP(C204,Entrants!$A$2:$E$5000,4,FALSE),\"\")","v":""},{"$f":"IF(Score!C203>0,Score!C203,\"\")","v":""}]
[{"$f":"IF(Score!B204>0,Score!A204,\"\")","v":""},{"$f":"IF(Score!B204>0,IF(COUNTIF($E$3:E205,E205)>7,\"\",MAX($B$3:B204)+1),\"\")","v":""},{"$f":"IF(Score!B204>0,Score!B204,\"\")","v":""},{"$f":"IF(Score!B204>0,VLOOKUP(C205,Entrants!$A$2:$E$5000,3,FALSE),\"\")","v":""},{"$f":"IF(Score!B204>0,VLOOKUP(C205,Entrants!$A$2:$E$5000,2,FALSE),\"\")","v":""},{"$f":"IF(Score!B204>0,VLOOKUP(C205,Entrants!$A$2:$E$5000,4,FALSE),\"\")","v":""},{"$f":"IF(Score!C204>0,Score!C204,\"\")","v":""}]
[{"$f":"IF(Score!B205>0,Score!A205,\"\")","v":""},{"$f":"IF(Score!B205>0,IF(COUNTIF($E$3:E206,E206)>7,\"\",MAX($B$3:B205)+1),\"\")","v":""},{"$f":"IF(Score!B205>0,Score!B205,\"\")","v":""},{"$f":"IF(Score!B205>0,VLOOKUP(C206,Entrants!$A$2:$E$5000,3,FALSE),\"\")","v":""},{"$f":"IF(Score!B205>0,VLOOKUP(C206,Entrants!$A$2:$E$5000,2,FALSE),\"\")","v":""},{"$f":"IF(Score!B205>0,VLOOKUP(C206,Entrants!$A$2:$E$5000,4,FALSE),\"\")","v":""},{"$f":"IF(Score!C205>0,Score!C205,\"\")","v":""}]
[{"$f":"IF(Score!B206>0,Score!A206,\"\")","v":""},{"$f":"IF(Score!B206>0,IF(COUNTIF($E$3:E207,E207)>7,\"\",MAX($B$3:B206)+1),\"\")","v":""},{"$f":"IF(Score!B206>0,Score!B206,\"\")","v":""},{"$f":"IF(Score!B206>0,VLOOKUP(C207,Entrants!$A$2:$E$5000,3,FALSE),\"\")","v":""},{"$f":"IF(Score!B206>0,VLOOKUP(C207,Entrants!$A$2:$E$5000,2,FALSE),\"\")","v":""},{"$f":"IF(Score!B206>0,VLOOKUP(C207,Entrants!$A$2:$E$5000,4,FALSE),\"\")","v":""},{"$f":"IF(Score!C206>0,Score!C206,\"\")","v":""}]
[{"$f":"IF(Score!B207>0,Score!A207,\"\")","v":""},{"$f":"IF(Score!B207>0,IF(COUNTIF($E$3:E208,E208)>7,\"\",MAX($B$3:B207)+1),\"\")","v":""},{"$f":"IF(Score!B207>0,Score!B207,\"\")","v":""},{"$f":"IF(Score!B207>0,VLOOKUP(C208,Entrants!$A$2:$E$5000,3,FALSE),\"\")","v":""},{"$f":"IF(Score!B207>0,VLOOKUP(C208,Entrants!$A$2:$E$5000,2,FALSE),\"\")","v":""},{"$f":"IF(Score!B207>0,VLOOKUP(C208,Entrants!$A$2:$E$5000,4,FALSE),\"\")","v":""},{"$f":"IF(Score!C207>0,Score!C207,\"\")","v":""}]
[{"$f":"IF(Score!B208>0,Score!A208,\"\")","v":""},{"$f":"IF(Score!B208>0,IF(COUNTIF($E$3:E209,E209)>7,\"\",MAX($B$3:B208)+1),\"\")","v":""},{"$f":"IF(Score!B208>0,Score!B208,\"\")","v":""},{"$f":"IF(Score!B208>0,VLOOKUP(C209,Entrants!$A$2:$E$5000,3,FALSE),\"\")","v":""},{"$f":"IF(Score!B208>0,VLOOKUP(C209,Entrants!$A$2:$E$5000,2,FALSE),\"\")","v":""},{"$f":"IF(Score!B208>0,VLOOKUP(C209,Entrants!$A$2:$E$5000,4,FALSE),\"\")","v":""},{"$f":"IF(Score!C208>0,Score!C208,\"\")","v":""}]
[{"$f":"IF(Score!B209>0,Score!A209,\"\")","v":""},{"$f":"IF(Score!B209>0,IF(COUNTIF($E$3:E210,E210)>7,\"\",MAX($B$3:B209)+1),\"\")","v":""},{"$f":"IF(Score!B209>0,Score!B209,\"\")","v":""},{"$f":"IF(Score!B209>0,VLOOKUP(C210,Entrants!$A$2:$E$5000,3,FALSE),\"\")","v":""},{"$f":"IF(Score!B209>0,VLOOKUP(C210,Entrants!$A$2:$E$5000,2,FALSE),\"\")","v":""},{"$f":"IF(Score!B209>0,VLOOKUP(C210,Entrants!$A$2:$E$5000,4,FALSE),\"\")","v":""},{"$f":"IF(Score!C209>0,Score!C209,\"\")","v":""}]
[{"$f":"IF(Score!B210>0,Score!A210,\"\")","v":""},{"$f":"IF(Score!B210>0,IF(COUNTIF($E$3:E211,E211)>7,\"\",MAX($B$3:B210)+1),\"\")","v":""},{"$f":"IF(Score!B210>0,Score!B210,\"\")","v":""},{"$f":"IF(Score!B210>0,VLOOKUP(C211,Entrants!$A$2:$E$5000,3,FALSE),\"\")","v":""},{"$f":"IF(Score!B210>0,VLOOKUP(C211,Entrants!$A$2:$E$5000,2,FALSE),\"\")","v":""},{"$f":"IF(Score!B210>0,VLOOKUP(C211,Entrants!$A$2:$E$5000,4,FALSE),\"\")","v":""},{"$f":"IF(Score!C210>0,Score!C210,\"\")","v":""}]
[{"$f":"IF(Score!B211>0,Score!A211,\"\")","v":""},{"$f":"IF(Score!B211>0,IF(COUNTIF($E$3:E212,E212)>7,\"\",MAX($B$3:B211)+1),\"\")","v":""},{"$f":"IF(Score!B211>0,Score!B211,\"\")","v":""},{"$f":"IF(Score!B211>0,VLOOKUP(C212,Entrants!$A$2:$E$5000,3,FALSE),\"\")","v":""},{"$f":"IF(Score!B211>0,VLOOKUP(C212,Entrants!$A$2:$E$5000,2,FALSE),\"\")","v":""},{"$f":"IF(Score!B211>0,VLOOKUP(C212,Entrants!$A$2:$E$5000,4,FALSE),\"\")","v":""},{"$f":"IF(Score!C211>0,Score!C211,\"\")","v":""}]
[{"$f":"IF(Score!B212>0,Score!A212,\"\")","v":""},{"$f":"IF(Score!B212>0,IF(COUNTIF($E$3:E213,E213)>7,\"\",MAX($B$3:B212)+1),\"\")","v":""},{"$f":"IF(Score!B212>0,Score!B212,\"\")","v":""},{"$f":"IF(Score!B212>0,VLOOKUP(C213,Entrants!$A$2:$E$5000,3,FALSE),\"\")","v":""},{"$f":"IF(Score!B212>0,VLOOKUP(C213,Entrants!$A$2:$E$5000,2,FALSE),\"\")","v":""},{"$f":"IF(Score!B212>0,VLOOKUP(C213,Entrants!$A$2:$E$5000,4,FALSE),\"\")","v":""},{"$f":"IF(Score!C212>0,Score!C212,\"\")","v":""}]
[{"$f":"IF(Score!B213>0,Score!A213,\"\")","v":""},{"$f":"IF(Score!B213>0,IF(COUNTIF($E$3:E214,E214)>7,\"\",MAX($B$3:B213)+1),\"\")","v":""},{"$f":"IF(Score!B213>0,Score!B213,\"\")","v":""},{"$f":"IF(Score!B213>0,VLOOKUP(C214,Entrants!$A$2:$E$5000,3,FALSE),\"\")","v":""},{"$f":"IF(Score!B213>0,VLOOKUP(C214,Entrants!$A$2:$E$5000,2,FALSE),\"\")","v":""},{"$f":"IF(Score!B213>0,VLOOKUP(C214,Entrants!$A$2:$E$5000,4,FALSE),\"\")","v":""},{"$f":"IF(Score!C213>0,Score!C213,\"\")","v":""}]
[{"$f":"IF(Score!B214>0,Score!A214,\"\")","v":""},{"$f":"IF(Score!B214>0,IF(COUNTIF($E$3:E215,E215)>7,\"\",MAX($B$3:B214)+1),\"\")","v":""},{"$f":"IF(Score!B214>0,Score!B214,\"\")","v":""},{"$f":"IF(Score!B214>0,VLOOKUP(C215,Entrants!$A$2:$E$5000,3,FALSE),\"\")","v":""},{"$f":"IF(Score!B214>0,VLOOKUP(C215,Entrants!$A$2:$E$5000,2,FALSE),\"\")","v":""},{"$f":"IF(Score!B214>0,VLOOKUP(C215,Entrants!$A$2:$E$5000,4,FALSE),\"\")","v":""},{"$f":"IF(Score!C214>0,Score!C214,\"\")","v":""}]
[{"$f":"IF(Score!B215>0,Score!A215,\"\")","v":""},{"$f":"IF(Score!B215>0,IF(COUNTIF($E$3:E216,E216)>7,\"\",MAX($B$3:B215)+1),\"\")","v":""},{"$f":"IF(Score!B215>0,Score!B215,\"\")","v":""},{"$f":"IF(Score!B215>0,VLOOKUP(C216,Entrants!$A$2:$E$5000,3,FALSE),\"\")","v":""},{"$f":"IF(Score!B215>0,VLOOKUP(C216,Entrants!$A$2:$E$5000,2,FALSE),\"\")","v":""},{"$f":"IF(Score!B215>0,VLOOKUP(C216,Entrants!$A$2:$E$5000,4,FALSE),\"\")","v":""},{"$f":"IF(Score!C215>0,Score!C215,\"\")","v":""}]
[{"$f":"IF(Score!B216>0,Score!A216,\"\")","v":""},{"$f":"IF(Score!B216>0,IF(COUNTIF($E$3:E217,E217)>7,\"\",MAX($B$3:B216)+1),\"\")","v":""},{"$f":"IF(Score!B216>0,Score!B216,\"\")","v":""},{"$f":"IF(Score!B216>0,VLOOKUP(C217,Entrants!$A$2:$E$5000,3,FALSE),\"\")","v":""},{"$f":"IF(Score!B216>0,VLOOKUP(C217,Entrants!$A$2:$E$5000,2,FALSE),\"\")","v":""},{"$f":"IF(Score!B216>0,VLOOKUP(C217,Entrants!$A$2:$E$5000,4,FALSE),\"\")","v":""},{"$f":"IF(Score!C216>0,Score!C216,\"\")","v":""}]
[{"$f":"IF(Score!B217>0,Score!A217,\"\")","v":""},{"$f":"IF(Score!B217>0,IF(COUNTIF($E$3:E218,E218)>7,\"\",MAX($B$3:B217)+1),\"\")","v":""},{"$f":"IF(Score!B217>0,Score!B217,\"\")","v":""},{"$f":"IF(Score!B217>0,VLOOKUP(C218,Entrants!$A$2:$E$5000,3,FALSE),\"\")","v":""},{"$f":"IF(Score!B217>0,VLOOKUP(C218,Entrants!$A$2:$E$5000,2,FALSE),\"\")","v":""},{"$f":"IF(Score!B217>0,VLOOKUP(C218,Entrants!$A$2:$E$5000,4,FALSE),\"\")","v":""},{"$f":"IF(Score!C217>0,Score!C217,\"\")","v":""}]
[{"$f":"IF(Score!B218>0,Score!A218,\"\")","v":""},{"$f":"IF(Score!B218>0,IF(COUNTIF($E$3:E219,E219)>7,\"\",MAX($B$3:B218)+1),\"\")","v":""},{"$f":"IF(Score!B218>0,Score!B218,\"\")","v":""},{"$f":"IF(Score!B218>0,VLOOKUP(C219,Entrants!$A$2:$E$5000,3,FALSE),\"\")","v":""},{"$f":"IF(Score!B218>0,VLOOKUP(C219,Entrants!$A$2:$E$5000,2,FALSE),\"\")","v":""},{"$f":"IF(Score!B218>0,VLOOKUP(C219,Entrants!$A$2:$E$5000,4,FALSE),\"\")","v":""},{"$f":"IF(Score!C218>0,Score!C218,\"\")","v":""}]
[{"$f":"IF(Score!B219>0,Score!A219,\"\")","v":""},{"$f":"IF(Score!B219>0,IF(COUNTIF($E$3:E220,E220)>7,\"\",MAX($B$3:B219)+1),\"\")","v":""},{"$f":"IF(Score!B219>0,Score!B219,\"\")","v":""},{"$f":"IF(Score!B219>0,VLOOKUP(C220,Entrants!$A$2:$E$5000,3,FALSE),\"\")","v":""},{"$f":"IF(Score!B219>0,VLOOKUP(C220,Entrants!$A$2:$E$5000,2,FALSE),\"\")","v":""},{"$f":"IF(Score!B219>0,VLOOKUP(C220,Entrants!$A$2:$E$5000,4,FALSE),\"\")","v":""},{"$f":"IF(Score!C219>0,Score!C219,\"\")","v":""}]
[{"$f":"IF(Score!B220>0,Score!A220,\"\")","v":""},{"$f":"IF(Score!B220>0,IF(COUNTIF($E$3:E221,E221)>7,\"\",MAX($B$3:B220)+1),\"\")","v":""},{"$f":"IF(Score!B220>0,Score!B220,\"\")","v":""},{"$f":"IF(Score!B220>0,VLOOKUP(C221,Entrants!$A$2:$E$5000,3,FALSE),\"\")","v":""},{"$f":"IF(Score!B220>0,VLOOKUP(C221,Entrants!$A$2:$E$5000,2,FALSE),\"\")","v":""},{"$f":"IF(Score!B220>0,VLOOKUP(C221,Entrants!$A$2:$E$5000,4,FALSE),\"\")","v":""},{"$f":"IF(Score!C220>0,Score!C220,\"\")","v":""}]
[{"$f":"IF(Score!B221>0,Score!A221,\"\")","v":""},{"$f":"IF(Score!B221>0,IF(COUNTIF($E$3:E222,E222)>7,\"\",MAX($B$3:B221)+1),\"\")","v":""},{"$f":"IF(Score!B221>0,Score!B221,\"\")","v":""},{"$f":"IF(Score!B221>0,VLOOKUP(C222,Entrants!$A$2:$E$5000,3,FALSE),\"\")","v":""},{"$f":"IF(Score!B221>0,VLOOKUP(C222,Entrants!$A$2:$E$5000,2,FALSE),\"\")","v":""},{"$f":"IF(Score!B221>0,VLOOKUP(C222,Entrants!$A$2:$E$5000,4,FALSE),\"\")","v":""},{"$f":"IF(Score!C221>0,Score!C221,\"\")","v":""}]
[{"$f":"IF(Score!B222>0,Score!A222,\"\")","v":""},{"$f":"IF(Score!B222>0,IF(COUNTIF($E$3:E223,E223)>7,\"\",MAX($B$3:B222)+1),\"\")","v":""},{"$f":"IF(Score!B222>0,Score!B222,\"\")","v":""},{"$f":"IF(Score!B222>0,VLOOKUP(C223,Entrants!$A$2:$E$5000,3,FALSE),\"\")","v":""},{"$f":"IF(Score!B222>0,VLOOKUP(C223,Entrants!$A$2:$E$5000,2,FALSE),\"\")","v":""},{"$f":"IF(Score!B222>0,VLOOKUP(C223,Entrants!$A$2:$E$5000,4,FALSE),\"\")","v":""},{"$f":"IF(Score!C222>0,Score!C222,\"\")","v":""}]
[{"$f":"IF(Score!B223>0,Score!A223,\"\")","v":""},{"$f":"IF(Score!B223>0,IF(COUNTIF($E$3:E224,E224)>7,\"\",MAX($B$3:B223)+1),\"\")","v":""},{"$f":"IF(Score!B223>0,Score!B223,\"\")","v":""},{"$f":"IF(Score!B223>0,VLOOKUP(C224,Entrants!$A$2:$E$5000,3,FALSE),\"\")","v":""},{"$f":"IF(Score!B223>0,VLOOKUP(C224,Entrants!$A$2:$E$5000,2,FALSE),\"\")","v":""},{"$f":"IF(Score!B223>0,VLOOKUP(C224,Entrants!$A$2:$E$5000,4,FALSE),\"\")","v":""},{"$f":"IF(Score!C223>0,Score!C223,\"\")","v":""}]
[{"$f":"IF(Score!B224>0,Score!A224,\"\")","v":""},{"$f":"IF(Score!B224>0,IF(COUNTIF($E$3:E225,E225)>7,\"\",MAX($B$3:B224)+1),\"\")","v":""},{"$f":"IF(Score!B224>0,Score!B224,\"\")","v":""},{"$f":"IF(Score!B224>0,VLOOKUP(C225,Entrants!$A$2:$E$5000,3,FALSE),\"\")","v":""},{"$f":"IF(Score!B224>0,VLOOKUP(C225,Entrants!$A$2:$E$5000,2,FALSE),\"\")","v":""},{"$f":"IF(Score!B224>0,VLOOKUP(C225,Entrants!$A$2:$E$5000,4,FALSE),\"\")","v":""},{"$f":"IF(Score!C224>0,Score!C224,\"\")","v":""}]
[{"$f":"IF(Score!B225>0,Score!A225,\"\")","v":""},{"$f":"IF(Score!B225>0,IF(COUNTIF($E$3:E226,E226)>7,\"\",MAX($B$3:B225)+1),\"\")","v":""},{"$f":"IF(Score!B225>0,Score!B225,\"\")","v":""},{"$f":"IF(Score!B225>0,VLOOKUP(C226,Entrants!$A$2:$E$5000,3,FALSE),\"\")","v":""},{"$f":"IF(Score!B225>0,VLOOKUP(C226,Entrants!$A$2:$E$5000,2,FALSE),\"\")","v":""},{"$f":"IF(Score!B225>0,VLOOKUP(C226,Entrants!$A$2:$E$5000,4,FALSE),\"\")","v":""},{"$f":"IF(Score!C225>0,Score!C225,\"\")","v":""}]
[{"$f":"IF(Score!B226>0,Score!A226,\"\")","v":""},{"$f":"IF(Score!B226>0,IF(COUNTIF($E$3:E227,E227)>7,\"\",MAX($B$3:B226)+1),\"\")","v":""},{"$f":"IF(Score!B226>0,Score!B226,\"\")","v":""},{"$f":"IF(Score!B226>0,VLOOKUP(C227,Entrants!$A$2:$E$5000,3,FALSE),\"\")","v":""},{"$f":"IF(Score!B226>0,VLOOKUP(C227,Entrants!$A$2:$E$5000,2,FALSE),\"\")","v":""},{"$f":"IF(Score!B226>0,VLOOKUP(C227,Entrants!$A$2:$E$5000,4,FALSE),\"\")","v":""},{"$f":"IF(Score!C226>0,Score!C226,\"\")","v":""}]
[{"$f":"IF(Score!B227>0,Score!A227,\"\")","v":""},{"$f":"IF(Score!B227>0,IF(COUNTIF($E$3:E228,E228)>7,\"\",MAX($B$3:B227)+1),\"\")","v":""},{"$f":"IF(Score!B227>0,Score!B227,\"\")","v":""},{"$f":"IF(Score!B227>0,VLOOKUP(C228,Entrants!$A$2:$E$5000,3,FALSE),\"\")","v":""},{"$f":"IF(Score!B227>0,VLOOKUP(C228,Entrants!$A$2:$E$5000,2,FALSE),\"\")","v":""},{"$f":"IF(Score!B227>0,VLOOKUP(C228,Entrants!$A$2:$E$5000,4,FALSE),\"\")","v":""},{"$f":"IF(Score!C227>0,Score!C227,\"\")","v":""}]
[{"$f":"IF(Score!B228>0,Score!A228,\"\")","v":""},{"$f":"IF(Score!B228>0,IF(COUNTIF($E$3:E229,E229)>7,\"\",MAX($B$3:B228)+1),\"\")","v":""},{"$f":"IF(Score!B228>0,Score!B228,\"\")","v":""},{"$f":"IF(Score!B228>0,VLOOKUP(C229,Entrants!$A$2:$E$5000,3,FALSE),\"\")","v":""},{"$f":"IF(Score!B228>0,VLOOKUP(C229,Entrants!$A$2:$E$5000,2,FALSE),\"\")","v":""},{"$f":"IF(Score!B228>0,VLOOKUP(C229,Entrants!$A$2:$E$5000,4,FALSE),\"\")","v":""},{"$f":"IF(Score!C228>0,Score!C228,\"\")","v":""}]
[{"$f":"IF(Score!B229>0,Score!A229,\"\")","v":""},{"$f":"IF(Score!B229>0,IF(COUNTIF($E$3:E230,E230)>7,\"\",MAX($B$3:B229)+1),\"\")","v":""},{"$f":"IF(Score!B229>0,Score!B229,\"\")","v":""},{"$f":"IF(Score!B229>0,VLOOKUP(C230,Entrants!$A$2:$E$5000,3,FALSE),\"\")","v":""},{"$f":"IF(Score!B229>0,VLOOKUP(C230,Entrants!$A$2:$E$5000,2,FALSE),\"\")","v":""},{"$f":"IF(Score!B229>0,VLOOKUP(C230,Entrants!$A$2:$E$5000,4,FALSE),\"\")","v":""},{"$f":"IF(Score!C229>0,Score!C229,\"\")","v":""}]
[{"$f":"IF(Score!B230>0,Score!A230,\"\")","v":""},{"$f":"IF(Score!B230>0,IF(COUNTIF($E$3:E231,E231)>7,\"\",MAX($B$3:B230)+1),\"\")","v":""},{"$f":"IF(Score!B230>0,Score!B230,\"\")","v":""},{"$f":"IF(Score!B230>0,VLOOKUP(C231,Entrants!$A$2:$E$5000,3,FALSE),\"\")","v":""},{"$f":"IF(Score!B230>0,VLOOKUP(C231,Entrants!$A$2:$E$5000,2,FALSE),\"\")","v":""},{"$f":"IF(Score!B230>0,VLOOKUP(C231,Entrants!$A$2:$E$5000,4,FALSE),\"\")","v":""},{"$f":"IF(Score!C230>0,Score!C230,\"\")","v":""}]
[{"$f":"IF(Score!B231>0,Score!A231,\"\")","v":""},{"$f":"IF(Score!B231>0,IF(COUNTIF($E$3:E232,E232)>7,\"\",MAX($B$3:B231)+1),\"\")","v":""},{"$f":"IF(Score!B231>0,Score!B231,\"\")","v":""},{"$f":"IF(Score!B231>0,VLOOKUP(C232,Entrants!$A$2:$E$5000,3,FALSE),\"\")","v":""},{"$f":"IF(Score!B231>0,VLOOKUP(C232,Entrants!$A$2:$E$5000,2,FALSE),\"\")","v":""},{"$f":"IF(Score!B231>0,VLOOKUP(C232,Entrants!$A$2:$E$5000,4,FALSE),\"\")","v":""},{"$f":"IF(Score!C231>0,Score!C231,\"\")","v":""}]
[{"$f":"IF(Score!B232>0,Score!A232,\"\")","v":""},{"$f":"IF(Score!B232>0,IF(COUNTIF($E$3:E233,E233)>7,\"\",MAX($B$3:B232)+1),\"\")","v":""},{"$f":"IF(Score!B232>0,Score!B232,\"\")","v":""},{"$f":"IF(Score!B232>0,VLOOKUP(C233,Entrants!$A$2:$E$5000,3,FALSE),\"\")","v":""},{"$f":"IF(Score!B232>0,VLOOKUP(C233,Entrants!$A$2:$E$5000,2,FALSE),\"\")","v":""},{"$f":"IF(Score!B232>0,VLOOKUP(C233,Entrants!$A$2:$E$5000,4,FALSE),\"\")","v":""},{"$f":"IF(Score!C232>0,Score!C232,\"\")","v":""}]
[{"$f":"IF(Score!B233>0,Score!A233,\"\")","v":""},{"$f":"IF(Score!B233>0,IF(COUNTIF($E$3:E234,E234)>7,\"\",MAX($B$3:B233)+1),\"\")","v":""},{"$f":"IF(Score!B233>0,Score!B233,\"\")","v":""},{"$f":"IF(Score!B233>0,VLOOKUP(C234,Entrants!$A$2:$E$5000,3,FALSE),\"\")","v":""},{"$f":"IF(Score!B233>0,VLOOKUP(C234,Entrants!$A$2:$E$5000,2,FALSE),\"\")","v":""},{"$f":"IF(Score!B233>0,VLOOKUP(C234,Entrants!$A$2:$E$5000,4,FALSE),\"\")","v":""},{"$f":"IF(Score!C233>0,Score!C233,\"\")","v":""}]
[{"$f":"IF(Score!B234>0,Score!A234,\"\")","v":""},{"$f":"IF(Score!B234>0,IF(COUNTIF($E$3:E235,E235)>7,\"\",MAX($B$3:B234)+1),\"\")","v":""},{"$f":"IF(Score!B234>0,Score!B234,\"\")","v":""},{"$f":"IF(Score!B234>0,VLOOKUP(C235,Entrants!$A$2:$E$5000,3,FALSE),\"\")","v":""},{"$f":"IF(Score!B234>0,VLOOKUP(C235,Entrants!$A$2:$E$5000,2,FALSE),\"\")","v":""},{"$f":"IF(Score!B234>0,VLOOKUP(C235,Entrants!$A$2:$E$5000,4,FALSE),\"\")","v":""},{"$f":"IF(Score!C234>0,Score!C234,\"\")","v":""}]
[{"$f":"IF(Score!B235>0,Score!A235,\"\")","v":""},{"$f":"IF(Score!B235>0,IF(COUNTIF($E$3:E236,E236)>7,\"\",MAX($B$3:B235)+1),\"\")","v":""},{"$f":"IF(Score!B235>0,Score!B235,\"\")","v":""},{"$f":"IF(Score!B235>0,VLOOKUP(C236,Entrants!$A$2:$E$5000,3,FALSE),\"\")","v":""},{"$f":"IF(Score!B235>0,VLOOKUP(C236,Entrants!$A$2:$E$5000,2,FALSE),\"\")","v":""},{"$f":"IF(Score!B235>0,VLOOKUP(C236,Entrants!$A$2:$E$5000,4,FALSE),\"\")","v":""},{"$f":"IF(Score!C235>0,Score!C235,\"\")","v":""}]
[{"$f":"IF(Score!B236>0,Score!A236,\"\")","v":""},{"$f":"IF(Score!B236>0,IF(COUNTIF($E$3:E237,E237)>7,\"\",MAX($B$3:B236)+1),\"\")","v":""},{"$f":"IF(Score!B236>0,Score!B236,\"\")","v":""},{"$f":"IF(Score!B236>0,VLOOKUP(C237,Entrants!$A$2:$E$5000,3,FALSE),\"\")","v":""},{"$f":"IF(Score!B236>0,VLOOKUP(C237,Entrants!$A$2:$E$5000,2,FALSE),\"\")","v":""},{"$f":"IF(Score!B236>0,VLOOKUP(C237,Entrants!$A$2:$E$5000,4,FALSE),\"\")","v":""},{"$f":"IF(Score!C236>0,Score!C236,\"\")","v":""}]
[{"$f":"IF(Score!B237>0,Score!A237,\"\")","v":""},{"$f":"IF(Score!B237>0,IF(COUNTIF($E$3:E238,E238)>7,\"\",MAX($B$3:B237)+1),\"\")","v":""},{"$f":"IF(Score!B237>0,Score!B237,\"\")","v":""},{"$f":"IF(Score!B237>0,VLOOKUP(C238,Entrants!$A$2:$E$5000,3,FALSE),\"\")","v":""},{"$f":"IF(Score!B237>0,VLOOKUP(C238,Entrants!$A$2:$E$5000,2,FALSE),\"\")","v":""},{"$f":"IF(Score!B237>0,VLOOKUP(C238,Entrants!$A$2:$E$5000,4,FALSE),\"\")","v":""},{"$f":"IF(Score!C237>0,Score!C237,\"\")","v":""}]
[{"$f":"IF(Score!B238>0,Score!A238,\"\")","v":""},{"$f":"IF(Score!B238>0,IF(COUNTIF($E$3:E239,E239)>7,\"\",MAX($B$3:B238)+1),\"\")","v":""},{"$f":"IF(Score!B238>0,Score!B238,\"\")","v":""},{"$f":"IF(Score!B238>0,VLOOKUP(C239,Entrants!$A$2:$E$5000,3,FALSE),\"\")","v":""},{"$f":"IF(Score!B238>0,VLOOKUP(C239,Entrants!$A$2:$E$5000,2,FALSE),\"\")","v":""},{"$f":"IF(Score!B238>0,VLOOKUP(C239,Entrants!$A$2:$E$5000,4,FALSE),\"\")","v":""},{"$f":"IF(Score!C238>0,Score!C238,\"\")","v":""}]
[{"$f":"IF(Score!B239>0,Score!A239,\"\")","v":""},{"$f":"IF(Score!B239>0,IF(COUNTIF($E$3:E240,E240)>7,\"\",MAX($B$3:B239)+1),\"\")","v":""},{"$f":"IF(Score!B239>0,Score!B239,\"\")","v":""},{"$f":"IF(Score!B239>0,VLOOKUP(C240,Entrants!$A$2:$E$5000,3,FALSE),\"\")","v":""},{"$f":"IF(Score!B239>0,VLOOKUP(C240,Entrants!$A$2:$E$5000,2,FALSE),\"\")","v":""},{"$f":"IF(Score!B239>0,VLOOKUP(C240,Entrants!$A$2:$E$5000,4,FALSE),\"\")","v":""},{"$f":"IF(Score!C239>0,Score!C239,\"\")","v":""}]
[{"$f":"IF(Score!B240>0,Score!A240,\"\")","v":""},{"$f":"IF(Score!B240>0,IF(COUNTIF($E$3:E241,E241)>7,\"\",MAX($B$3:B240)+1),\"\")","v":""},{"$f":"IF(Score!B240>0,Score!B240,\"\")","v":""},{"$f":"IF(Score!B240>0,VLOOKUP(C241,Entrants!$A$2:$E$5000,3,FALSE),\"\")","v":""},{"$f":"IF(Score!B240>0,VLOOKUP(C241,Entrants!$A$2:$E$5000,2,FALSE),\"\")","v":""},{"$f":"IF(Score!B240>0,VLOOKUP(C241,Entrants!$A$2:$E$5000,4,FALSE),\"\")","v":""},{"$f":"IF(Score!C240>0,Score!C240,\"\")","v":""}]
[{"$f":"IF(Score!B241>0,Score!A241,\"\")","v":""},{"$f":"IF(Score!B241>0,IF(COUNTIF($E$3:E242,E242)>7,\"\",MAX($B$3:B241)+1),\"\")","v":""},{"$f":"IF(Score!B241>0,Score!B241,\"\")","v":""},{"$f":"IF(Score!B241>0,VLOOKUP(C242,Entrants!$A$2:$E$5000,3,FALSE),\"\")","v":""},{"$f":"IF(Score!B241>0,VLOOKUP(C242,Entrants!$A$2:$E$5000,2,FALSE),\"\")","v":""},{"$f":"IF(Score!B241>0,VLOOKUP(C242,Entrants!$A$2:$E$5000,4,FALSE),\"\")","v":""},{"$f":"IF(Score!C241>0,Score!C241,\"\")","v":""}]
[{"$f":"IF(Score!B242>0,Score!A242,\"\")","v":""},{"$f":"IF(Score!B242>0,IF(COUNTIF($E$3:E243,E243)>7,\"\",MAX($B$3:B242)+1),\"\")","v":""},{"$f":"IF(Score!B242>0,Score!B242,\"\")","v":""},{"$f":"IF(Score!B242>0,VLOOKUP(C243,Entrants!$A$2:$E$5000,3,FALSE),\"\")","v":""},{"$f":"IF(Score!B242>0,VLOOKUP(C243,Entrants!$A$2:$E$5000,2,FALSE),\"\")","v":""},{"$f":"IF(Score!B242>0,VLOOKUP(C243,Entrants!$A$2:$E$5000,4,FALSE),\"\")","v":""},{"$f":"IF(Score!C242>0,Score!C242,\"\")","v":""}]
[{"$f":"IF(Score!B243>0,Score!A243,\"\")","v":""},{"$f":"IF(Score!B243>0,IF(COUNTIF($E$3:E244,E244)>7,\"\",MAX($B$3:B243)+1),\"\")","v":""},{"$f":"IF(Score!B243>0,Score!B243,\"\")","v":""},{"$f":"IF(Score!B243>0,VLOOKUP(C244,Entrants!$A$2:$E$5000,3,FALSE),\"\")","v":""},{"$f":"IF(Score!B243>0,VLOOKUP(C244,Entrants!$A$2:$E$5000,2,FALSE),\"\")","v":""},{"$f":"IF(Score!B243>0,VLOOKUP(C244,Entrants!$A$2:$E$5000,4,FALSE),\"\")","v":""},{"$f":"IF(Score!C243>0,Score!C243,\"\")","v":""}]
[{"$f":"IF(Score!B244>0,Score!A244,\"\")","v":""},{"$f":"IF(Score!B244>0,IF(COUNTIF($E$3:E245,E245)>7,\"\",MAX($B$3:B244)+1),\"\")","v":""},{"$f":"IF(Score!B244>0,Score!B244,\"\")","v":""},{"$f":"IF(Score!B244>0,VLOOKUP(C245,Entrants!$A$2:$E$5000,3,FALSE),\"\")","v":""},{"$f":"IF(Score!B244>0,VLOOKUP(C245,Entrants!$A$2:$E$5000,2,FALSE),\"\")","v":""},{"$f":"IF(Score!B244>0,VLOOKUP(C245,Entrants!$A$2:$E$5000,4,FALSE),\"\")","v":""},{"$f":"IF(Score!C244>0,Score!C244,\"\")","v":""}]
[{"$f":"IF(Score!B245>0,Score!A245,\"\")","v":""},{"$f":"IF(Score!B245>0,IF(COUNTIF($E$3:E246,E246)>7,\"\",MAX($B$3:B245)+1),\"\")","v":""},{"$f":"IF(Score!B245>0,Score!B245,\"\")","v":""},{"$f":"IF(Score!B245>0,VLOOKUP(C246,Entrants!$A$2:$E$5000,3,FALSE),\"\")","v":""},{"$f":"IF(Score!B245>0,VLOOKUP(C246,Entrants!$A$2:$E$5000,2,FALSE),\"\")","v":""},{"$f":"IF(Score!B245>0,VLOOKUP(C246,Entrants!$A$2:$E$5000,4,FALSE),\"\")","v":""},{"$f":"IF(Score!C245>0,Score!C245,\"\")","v":""}]
[{"$f":"IF(Score!B246>0,Score!A246,\"\")","v":""},{"$f":"IF(Score!B246>0,IF(COUNTIF($E$3:E247,E247)>7,\"\",MAX($B$3:B246)+1),\"\")","v":""},{"$f":"IF(Score!B246>0,Score!B246,\"\")","v":""},{"$f":"IF(Score!B246>0,VLOOKUP(C247,Entrants!$A$2:$E$5000,3,FALSE),\"\")","v":""},{"$f":"IF(Score!B246>0,VLOOKUP(C247,Entrants!$A$2:$E$5000,2,FALSE),\"\")","v":""},{"$f":"IF(Score!B246>0,VLOOKUP(C247,Entrants!$A$2:$E$5000,4,FALSE),\"\")","v":""},{"$f":"IF(Score!C246>0,Score!C246,\"\")","v":""}]
[{"$f":"IF(Score!B247>0,Score!A247,\"\")","v":""},{"$f":"IF(Score!B247>0,IF(COUNTIF($E$3:E248,E248)>7,\"\",MAX($B$3:B247)+1),\"\")","v":""},{"$f":"IF(Score!B247>0,Score!B247,\"\")","v":""},{"$f":"IF(Score!B247>0,VLOOKUP(C248,Entrants!$A$2:$E$5000,3,FALSE),\"\")","v":""},{"$f":"IF(Score!B247>0,VLOOKUP(C248,Entrants!$A$2:$E$5000,2,FALSE),\"\")","v":""},{"$f":"IF(Score!B247>0,VLOOKUP(C248,Entrants!$A$2:$E$5000,4,FALSE),\"\")","v":""},{"$f":"IF(Score!C247>0,Score!C247,\"\")","v":""}]
[{"$f":"IF(Score!B248>0,Score!A248,\"\")","v":""},{"$f":"IF(Score!B248>0,IF(COUNTIF($E$3:E249,E249)>7,\"\",MAX($B$3:B248)+1),\"\")","v":""},{"$f":"IF(Score!B248>0,Score!B248,\"\")","v":""},{"$f":"IF(Score!B248>0,VLOOKUP(C249,Entrants!$A$2:$E$5000,3,FALSE),\"\")","v":""},{"$f":"IF(Score!B248>0,VLOOKUP(C249,Entrants!$A$2:$E$5000,2,FALSE),\"\")","v":""},{"$f":"IF(Score!B248>0,VLOOKUP(C249,Entrants!$A$2:$E$5000,4,FALSE),\"\")","v":""},{"$f":"IF(Score!C248>0,Score!C248,\"\")","v":""}]
[{"$f":"IF(Score!B249>0,Score!A249,\"\")","v":""},{"$f":"IF(Score!B249>0,IF(COUNTIF($E$3:E250,E250)>7,\"\",MAX($B$3:B249)+1),\"\")","v":""},{"$f":"IF(Score!B249>0,Score!B249,\"\")","v":""},{"$f":"IF(Score!B249>0,VLOOKUP(C250,Entrants!$A$2:$E$5000,3,FALSE),\"\")","v":""},{"$f":"IF(Score!B249>0,VLOOKUP(C250,Entrants!$A$2:$E$5000,2,FALSE),\"\")","v":""},{"$f":"IF(Score!B249>0,VLOOKUP(C250,Entrants!$A$2:$E$5000,4,FALSE),\"\")","v":""},{"$f":"IF(Score!C249>0,Score!C249,\"\")","v":""}]
[{"$f":"IF(Score!B250>0,Score!A250,\"\")","v":""},{"$f":"IF(Score!B250>0,IF(COUNTIF($E$3:E251,E251)>7,\"\",MAX($B$3:B250)+1),\"\")","v":""},{"$f":"IF(Score!B250>0,Score!B250,\"\")","v":""},{"$f":"IF(Score!B250>0,VLOOKUP(C251,Entrants!$A$2:$E$5000,3,FALSE),\"\")","v":""},{"$f":"IF(Score!B250>0,VLOOKUP(C251,Entrants!$A$2:$E$5000,2,FALSE),\"\")","v":""},{"$f":"IF(Score!B250>0,VLOOKUP(C251,Entrants!$A$2:$E$5000,4,FALSE),\"\")","v":""},{"$f":"IF(Score!C250>0,Score!C250,\"\")","v":""}]
[{"$f":"IF(Score!B251>0,Score!A251,\"\")","v":""},{"$f":"IF(Score!B251>0,IF(COUNTIF($E$3:E252,E252)>7,\"\",MAX($B$3:B251)+1),\"\")","v":""},{"$f":"IF(Score!B251>0,Score!B251,\"\")","v":""},{"$f":"IF(Score!B251>0,VLOOKUP(C252,Entrants!$A$2:$E$5000,3,FALSE),\"\")","v":""},{"$f":"IF(Score!B251>0,VLOOKUP(C252,Entrants!$A$2:$E$5000,2,FALSE),\"\")","v":""},{"$f":"IF(Score!B251>0,VLOOKUP(C252,Entrants!$A$2:$E$5000,4,FALSE),\"\")","v":""},{"$f":"IF(Score!C251>0,Score!C251,\"\")","v":""}]
[{"$f":"IF(Score!B252>0,Score!A252,\"\")","v":""},{"$f":"IF(Score!B252>0,IF(COUNTIF($E$3:E253,E253)>7,\"\",MAX($B$3:B252)+1),\"\")","v":""},{"$f":"IF(Score!B252>0,Score!B252,\"\")","v":""},{"$f":"IF(Score!B252>0,VLOOKUP(C253,Entrants!$A$2:$E$5000,3,FALSE),\"\")","v":""},{"$f":"IF(Score!B252>0,VLOOKUP(C253,Entrants!$A$2:$E$5000,2,FALSE),\"\")","v":""},{"$f":"IF(Score!B252>0,VLOOKUP(C253,Entrants!$A$2:$E$5000,4,FALSE),\"\")","v":""},{"$f":"IF(Score!C252>0,Score!C252,\"\")","v":""}]
[{"$f":"IF(Score!B253>0,Score!A253,\"\")","v":""},{"$f":"IF(Score!B253>0,IF(COUNTIF($E$3:E254,E254)>7,\"\",MAX($B$3:B253)+1),\"\")","v":""},{"$f":"IF(Score!B253>0,Score!B253,\"\")","v":""},{"$f":"IF(Score!B253>0,VLOOKUP(C254,Entrants!$A$2:$E$5000,3,FALSE),\"\")","v":""},{"$f":"IF(Score!B253>0,VLOOKUP(C254,Entrants!$A$2:$E$5000,2,FALSE),\"\")","v":""},{"$f":"IF(Score!B253>0,VLOOKUP(C254,Entrants!$A$2:$E$5000,4,FALSE),\"\")","v":""},{"$f":"IF(Score!C253>0,Score!C253,\"\")","v":""}]
[{"$f":"IF(Score!B254>0,Score!A254,\"\")","v":""},{"$f":"IF(Score!B254>0,IF(COUNTIF($E$3:E255,E255)>7,\"\",MAX($B$3:B254)+1),\"\")","v":""},{"$f":"IF(Score!B254>0,Score!B254,\"\")","v":""},{"$f":"IF(Score!B254>0,VLOOKUP(C255,Entrants!$A$2:$E$5000,3,FALSE),\"\")","v":""},{"$f":"IF(Score!B254>0,VLOOKUP(C255,Entrants!$A$2:$E$5000,2,FALSE),\"\")","v":""},{"$f":"IF(Score!B254>0,VLOOKUP(C255,Entrants!$A$2:$E$5000,4,FALSE),\"\")","v":""},{"$f":"IF(Score!C254>0,Score!C254,\"\")","v":""}]
[{"$f":"IF(Score!B255>0,Score!A255,\"\")","v":""},{"$f":"IF(Score!B255>0,IF(COUNTIF($E$3:E256,E256)>7,\"\",MAX($B$3:B255)+1),\"\")","v":""},{"$f":"IF(Score!B255>0,Score!B255,\"\")","v":""},{"$f":"IF(Score!B255>0,VLOOKUP(C256,Entrants!$A$2:$E$5000,3,FALSE),\"\")","v":""},{"$f":"IF(Score!B255>0,VLOOKUP(C256,Entrants!$A$2:$E$5000,2,FALSE),\"\")","v":""},{"$f":"IF(Score!B255>0,VLOOKUP(C256,Entrants!$A$2:$E$5000,4,FALSE),\"\")","v":""},{"$f":"IF(Score!C255>0,Score!C255,\"\")","v":""}]
[{"$f":"IF(Score!B256>0,Score!A256,\"\")","v":""},{"$f":"IF(Score!B256>0,IF(COUNTIF($E$3:E257,E257)>7,\"\",MAX($B$3:B256)+1),\"\")","v":""},{"$f":"IF(Score!B256>0,Score!B256,\"\")","v":""},{"$f":"IF(Score!B256>0,VLOOKUP(C257,Entrants!$A$2:$E$5000,3,FALSE),\"\")","v":""},{"$f":"IF(Score!B256>0,VLOOKUP(C257,Entrants!$A$2:$E$5000,2,FALSE),\"\")","v":""},{"$f":"IF(Score!B256>0,VLOOKUP(C257,Entrants!$A$2:$E$5000,4,FALSE),\"\")","v":""},{"$f":"IF(Score!C256>0,Score!C256,\"\")","v":""}]
[{"$f":"IF(Score!B257>0,Score!A257,\"\")","v":""},{"$f":"IF(Score!B257>0,IF(COUNTIF($E$3:E258,E258)>7,\"\",MAX($B$3:B257)+1),\"\")","v":""},{"$f":"IF(Score!B257>0,Score!B257,\"\")","v":""},{"$f":"IF(Score!B257>0,VLOOKUP(C258,Entrants!$A$2:$E$5000,3,FALSE),\"\")","v":""},{"$f":"IF(Score!B257>0,VLOOKUP(C258,Entrants!$A$2:$E$5000,2,FALSE),\"\")","v":""},{"$f":"IF(Score!B257>0,VLOOKUP(C258,Entrants!$A$2:$E$5000,4,FALSE),\"\")","v":""},{"$f":"IF(Score!C257>0,Score!C257,\"\")","v":""}]
[{"$f":"IF(Score!B258>0,Score!A258,\"\")","v":""},{"$f":"IF(Score!B258>0,IF(COUNTIF($E$3:E259,E259)>7,\"\",MAX($B$3:B258)+1),\"\")","v":""},{"$f":"IF(Score!B258>0,Score!B258,\"\")","v":""},{"$f":"IF(Score!B258>0,VLOOKUP(C259,Entrants!$A$2:$E$5000,3,FALSE),\"\")","v":""},{"$f":"IF(Score!B258>0,VLOOKUP(C259,Entrants!$A$2:$E$5000,2,FALSE),\"\")","v":""},{"$f":"IF(Score!B258>0,VLOOKUP(C259,Entrants!$A$2:$E$5000,4,FALSE),\"\")","v":""},{"$f":"IF(Score!C258>0,Score!C258,\"\")","v":""}]
[{"$f":"IF(Score!B259>0,Score!A259,\"\")","v":""},{"$f":"IF(Score!B259>0,IF(COUNTIF($E$3:E260,E260)>7,\"\",MAX($B$3:B259)+1),\"\")","v":""},{"$f":"IF(Score!B259>0,Score!B259,\"\")","v":""},{"$f":"IF(Score!B259>0,VLOOKUP(C260,Entrants!$A$2:$E$5000,3,FALSE),\"\")","v":""},{"$f":"IF(Score!B259>0,VLOOKUP(C260,Entrants!$A$2:$E$5000,2,FALSE),\"\")","v":""},{"$f":"IF(Score!B259>0,VLOOKUP(C260,Entrants!$A$2:$E$5000,4,FALSE),\"\")","v":""},{"$f":"IF(Score!C259>0,Score!C259,\"\")","v":""}]
[{"$f":"IF(Score!B260>0,Score!A260,\"\")","v":""},{"$f":"IF(Score!B260>0,IF(COUNTIF($E$3:E261,E261)>7,\"\",MAX($B$3:B260)+1),\"\")","v":""},{"$f":"IF(Score!B260>0,Score!B260,\"\")","v":""},{"$f":"IF(Score!B260>0,VLOOKUP(C261,Entrants!$A$2:$E$5000,3,FALSE),\"\")","v":""},{"$f":"IF(Score!B260>0,VLOOKUP(C261,Entrants!$A$2:$E$5000,2,FALSE),\"\")","v":""},{"$f":"IF(Score!B260>0,VLOOKUP(C261,Entrants!$A$2:$E$5000,4,FALSE),\"\")","v":""},{"$f":"IF(Score!C260>0,Score!C260,\"\")","v":""}]
[{"$f":"IF(Score!B261>0,Score!A261,\"\")","v":""},{"$f":"IF(Score!B261>0,IF(COUNTIF($E$3:E262,E262)>7,\"\",MAX($B$3:B261)+1),\"\")","v":""},{"$f":"IF(Score!B261>0,Score!B261,\"\")","v":""},{"$f":"IF(Score!B261>0,VLOOKUP(C262,Entrants!$A$2:$E$5000,3,FALSE),\"\")","v":""},{"$f":"IF(Score!B261>0,VLOOKUP(C262,Entrants!$A$2:$E$5000,2,FALSE),\"\")","v":""},{"$f":"IF(Score!B261>0,VLOOKUP(C262,Entrants!$A$2:$E$5000,4,FALSE),\"\")","v":""},{"$f":"IF(Score!C261>0,Score!C261,\"\")","v":""}]
[{"$f":"IF(Score!B262>0,Score!A262,\"\")","v":""},{"$f":"IF(Score!B262>0,IF(COUNTIF($E$3:E263,E263)>7,\"\",MAX($B$3:B262)+1),\"\")","v":""},{"$f":"IF(Score!B262>0,Score!B262,\"\")","v":""},{"$f":"IF(Score!B262>0,VLOOKUP(C263,Entrants!$A$2:$E$5000,3,FALSE),\"\")","v":""},{"$f":"IF(Score!B262>0,VLOOKUP(C263,Entrants!$A$2:$E$5000,2,FALSE),\"\")","v":""},{"$f":"IF(Score!B262>0,VLOOKUP(C263,Entrants!$A$2:$E$5000,4,FALSE),\"\")","v":""},{"$f":"IF(Score!C262>0,Score!C262,\"\")","v":""}]
[{"$f":"IF(Score!B263>0,Score!A263,\"\")","v":""},{"$f":"IF(Score!B263>0,IF(COUNTIF($E$3:E264,E264)>7,\"\",MAX($B$3:B263)+1),\"\")","v":""},{"$f":"IF(Score!B263>0,Score!B263,\"\")","v":""},{"$f":"IF(Score!B263>0,VLOOKUP(C264,Entrants!$A$2:$E$5000,3,FALSE),\"\")","v":""},{"$f":"IF(Score!B263>0,VLOOKUP(C264,Entrants!$A$2:$E$5000,2,FALSE),\"\")","v":""},{"$f":"IF(Score!B263>0,VLOOKUP(C264,Entrants!$A$2:$E$5000,4,FALSE),\"\")","v":""},{"$f":"IF(Score!C263>0,Score!C263,\"\")","v":""}]
[{"$f":"IF(Score!B264>0,Score!A264,\"\")","v":""},{"$f":"IF(Score!B264>0,IF(COUNTIF($E$3:E265,E265)>7,\"\",MAX($B$3:B264)+1),\"\")","v":""},{"$f":"IF(Score!B264>0,Score!B264,\"\")","v":""},{"$f":"IF(Score!B264>0,VLOOKUP(C265,Entrants!$A$2:$E$5000,3,FALSE),\"\")","v":""},{"$f":"IF(Score!B264>0,VLOOKUP(C265,Entrants!$A$2:$E$5000,2,FALSE),\"\")","v":""},{"$f":"IF(Score!B264>0,VLOOKUP(C265,Entrants!$A$2:$E$5000,4,FALSE),\"\")","v":""},{"$f":"IF(Score!C264>0,Score!C264,\"\")","v":""}]
[{"$f":"IF(Score!B265>0,Score!A265,\"\")","v":""},{"$f":"IF(Score!B265>0,IF(COUNTIF($E$3:E266,E266)>7,\"\",MAX($B$3:B265)+1),\"\")","v":""},{"$f":"IF(Score!B265>0,Score!B265,\"\")","v":""},{"$f":"IF(Score!B265>0,VLOOKUP(C266,Entrants!$A$2:$E$5000,3,FALSE),\"\")","v":""},{"$f":"IF(Score!B265>0,VLOOKUP(C266,Entrants!$A$2:$E$5000,2,FALSE),\"\")","v":""},{"$f":"IF(Score!B265>0,VLOOKUP(C266,Entrants!$A$2:$E$5000,4,FALSE),\"\")","v":""},{"$f":"IF(Score!C265>0,Score!C265,\"\")","v":""}]
[{"$f":"IF(Score!B266>0,Score!A266,\"\")","v":""},{"$f":"IF(Score!B266>0,IF(COUNTIF($E$3:E267,E267)>7,\"\",MAX($B$3:B266)+1),\"\")","v":""},{"$f":"IF(Score!B266>0,Score!B266,\"\")","v":""},{"$f":"IF(Score!B266>0,VLOOKUP(C267,Entrants!$A$2:$E$5000,3,FALSE),\"\")","v":""},{"$f":"IF(Score!B266>0,VLOOKUP(C267,Entrants!$A$2:$E$5000,2,FALSE),\"\")","v":""},{"$f":"IF(Score!B266>0,VLOOKUP(C267,Entrants!$A$2:$E$5000,4,FALSE),\"\")","v":""},{"$f":"IF(Score!C266>0,Score!C266,\"\")","v":""}]
[{"$f":"IF(Score!B267>0,Score!A267,\"\")","v":""},{"$f":"IF(Score!B267>0,IF(COUNTIF($E$3:E268,E268)>7,\"\",MAX($B$3:B267)+1),\"\")","v":""},{"$f":"IF(Score!B267>0,Score!B267,\"\")","v":""},{"$f":"IF(Score!B267>0,VLOOKUP(C268,Entrants!$A$2:$E$5000,3,FALSE),\"\")","v":""},{"$f":"IF(Score!B267>0,VLOOKUP(C268,Entrants!$A$2:$E$5000,2,FALSE),\"\")","v":""},{"$f":"IF(Score!B267>0,VLOOKUP(C268,Entrants!$A$2:$E$5000,4,FALSE),\"\")","v":""},{"$f":"IF(Score!C267>0,Score!C267,\"\")","v":""}]
[{"$f":"IF(Score!B268>0,Score!A268,\"\")","v":""},{"$f":"IF(Score!B268>0,IF(COUNTIF($E$3:E269,E269)>7,\"\",MAX($B$3:B268)+1),\"\")","v":""},{"$f":"IF(Score!B268>0,Score!B268,\"\")","v":""},{"$f":"IF(Score!B268>0,VLOOKUP(C269,Entrants!$A$2:$E$5000,3,FALSE),\"\")","v":""},{"$f":"IF(Score!B268>0,VLOOKUP(C269,Entrants!$A$2:$E$5000,2,FALSE),\"\")","v":""},{"$f":"IF(Score!B268>0,VLOOKUP(C269,Entrants!$A$2:$E$5000,4,FALSE),\"\")","v":""},{"$f":"IF(Score!C268>0,Score!C268,\"\")","v":""}]
[{"$f":"IF(Score!B269>0,Score!A269,\"\")","v":""},{"$f":"IF(Score!B269>0,IF(COUNTIF($E$3:E270,E270)>7,\"\",MAX($B$3:B269)+1),\"\")","v":""},{"$f":"IF(Score!B269>0,Score!B269,\"\")","v":""},{"$f":"IF(Score!B269>0,VLOOKUP(C270,Entrants!$A$2:$E$5000,3,FALSE),\"\")","v":""},{"$f":"IF(Score!B269>0,VLOOKUP(C270,Entrants!$A$2:$E$5000,2,FALSE),\"\")","v":""},{"$f":"IF(Score!B269>0,VLOOKUP(C270,Entrants!$A$2:$E$5000,4,FALSE),\"\")","v":""},{"$f":"IF(Score!C269>0,Score!C269,\"\")","v":""}]
[{"$f":"IF(Score!B270>0,Score!A270,\"\")","v":""},{"$f":"IF(Score!B270>0,IF(COUNTIF($E$3:E271,E271)>7,\"\",MAX($B$3:B270)+1),\"\")","v":""},{"$f":"IF(Score!B270>0,Score!B270,\"\")","v":""},{"$f":"IF(Score!B270>0,VLOOKUP(C271,Entrants!$A$2:$E$5000,3,FALSE),\"\")","v":""},{"$f":"IF(Score!B270>0,VLOOKUP(C271,Entrants!$A$2:$E$5000,2,FALSE),\"\")","v":""},{"$f":"IF(Score!B270>0,VLOOKUP(C271,Entrants!$A$2:$E$5000,4,FALSE),\"\")","v":""},{"$f":"IF(Score!C270>0,Score!C270,\"\")","v":""}]
[{"$f":"IF(Score!B271>0,Score!A271,\"\")","v":""},{"$f":"IF(Score!B271>0,IF(COUNTIF($E$3:E272,E272)>7,\"\",MAX($B$3:B271)+1),\"\")","v":""},{"$f":"IF(Score!B271>0,Score!B271,\"\")","v":""},{"$f":"IF(Score!B271>0,VLOOKUP(C272,Entrants!$A$2:$E$5000,3,FALSE),\"\")","v":""},{"$f":"IF(Score!B271>0,VLOOKUP(C272,Entrants!$A$2:$E$5000,2,FALSE),\"\")","v":""},{"$f":"IF(Score!B271>0,VLOOKUP(C272,Entrants!$A$2:$E$5000,4,FALSE),\"\")","v":""},{"$f":"IF(Score!C271>0,Score!C271,\"\")","v":""}]
[{"$f":"IF(Score!B272>0,Score!A272,\"\")","v":""},{"$f":"IF(Score!B272>0,IF(COUNTIF($E$3:E273,E273)>7,\"\",MAX($B$3:B272)+1),\"\")","v":""},{"$f":"IF(Score!B272>0,Score!B272,\"\")","v":""},{"$f":"IF(Score!B272>0,VLOOKUP(C273,Entrants!$A$2:$E$5000,3,FALSE),\"\")","v":""},{"$f":"IF(Score!B272>0,VLOOKUP(C273,Entrants!$A$2:$E$5000,2,FALSE),\"\")","v":""},{"$f":"IF(Score!B272>0,VLOOKUP(C273,Entrants!$A$2:$E$5000,4,FALSE),\"\")","v":""},{"$f":"IF(Score!C272>0,Score!C272,\"\")","v":""}]
[{"$f":"IF(Score!B273>0,Score!A273,\"\")","v":""},{"$f":"IF(Score!B273>0,IF(COUNTIF($E$3:E274,E274)>7,\"\",MAX($B$3:B273)+1),\"\")","v":""},{"$f":"IF(Score!B273>0,Score!B273,\"\")","v":""},{"$f":"IF(Score!B273>0,VLOOKUP(C274,Entrants!$A$2:$E$5000,3,FALSE),\"\")","v":""},{"$f":"IF(Score!B273>0,VLOOKUP(C274,Entrants!$A$2:$E$5000,2,FALSE),\"\")","v":""},{"$f":"IF(Score!B273>0,VLOOKUP(C274,Entrants!$A$2:$E$5000,4,FALSE),\"\")","v":""},{"$f":"IF(Score!C273>0,Score!C273,\"\")","v":""}]
[{"$f":"IF(Score!B274>0,Score!A274,\"\")","v":""},{"$f":"IF(Score!B274>0,IF(COUNTIF($E$3:E275,E275)>7,\"\",MAX($B$3:B274)+1),\"\")","v":""},{"$f":"IF(Score!B274>0,Score!B274,\"\")","v":""},{"$f":"IF(Score!B274>0,VLOOKUP(C275,Entrants!$A$2:$E$5000,3,FALSE),\"\")","v":""},{"$f":"IF(Score!B274>0,VLOOKUP(C275,Entrants!$A$2:$E$5000,2,FALSE),\"\")","v":""},{"$f":"IF(Score!B274>0,VLOOKUP(C275,Entrants!$A$2:$E$5000,4,FALSE),\"\")","v":""},{"$f":"IF(Score!C274>0,Score!C274,\"\")","v":""}]
[{"$f":"IF(Score!B275>0,Score!A275,\"\")","v":""},{"$f":"IF(Score!B275>0,IF(COUNTIF($E$3:E276,E276)>7,\"\",MAX($B$3:B275)+1),\"\")","v":""},{"$f":"IF(Score!B275>0,Score!B275,\"\")","v":""},{"$f":"IF(Score!B275>0,VLOOKUP(C276,Entrants!$A$2:$E$5000,3,FALSE),\"\")","v":""},{"$f":"IF(Score!B275>0,VLOOKUP(C276,Entrants!$A$2:$E$5000,2,FALSE),\"\")","v":""},{"$f":"IF(Score!B275>0,VLOOKUP(C276,Entrants!$A$2:$E$5000,4,FALSE),\"\")","v":""},{"$f":"IF(Score!C275>0,Score!C275,\"\")","v":""}]
[{"$f":"IF(Score!B276>0,Score!A276,\"\")","v":""},{"$f":"IF(Score!B276>0,IF(COUNTIF($E$3:E277,E277)>7,\"\",MAX($B$3:B276)+1),\"\")","v":""},{"$f":"IF(Score!B276>0,Score!B276,\"\")","v":""},{"$f":"IF(Score!B276>0,VLOOKUP(C277,Entrants!$A$2:$E$5000,3,FALSE),\"\")","v":""},{"$f":"IF(Score!B276>0,VLOOKUP(C277,Entrants!$A$2:$E$5000,2,FALSE),\"\")","v":""},{"$f":"IF(Score!B276>0,VLOOKUP(C277,Entrants!$A$2:$E$5000,4,FALSE),\"\")","v":""},{"$f":"IF(Score!C276>0,Score!C276,\"\")","v":""}]
[{"$f":"IF(Score!B277>0,Score!A277,\"\")","v":""},{"$f":"IF(Score!B277>0,IF(COUNTIF($E$3:E278,E278)>7,\"\",MAX($B$3:B277)+1),\"\")","v":""},{"$f":"IF(Score!B277>0,Score!B277,\"\")","v":""},{"$f":"IF(Score!B277>0,VLOOKUP(C278,Entrants!$A$2:$E$5000,3,FALSE),\"\")","v":""},{"$f":"IF(Score!B277>0,VLOOKUP(C278,Entrants!$A$2:$E$5000,2,FALSE),\"\")","v":""},{"$f":"IF(Score!B277>0,VLOOKUP(C278,Entrants!$A$2:$E$5000,4,FALSE),\"\")","v":""},{"$f":"IF(Score!C277>0,Score!C277,\"\")","v":""}]
[{"$f":"IF(Score!B278>0,Score!A278,\"\")","v":""},{"$f":"IF(Score!B278>0,IF(COUNTIF($E$3:E279,E279)>7,\"\",MAX($B$3:B278)+1),\"\")","v":""},{"$f":"IF(Score!B278>0,Score!B278,\"\")","v":""},{"$f":"IF(Score!B278>0,VLOOKUP(C279,Entrants!$A$2:$E$5000,3,FALSE),\"\")","v":""},{"$f":"IF(Score!B278>0,VLOOKUP(C279,Entrants!$A$2:$E$5000,2,FALSE),\"\")","v":""},{"$f":"IF(Score!B278>0,VLOOKUP(C279,Entrants!$A$2:$E$5000,4,FALSE),\"\")","v":""},{"$f":"IF(Score!C278>0,Score!C278,\"\")","v":""}]
[{"$f":"IF(Score!B279>0,Score!A279,\"\")","v":""},{"$f":"IF(Score!B279>0,IF(COUNTIF($E$3:E280,E280)>7,\"\",MAX($B$3:B279)+1),\"\")","v":""},{"$f":"IF(Score!B279>0,Score!B279,\"\")","v":""},{"$f":"IF(Score!B279>0,VLOOKUP(C280,Entrants!$A$2:$E$5000,3,FALSE),\"\")","v":""},{"$f":"IF(Score!B279>0,VLOOKUP(C280,Entrants!$A$2:$E$5000,2,FALSE),\"\")","v":""},{"$f":"IF(Score!B279>0,VLOOKUP(C280,Entrants!$A$2:$E$5000,4,FALSE),\"\")","v":""},{"$f":"IF(Score!C279>0,Score!C279,\"\")","v":""}]
[{"$f":"IF(Score!B280>0,Score!A280,\"\")","v":""},{"$f":"IF(Score!B280>0,IF(COUNTIF($E$3:E281,E281)>7,\"\",MAX($B$3:B280)+1),\"\")","v":""},{"$f":"IF(Score!B280>0,Score!B280,\"\")","v":""},{"$f":"IF(Score!B280>0,VLOOKUP(C281,Entrants!$A$2:$E$5000,3,FALSE),\"\")","v":""},{"$f":"IF(Score!B280>0,VLOOKUP(C281,Entrants!$A$2:$E$5000,2,FALSE),\"\")","v":""},{"$f":"IF(Score!B280>0,VLOOKUP(C281,Entrants!$A$2:$E$5000,4,FALSE),\"\")","v":""},{"$f":"IF(Score!C280>0,Score!C280,\"\")","v":""}]
[{"$f":"IF(Score!B281>0,Score!A281,\"\")","v":""},{"$f":"IF(Score!B281>0,IF(COUNTIF($E$3:E282,E282)>7,\"\",MAX($B$3:B281)+1),\"\")","v":""},{"$f":"IF(Score!B281>0,Score!B281,\"\")","v":""},{"$f":"IF(Score!B281>0,VLOOKUP(C282,Entrants!$A$2:$E$5000,3,FALSE),\"\")","v":""},{"$f":"IF(Score!B281>0,VLOOKUP(C282,Entrants!$A$2:$E$5000,2,FALSE),\"\")","v":""},{"$f":"IF(Score!B281>0,VLOOKUP(C282,Entrants!$A$2:$E$5000,4,FALSE),\"\")","v":""},{"$f":"IF(Score!C281>0,Score!C281,\"\")","v":""}]
[{"$f":"IF(Score!B282>0,Score!A282,\"\")","v":""},{"$f":"IF(Score!B282>0,IF(COUNTIF($E$3:E283,E283)>7,\"\",MAX($B$3:B282)+1),\"\")","v":""},{"$f":"IF(Score!B282>0,Score!B282,\"\")","v":""},{"$f":"IF(Score!B282>0,VLOOKUP(C283,Entrants!$A$2:$E$5000,3,FALSE),\"\")","v":""},{"$f":"IF(Score!B282>0,VLOOKUP(C283,Entrants!$A$2:$E$5000,2,FALSE),\"\")","v":""},{"$f":"IF(Score!B282>0,VLOOKUP(C283,Entrants!$A$2:$E$5000,4,FALSE),\"\")","v":""},{"$f":"IF(Score!C282>0,Score!C282,\"\")","v":""}]
[{"$f":"IF(Score!B283>0,Score!A283,\"\")","v":""},{"$f":"IF(Score!B283>0,IF(COUNTIF($E$3:E284,E284)>7,\"\",MAX($B$3:B283)+1),\"\")","v":""},{"$f":"IF(Score!B283>0,Score!B283,\"\")","v":""},{"$f":"IF(Score!B283>0,VLOOKUP(C284,Entrants!$A$2:$E$5000,3,FALSE),\"\")","v":""},{"$f":"IF(Score!B283>0,VLOOKUP(C284,Entrants!$A$2:$E$5000,2,FALSE),\"\")","v":""},{"$f":"IF(Score!B283>0,VLOOKUP(C284,Entrants!$A$2:$E$5000,4,FALSE),\"\")","v":""},{"$f":"IF(Score!C283>0,Score!C283,\"\")","v":""}]
[{"$f":"IF(Score!B284>0,Score!A284,\"\")","v":""},{"$f":"IF(Score!B284>0,IF(COUNTIF($E$3:E285,E285)>7,\"\",MAX($B$3:B284)+1),\"\")","v":""},{"$f":"IF(Score!B284>0,Score!B284,\"\")","v":""},{"$f":"IF(Score!B284>0,VLOOKUP(C285,Entrants!$A$2:$E$5000,3,FALSE),\"\")","v":""},{"$f":"IF(Score!B284>0,VLOOKUP(C285,Entrants!$A$2:$E$5000,2,FALSE),\"\")","v":""},{"$f":"IF(Score!B284>0,VLOOKUP(C285,Entrants!$A$2:$E$5000,4,FALSE),\"\")","v":""},{"$f":"IF(Score!C284>0,Score!C284,\"\")","v":""}]
[{"$f":"IF(Score!B285>0,Score!A285,\"\")","v":""},{"$f":"IF(Score!B285>0,IF(COUNTIF($E$3:E286,E286)>7,\"\",MAX($B$3:B285)+1),\"\")","v":""},{"$f":"IF(Score!B285>0,Score!B285,\"\")","v":""},{"$f":"IF(Score!B285>0,VLOOKUP(C286,Entrants!$A$2:$E$5000,3,FALSE),\"\")","v":""},{"$f":"IF(Score!B285>0,VLOOKUP(C286,Entrants!$A$2:$E$5000,2,FALSE),\"\")","v":""},{"$f":"IF(Score!B285>0,VLOOKUP(C286,Entrants!$A$2:$E$5000,4,FALSE),\"\")","v":""},{"$f":"IF(Score!C285>0,Score!C285,\"\")","v":""}]
[{"$f":"IF(Score!B286>0,Score!A286,\"\")","v":""},{"$f":"IF(Score!B286>0,IF(COUNTIF($E$3:E287,E287)>7,\"\",MAX($B$3:B286)+1),\"\")","v":""},{"$f":"IF(Score!B286>0,Score!B286,\"\")","v":""},{"$f":"IF(Score!B286>0,VLOOKUP(C287,Entrants!$A$2:$E$5000,3,FALSE),\"\")","v":""},{"$f":"IF(Score!B286>0,VLOOKUP(C287,Entrants!$A$2:$E$5000,2,FALSE),\"\")","v":""},{"$f":"IF(Score!B286>0,VLOOKUP(C287,Entrants!$A$2:$E$5000,4,FALSE),\"\")","v":""},{"$f":"IF(Score!C286>0,Score!C286,\"\")","v":""}]
[{"$f":"IF(Score!B287>0,Score!A287,\"\")","v":""},{"$f":"IF(Score!B287>0,IF(COUNTIF($E$3:E288,E288)>7,\"\",MAX($B$3:B287)+1),\"\")","v":""},{"$f":"IF(Score!B287>0,Score!B287,\"\")","v":""},{"$f":"IF(Score!B287>0,VLOOKUP(C288,Entrants!$A$2:$E$5000,3,FALSE),\"\")","v":""},{"$f":"IF(Score!B287>0,VLOOKUP(C288,Entrants!$A$2:$E$5000,2,FALSE),\"\")","v":""},{"$f":"IF(Score!B287>0,VLOOKUP(C288,Entrants!$A$2:$E$5000,4,FALSE),\"\")","v":""},{"$f":"IF(Score!C287>0,Score!C287,\"\")","v":""}]
[{"$f":"IF(Score!B288>0,Score!A288,\"\")","v":""},{"$f":"IF(Score!B288>0,IF(COUNTIF($E$3:E289,E289)>7,\"\",MAX($B$3:B288)+1),\"\")","v":""},{"$f":"IF(Score!B288>0,Score!B288,\"\")","v":""},{"$f":"IF(Score!B288>0,VLOOKUP(C289,Entrants!$A$2:$E$5000,3,FALSE),\"\")","v":""},{"$f":"IF(Score!B288>0,VLOOKUP(C289,Entrants!$A$2:$E$5000,2,FALSE),\"\")","v":""},{"$f":"IF(Score!B288>0,VLOOKUP(C289,Entrants!$A$2:$E$5000,4,FALSE),\"\")","v":""},{"$f":"IF(Score!C288>0,Score!C288,\"\")","v":""}]
[{"$f":"IF(Score!B289>0,Score!A289,\"\")","v":""},{"$f":"IF(Score!B289>0,IF(COUNTIF($E$3:E290,E290)>7,\"\",MAX($B$3:B289)+1),\"\")","v":""},{"$f":"IF(Score!B289>0,Score!B289,\"\")","v":""},{"$f":"IF(Score!B289>0,VLOOKUP(C290,Entrants!$A$2:$E$5000,3,FALSE),\"\")","v":""},{"$f":"IF(Score!B289>0,VLOOKUP(C290,Entrants!$A$2:$E$5000,2,FALSE),\"\")","v":""},{"$f":"IF(Score!B289>0,VLOOKUP(C290,Entrants!$A$2:$E$5000,4,FALSE),\"\")","v":""},{"$f":"IF(Score!C289>0,Score!C289,\"\")","v":""}]
[{"$f":"IF(Score!B290>0,Score!A290,\"\")","v":""},{"$f":"IF(Score!B290>0,IF(COUNTIF($E$3:E291,E291)>7,\"\",MAX($B$3:B290)+1),\"\")","v":""},{"$f":"IF(Score!B290>0,Score!B290,\"\")","v":""},{"$f":"IF(Score!B290>0,VLOOKUP(C291,Entrants!$A$2:$E$5000,3,FALSE),\"\")","v":""},{"$f":"IF(Score!B290>0,VLOOKUP(C291,Entrants!$A$2:$E$5000,2,FALSE),\"\")","v":""},{"$f":"IF(Score!B290>0,VLOOKUP(C291,Entrants!$A$2:$E$5000,4,FALSE),\"\")","v":""},{"$f":"IF(Score!C290>0,Score!C290,\"\")","v":""}]
[{"$f":"IF(Score!B291>0,Score!A291,\"\")","v":""},{"$f":"IF(Score!B291>0,IF(COUNTIF($E$3:E292,E292)>7,\"\",MAX($B$3:B291)+1),\"\")","v":""},{"$f":"IF(Score!B291>0,Score!B291,\"\")","v":""},{"$f":"IF(Score!B291>0,VLOOKUP(C292,Entrants!$A$2:$E$5000,3,FALSE),\"\")","v":""},{"$f":"IF(Score!B291>0,VLOOKUP(C292,Entrants!$A$2:$E$5000,2,FALSE),\"\")","v":""},{"$f":"IF(Score!B291>0,VLOOKUP(C292,Entrants!$A$2:$E$5000,4,FALSE),\"\")","v":""},{"$f":"IF(Score!C291>0,Score!C291,\"\")","v":""}]
[{"$f":"IF(Score!B292>0,Score!A292,\"\")","v":""},{"$f":"IF(Score!B292>0,IF(COUNTIF($E$3:E293,E293)>7,\"\",MAX($B$3:B292)+1),\"\")","v":""},{"$f":"IF(Score!B292>0,Score!B292,\"\")","v":""},{"$f":"IF(Score!B292>0,VLOOKUP(C293,Entrants!$A$2:$E$5000,3,FALSE),\"\")","v":""},{"$f":"IF(Score!B292>0,VLOOKUP(C293,Entrants!$A$2:$E$5000,2,FALSE),\"\")","v":""},{"$f":"IF(Score!B292>0,VLOOKUP(C293,Entrants!$A$2:$E$5000,4,FALSE),\"\")","v":""},{"$f":"IF(Score!C292>0,Score!C292,\"\")","v":""}]
[{"$f":"IF(Score!B293>0,Score!A293,\"\")","v":""},{"$f":"IF(Score!B293>0,IF(COUNTIF($E$3:E294,E294)>7,\"\",MAX($B$3:B293)+1),\"\")","v":""},{"$f":"IF(Score!B293>0,Score!B293,\"\")","v":""},{"$f":"IF(Score!B293>0,VLOOKUP(C294,Entrants!$A$2:$E$5000,3,FALSE),\"\")","v":""},{"$f":"IF(Score!B293>0,VLOOKUP(C294,Entrants!$A$2:$E$5000,2,FALSE),\"\")","v":""},{"$f":"IF(Score!B293>0,VLOOKUP(C294,Entrants!$A$2:$E$5000,4,FALSE),\"\")","v":""},{"$f":"IF(Score!C293>0,Score!C293,\"\")","v":""}]
[{"$f":"IF(Score!B294>0,Score!A294,\"\")","v":""},{"$f":"IF(Score!B294>0,IF(COUNTIF($E$3:E295,E295)>7,\"\",MAX($B$3:B294)+1),\"\")","v":""},{"$f":"IF(Score!B294>0,Score!B294,\"\")","v":""},{"$f":"IF(Score!B294>0,VLOOKUP(C295,Entrants!$A$2:$E$5000,3,FALSE),\"\")","v":""},{"$f":"IF(Score!B294>0,VLOOKUP(C295,Entrants!$A$2:$E$5000,2,FALSE),\"\")","v":""},{"$f":"IF(Score!B294>0,VLOOKUP(C295,Entrants!$A$2:$E$5000,4,FALSE),\"\")","v":""},{"$f":"IF(Score!C294>0,Score!C294,\"\")","v":""}]
[{"$f":"IF(Score!B295>0,Score!A295,\"\")","v":""},{"$f":"IF(Score!B295>0,IF(COUNTIF($E$3:E296,E296)>7,\"\",MAX($B$3:B295)+1),\"\")","v":""},{"$f":"IF(Score!B295>0,Score!B295,\"\")","v":""},{"$f":"IF(Score!B295>0,VLOOKUP(C296,Entrants!$A$2:$E$5000,3,FALSE),\"\")","v":""},{"$f":"IF(Score!B295>0,VLOOKUP(C296,Entrants!$A$2:$E$5000,2,FALSE),\"\")","v":""},{"$f":"IF(Score!B295>0,VLOOKUP(C296,Entrants!$A$2:$E$5000,4,FALSE),\"\")","v":""},{"$f":"IF(Score!C295>0,Score!C295,\"\")","v":""}]
[{"$f":"IF(Score!B296>0,Score!A296,\"\")","v":""},{"$f":"IF(Score!B296>0,IF(COUNTIF($E$3:E297,E297)>7,\"\",MAX($B$3:B296)+1),\"\")","v":""},{"$f":"IF(Score!B296>0,Score!B296,\"\")","v":""},{"$f":"IF(Score!B296>0,VLOOKUP(C297,Entrants!$A$2:$E$5000,3,FALSE),\"\")","v":""},{"$f":"IF(Score!B296>0,VLOOKUP(C297,Entrants!$A$2:$E$5000,2,FALSE),\"\")","v":""},{"$f":"IF(Score!B296>0,VLOOKUP(C297,Entrants!$A$2:$E$5000,4,FALSE),\"\")","v":""},{"$f":"IF(Score!C296>0,Score!C296,\"\")","v":""}]
[{"$f":"IF(Score!B297>0,Score!A297,\"\")","v":""},{"$f":"IF(Score!B297>0,IF(COUNTIF($E$3:E298,E298)>7,\"\",MAX($B$3:B297)+1),\"\")","v":""},{"$f":"IF(Score!B297>0,Score!B297,\"\")","v":""},{"$f":"IF(Score!B297>0,VLOOKUP(C298,Entrants!$A$2:$E$5000,3,FALSE),\"\")","v":""},{"$f":"IF(Score!B297>0,VLOOKUP(C298,Entrants!$A$2:$E$5000,2,FALSE),\"\")","v":""},{"$f":"IF(Score!B297>0,VLOOKUP(C298,Entrants!$A$2:$E$5000,4,FALSE),\"\")","v":""},{"$f":"IF(Score!C297>0,Score!C297,\"\")","v":""}]
[{"$f":"IF(Score!B298>0,Score!A298,\"\")","v":""},{"$f":"IF(Score!B298>0,IF(COUNTIF($E$3:E299,E299)>7,\"\",MAX($B$3:B298)+1),\"\")","v":""},{"$f":"IF(Score!B298>0,Score!B298,\"\")","v":""},{"$f":"IF(Score!B298>0,VLOOKUP(C299,Entrants!$A$2:$E$5000,3,FALSE),\"\")","v":""},{"$f":"IF(Score!B298>0,VLOOKUP(C299,Entrants!$A$2:$E$5000,2,FALSE),\"\")","v":""},{"$f":"IF(Score!B298>0,VLOOKUP(C299,Entrants!$A$2:$E$5000,4,FALSE),\"\")","v":""},{"$f":"IF(Score!C298>0,Score!C298,\"\")","v":""}]
[{"$f":"IF(Score!B299>0,Score!A299,\"\")","v":""},{"$f":"IF(Score!B299>0,IF(COUNTIF($E$3:E300,E300)>7,\"\",MAX($B$3:B299)+1),\"\")","v":""},{"$f":"IF(Score!B299>0,Score!B299,\"\")","v":""},{"$f":"IF(Score!B299>0,VLOOKUP(C300,Entrants!$A$2:$E$5000,3,FALSE),\"\")","v":""},{"$f":"IF(Score!B299>0,VLOOKUP(C300,Entrants!$A$2:$E$5000,2,FALSE),\"\")","v":""},{"$f":"IF(Score!B299>0,VLOOKUP(C300,Entrants!$A$2:$E$5000,4,FALSE),\"\")","v":""},{"$f":"IF(Score!C299>0,Score!C299,\"\")","v":""}]
[{"$f":"IF(Score!B300>0,Score!A300,\"\")","v":""},{"$f":"IF(Score!B300>0,IF(COUNTIF($E$3:E301,E301)>7,\"\",MAX($B$3:B300)+1),\"\")","v":""},{"$f":"IF(Score!B300>0,Score!B300,\"\")","v":""},{"$f":"IF(Score!B300>0,VLOOKUP(C301,Entrants!$A$2:$E$5000,3,FALSE),\"\")","v":""},{"$f":"IF(Score!B300>0,VLOOKUP(C301,Entrants!$A$2:$E$5000,2,FALSE),\"\")","v":""},{"$f":"IF(Score!B300>0,VLOOKUP(C301,Entrants!$A$2:$E$5000,4,FALSE),\"\")","v":""},{"$f":"IF(Score!C300>0,Score!C300,\"\")","v":""}]
[{"$f":"IF(Score!B301>0,Score!A301,\"\")","v":""},{"$f":"IF(Score!B301>0,IF(COUNTIF($E$3:E302,E302)>7,\"\",MAX($B$3:B301)+1),\"\")","v":""},{"$f":"IF(Score!B301>0,Score!B301,\"\")","v":""},{"$f":"IF(Score!B301>0,VLOOKUP(C302,Entrants!$A$2:$E$5000,3,FALSE),\"\")","v":""},{"$f":"IF(Score!B301>0,VLOOKUP(C302,Entrants!$A$2:$E$5000,2,FALSE),\"\")","v":""},{"$f":"IF(Score!B301>0,VLOOKUP(C302,Entrants!$A$2:$E$5000,4,FALSE),\"\")","v":""},{"$f":"IF(Score!C301>0,Score!C301,\"\")","v":""}]
[{"$f":"IF(Score!B302>0,Score!A302,\"\")","v":""},{"$f":"IF(Score!B302>0,IF(COUNTIF($E$3:E303,E303)>7,\"\",MAX($B$3:B302)+1),\"\")","v":""},{"$f":"IF(Score!B302>0,Score!B302,\"\")","v":""},{"$f":"IF(Score!B302>0,VLOOKUP(C303,Entrants!$A$2:$E$5000,3,FALSE),\"\")","v":""},{"$f":"IF(Score!B302>0,VLOOKUP(C303,Entrants!$A$2:$E$5000,2,FALSE),\"\")","v":""},{"$f":"IF(Score!B302>0,VLOOKUP(C303,Entrants!$A$2:$E$5000,4,FALSE),\"\")","v":""},{"$f":"IF(Score!C302>0,Score!C302,\"\")","v":""}]
[{"$f":"IF(Score!B303>0,Score!A303,\"\")","v":""},{"$f":"IF(Score!B303>0,IF(COUNTIF($E$3:E304,E304)>7,\"\",MAX($B$3:B303)+1),\"\")","v":""},{"$f":"IF(Score!B303>0,Score!B303,\"\")","v":""},{"$f":"IF(Score!B303>0,VLOOKUP(C304,Entrants!$A$2:$E$5000,3,FALSE),\"\")","v":""},{"$f":"IF(Score!B303>0,VLOOKUP(C304,Entrants!$A$2:$E$5000,2,FALSE),\"\")","v":""},{"$f":"IF(Score!B303>0,VLOOKUP(C304,Entrants!$A$2:$E$5000,4,FALSE),\"\")","v":""},{"$f":"IF(Score!C303>0,Score!C303,\"\")","v":""}]
[{"$f":"IF(Score!B304>0,Score!A304,\"\")","v":""},{"$f":"IF(Score!B304>0,IF(COUNTIF($E$3:E305,E305)>7,\"\",MAX($B$3:B304)+1),\"\")","v":""},{"$f":"IF(Score!B304>0,Score!B304,\"\")","v":""},{"$f":"IF(Score!B304>0,VLOOKUP(C305,Entrants!$A$2:$E$5000,3,FALSE),\"\")","v":""},{"$f":"IF(Score!B304>0,VLOOKUP(C305,Entrants!$A$2:$E$5000,2,FALSE),\"\")","v":""},{"$f":"IF(Score!B304>0,VLOOKUP(C305,Entrants!$A$2:$E$5000,4,FALSE),\"\")","v":""},{"$f":"IF(Score!C304>0,Score!C304,\"\")","v":""}]
[{"$f":"IF(Score!B305>0,Score!A305,\"\")","v":""},{"$f":"IF(Score!B305>0,IF(COUNTIF($E$3:E306,E306)>7,\"\",MAX($B$3:B305)+1),\"\")","v":""},{"$f":"IF(Score!B305>0,Score!B305,\"\")","v":""},{"$f":"IF(Score!B305>0,VLOOKUP(C306,Entrants!$A$2:$E$5000,3,FALSE),\"\")","v":""},{"$f":"IF(Score!B305>0,VLOOKUP(C306,Entrants!$A$2:$E$5000,2,FALSE),\"\")","v":""},{"$f":"IF(Score!B305>0,VLOOKUP(C306,Entrants!$A$2:$E$5000,4,FALSE),\"\")","v":""},{"$f":"IF(Score!C305>0,Score!C305,\"\")","v":""}]
[{"$f":"IF(Score!B306>0,Score!A306,\"\")","v":""},{"$f":"IF(Score!B306>0,IF(COUNTIF($E$3:E307,E307)>7,\"\",MAX($B$3:B306)+1),\"\")","v":""},{"$f":"IF(Score!B306>0,Score!B306,\"\")","v":""},{"$f":"IF(Score!B306>0,VLOOKUP(C307,Entrants!$A$2:$E$5000,3,FALSE),\"\")","v":""},{"$f":"IF(Score!B306>0,VLOOKUP(C307,Entrants!$A$2:$E$5000,2,FALSE),\"\")","v":""},{"$f":"IF(Score!B306>0,VLOOKUP(C307,Entrants!$A$2:$E$5000,4,FALSE),\"\")","v":""},{"$f":"IF(Score!C306>0,Score!C306,\"\")","v":""}]
[{"$f":"IF(Score!B307>0,Score!A307,\"\")","v":""},{"$f":"IF(Score!B307>0,IF(COUNTIF($E$3:E308,E308)>7,\"\",MAX($B$3:B307)+1),\"\")","v":""},{"$f":"IF(Score!B307>0,Score!B307,\"\")","v":""},{"$f":"IF(Score!B307>0,VLOOKUP(C308,Entrants!$A$2:$E$5000,3,FALSE),\"\")","v":""},{"$f":"IF(Score!B307>0,VLOOKUP(C308,Entrants!$A$2:$E$5000,2,FALSE),\"\")","v":""},{"$f":"IF(Score!B307>0,VLOOKUP(C308,Entrants!$A$2:$E$5000,4,FALSE),\"\")","v":""},{"$f":"IF(Score!C307>0,Score!C307,\"\")","v":""}]
[{"$f":"IF(Score!B308>0,Score!A308,\"\")","v":""},{"$f":"IF(Score!B308>0,IF(COUNTIF($E$3:E309,E309)>7,\"\",MAX($B$3:B308)+1),\"\")","v":""},{"$f":"IF(Score!B308>0,Score!B308,\"\")","v":""},{"$f":"IF(Score!B308>0,VLOOKUP(C309,Entrants!$A$2:$E$5000,3,FALSE),\"\")","v":""},{"$f":"IF(Score!B308>0,VLOOKUP(C309,Entrants!$A$2:$E$5000,2,FALSE),\"\")","v":""},{"$f":"IF(Score!B308>0,VLOOKUP(C309,Entrants!$A$2:$E$5000,4,FALSE),\"\")","v":""},{"$f":"IF(Score!C308>0,Score!C308,\"\")","v":""}]
[{"$f":"IF(Score!B309>0,Score!A309,\"\")","v":""},{"$f":"IF(Score!B309>0,IF(COUNTIF($E$3:E310,E310)>7,\"\",MAX($B$3:B309)+1),\"\")","v":""},{"$f":"IF(Score!B309>0,Score!B309,\"\")","v":""},{"$f":"IF(Score!B309>0,VLOOKUP(C310,Entrants!$A$2:$E$5000,3,FALSE),\"\")","v":""},{"$f":"IF(Score!B309>0,VLOOKUP(C310,Entrants!$A$2:$E$5000,2,FALSE),\"\")","v":""},{"$f":"IF(Score!B309>0,VLOOKUP(C310,Entrants!$A$2:$E$5000,4,FALSE),\"\")","v":""},{"$f":"IF(Score!C309>0,Score!C309,\"\")","v":""}]
[{"$f":"IF(Score!B310>0,Score!A310,\"\")","v":""},{"$f":"IF(Score!B310>0,IF(COUNTIF($E$3:E311,E311)>7,\"\",MAX($B$3:B310)+1),\"\")","v":""},{"$f":"IF(Score!B310>0,Score!B310,\"\")","v":""},{"$f":"IF(Score!B310>0,VLOOKUP(C311,Entrants!$A$2:$E$5000,3,FALSE),\"\")","v":""},{"$f":"IF(Score!B310>0,VLOOKUP(C311,Entrants!$A$2:$E$5000,2,FALSE),\"\")","v":""},{"$f":"IF(Score!B310>0,VLOOKUP(C311,Entrants!$A$2:$E$5000,4,FALSE),\"\")","v":""},{"$f":"IF(Score!C310>0,Score!C310,\"\")","v":""}]
[{"$f":"IF(Score!B311>0,Score!A311,\"\")","v":""},{"$f":"IF(Score!B311>0,IF(COUNTIF($E$3:E312,E312)>7,\"\",MAX($B$3:B311)+1),\"\")","v":""},{"$f":"IF(Score!B311>0,Score!B311,\"\")","v":""},{"$f":"IF(Score!B311>0,VLOOKUP(C312,Entrants!$A$2:$E$5000,3,FALSE),\"\")","v":""},{"$f":"IF(Score!B311>0,VLOOKUP(C312,Entrants!$A$2:$E$5000,2,FALSE),\"\")","v":""},{"$f":"IF(Score!B311>0,VLOOKUP(C312,Entrants!$A$2:$E$5000,4,FALSE),\"\")","v":""},{"$f":"IF(Score!C311>0,Score!C311,\"\")","v":""}]
[{"$f":"IF(Score!B312>0,Score!A312,\"\")","v":""},{"$f":"IF(Score!B312>0,IF(COUNTIF($E$3:E313,E313)>7,\"\",MAX($B$3:B312)+1),\"\")","v":""},{"$f":"IF(Score!B312>0,Score!B312,\"\")","v":""},{"$f":"IF(Score!B312>0,VLOOKUP(C313,Entrants!$A$2:$E$5000,3,FALSE),\"\")","v":""},{"$f":"IF(Score!B312>0,VLOOKUP(C313,Entrants!$A$2:$E$5000,2,FALSE),\"\")","v":""},{"$f":"IF(Score!B312>0,VLOOKUP(C313,Entrants!$A$2:$E$5000,4,FALSE),\"\")","v":""},{"$f":"IF(Score!C312>0,Score!C312,\"\")","v":""}]
[{"$f":"IF(Score!B313>0,Score!A313,\"\")","v":""},{"$f":"IF(Score!B313>0,IF(COUNTIF($E$3:E314,E314)>7,\"\",MAX($B$3:B313)+1),\"\")","v":""},{"$f":"IF(Score!B313>0,Score!B313,\"\")","v":""},{"$f":"IF(Score!B313>0,VLOOKUP(C314,Entrants!$A$2:$E$5000,3,FALSE),\"\")","v":""},{"$f":"IF(Score!B313>0,VLOOKUP(C314,Entrants!$A$2:$E$5000,2,FALSE),\"\")","v":""},{"$f":"IF(Score!B313>0,VLOOKUP(C314,Entrants!$A$2:$E$5000,4,FALSE),\"\")","v":""},{"$f":"IF(Score!C313>0,Score!C313,\"\")","v":""}]
[{"$f":"IF(Score!B314>0,Score!A314,\"\")","v":""},{"$f":"IF(Score!B314>0,IF(COUNTIF($E$3:E315,E315)>7,\"\",MAX($B$3:B314)+1),\"\")","v":""},{"$f":"IF(Score!B314>0,Score!B314,\"\")","v":""},{"$f":"IF(Score!B314>0,VLOOKUP(C315,Entrants!$A$2:$E$5000,3,FALSE),\"\")","v":""},{"$f":"IF(Score!B314>0,VLOOKUP(C315,Entrants!$A$2:$E$5000,2,FALSE),\"\")","v":""},{"$f":"IF(Score!B314>0,VLOOKUP(C315,Entrants!$A$2:$E$5000,4,FALSE),\"\")","v":""},{"$f":"IF(Score!C314>0,Score!C314,\"\")","v":""}]
[{"$f":"IF(Score!B315>0,Score!A315,\"\")","v":""},{"$f":"IF(Score!B315>0,IF(COUNTIF($E$3:E316,E316)>7,\"\",MAX($B$3:B315)+1),\"\")","v":""},{"$f":"IF(Score!B315>0,Score!B315,\"\")","v":""},{"$f":"IF(Score!B315>0,VLOOKUP(C316,Entrants!$A$2:$E$5000,3,FALSE),\"\")","v":""},{"$f":"IF(Score!B315>0,VLOOKUP(C316,Entrants!$A$2:$E$5000,2,FALSE),\"\")","v":""},{"$f":"IF(Score!B315>0,VLOOKUP(C316,Entrants!$A$2:$E$5000,4,FALSE),\"\")","v":""},{"$f":"IF(Score!C315>0,Score!C315,\"\")","v":""}]
[{"$f":"IF(Score!B316>0,Score!A316,\"\")","v":""},{"$f":"IF(Score!B316>0,IF(COUNTIF($E$3:E317,E317)>7,\"\",MAX($B$3:B316)+1),\"\")","v":""},{"$f":"IF(Score!B316>0,Score!B316,\"\")","v":""},{"$f":"IF(Score!B316>0,VLOOKUP(C317,Entrants!$A$2:$E$5000,3,FALSE),\"\")","v":""},{"$f":"IF(Score!B316>0,VLOOKUP(C317,Entrants!$A$2:$E$5000,2,FALSE),\"\")","v":""},{"$f":"IF(Score!B316>0,VLOOKUP(C317,Entrants!$A$2:$E$5000,4,FALSE),\"\")","v":""},{"$f":"IF(Score!C316>0,Score!C316,\"\")","v":""}]
[{"$f":"IF(Score!B317>0,Score!A317,\"\")","v":""},{"$f":"IF(Score!B317>0,IF(COUNTIF($E$3:E318,E318)>7,\"\",MAX($B$3:B317)+1),\"\")","v":""},{"$f":"IF(Score!B317>0,Score!B317,\"\")","v":""},{"$f":"IF(Score!B317>0,VLOOKUP(C318,Entrants!$A$2:$E$5000,3,FALSE),\"\")","v":""},{"$f":"IF(Score!B317>0,VLOOKUP(C318,Entrants!$A$2:$E$5000,2,FALSE),\"\")","v":""},{"$f":"IF(Score!B317>0,VLOOKUP(C318,Entrants!$A$2:$E$5000,4,FALSE),\"\")","v":""},{"$f":"IF(Score!C317>0,Score!C317,\"\")","v":""}]
[{"$f":"IF(Score!B318>0,Score!A318,\"\")","v":""},{"$f":"IF(Score!B318>0,IF(COUNTIF($E$3:E319,E319)>7,\"\",MAX($B$3:B318)+1),\"\")","v":""},{"$f":"IF(Score!B318>0,Score!B318,\"\")","v":""},{"$f":"IF(Score!B318>0,VLOOKUP(C319,Entrants!$A$2:$E$5000,3,FALSE),\"\")","v":""},{"$f":"IF(Score!B318>0,VLOOKUP(C319,Entrants!$A$2:$E$5000,2,FALSE),\"\")","v":""},{"$f":"IF(Score!B318>0,VLOOKUP(C319,Entrants!$A$2:$E$5000,4,FALSE),\"\")","v":""},{"$f":"IF(Score!C318>0,Score!C318,\"\")","v":""}]
[{"$f":"IF(Score!B319>0,Score!A319,\"\")","v":""},{"$f":"IF(Score!B319>0,IF(COUNTIF($E$3:E320,E320)>7,\"\",MAX($B$3:B319)+1),\"\")","v":""},{"$f":"IF(Score!B319>0,Score!B319,\"\")","v":""},{"$f":"IF(Score!B319>0,VLOOKUP(C320,Entrants!$A$2:$E$5000,3,FALSE),\"\")","v":""},{"$f":"IF(Score!B319>0,VLOOKUP(C320,Entrants!$A$2:$E$5000,2,FALSE),\"\")","v":""},{"$f":"IF(Score!B319>0,VLOOKUP(C320,Entrants!$A$2:$E$5000,4,FALSE),\"\")","v":""},{"$f":"IF(Score!C319>0,Score!C319,\"\")","v":""}]
[{"$f":"IF(Score!B320>0,Score!A320,\"\")","v":""},{"$f":"IF(Score!B320>0,IF(COUNTIF($E$3:E321,E321)>7,\"\",MAX($B$3:B320)+1),\"\")","v":""},{"$f":"IF(Score!B320>0,Score!B320,\"\")","v":""},{"$f":"IF(Score!B320>0,VLOOKUP(C321,Entrants!$A$2:$E$5000,3,FALSE),\"\")","v":""},{"$f":"IF(Score!B320>0,VLOOKUP(C321,Entrants!$A$2:$E$5000,2,FALSE),\"\")","v":""},{"$f":"IF(Score!B320>0,VLOOKUP(C321,Entrants!$A$2:$E$5000,4,FALSE),\"\")","v":""},{"$f":"IF(Score!C320>0,Score!C320,\"\")","v":""}]
[{"$f":"IF(Score!B321>0,Score!A321,\"\")","v":""},{"$f":"IF(Score!B321>0,IF(COUNTIF($E$3:E322,E322)>7,\"\",MAX($B$3:B321)+1),\"\")","v":""},{"$f":"IF(Score!B321>0,Score!B321,\"\")","v":""},{"$f":"IF(Score!B321>0,VLOOKUP(C322,Entrants!$A$2:$E$5000,3,FALSE),\"\")","v":""},{"$f":"IF(Score!B321>0,VLOOKUP(C322,Entrants!$A$2:$E$5000,2,FALSE),\"\")","v":""},{"$f":"IF(Score!B321>0,VLOOKUP(C322,Entrants!$A$2:$E$5000,4,FALSE),\"\")","v":""},{"$f":"IF(Score!C321>0,Score!C321,\"\")","v":""}]
[{"$f":"IF(Score!B322>0,Score!A322,\"\")","v":""},{"$f":"IF(Score!B322>0,IF(COUNTIF($E$3:E323,E323)>7,\"\",MAX($B$3:B322)+1),\"\")","v":""},{"$f":"IF(Score!B322>0,Score!B322,\"\")","v":""},{"$f":"IF(Score!B322>0,VLOOKUP(C323,Entrants!$A$2:$E$5000,3,FALSE),\"\")","v":""},{"$f":"IF(Score!B322>0,VLOOKUP(C323,Entrants!$A$2:$E$5000,2,FALSE),\"\")","v":""},{"$f":"IF(Score!B322>0,VLOOKUP(C323,Entrants!$A$2:$E$5000,4,FALSE),\"\")","v":""},{"$f":"IF(Score!C322>0,Score!C322,\"\")","v":""}]
[{"$f":"IF(Score!B323>0,Score!A323,\"\")","v":""},{"$f":"IF(Score!B323>0,IF(COUNTIF($E$3:E324,E324)>7,\"\",MAX($B$3:B323)+1),\"\")","v":""},{"$f":"IF(Score!B323>0,Score!B323,\"\")","v":""},{"$f":"IF(Score!B323>0,VLOOKUP(C324,Entrants!$A$2:$E$5000,3,FALSE),\"\")","v":""},{"$f":"IF(Score!B323>0,VLOOKUP(C324,Entrants!$A$2:$E$5000,2,FALSE),\"\")","v":""},{"$f":"IF(Score!B323>0,VLOOKUP(C324,Entrants!$A$2:$E$5000,4,FALSE),\"\")","v":""},{"$f":"IF(Score!C323>0,Score!C323,\"\")","v":""}]
[{"$f":"IF(Score!B324>0,Score!A324,\"\")","v":""},{"$f":"IF(Score!B324>0,IF(COUNTIF($E$3:E325,E325)>7,\"\",MAX($B$3:B324)+1),\"\")","v":""},{"$f":"IF(Score!B324>0,Score!B324,\"\")","v":""},{"$f":"IF(Score!B324>0,VLOOKUP(C325,Entrants!$A$2:$E$5000,3,FALSE),\"\")","v":""},{"$f":"IF(Score!B324>0,VLOOKUP(C325,Entrants!$A$2:$E$5000,2,FALSE),\"\")","v":""},{"$f":"IF(Score!B324>0,VLOOKUP(C325,Entrants!$A$2:$E$5000,4,FALSE),\"\")","v":""},{"$f":"IF(Score!C324>0,Score!C324,\"\")","v":""}]
[{"$f":"IF(Score!B325>0,Score!A325,\"\")","v":""},{"$f":"IF(Score!B325>0,IF(COUNTIF($E$3:E326,E326)>7,\"\",MAX($B$3:B325)+1),\"\")","v":""},{"$f":"IF(Score!B325>0,Score!B325,\"\")","v":""},{"$f":"IF(Score!B325>0,VLOOKUP(C326,Entrants!$A$2:$E$5000,3,FALSE),\"\")","v":""},{"$f":"IF(Score!B325>0,VLOOKUP(C326,Entrants!$A$2:$E$5000,2,FALSE),\"\")","v":""},{"$f":"IF(Score!B325>0,VLOOKUP(C326,Entrants!$A$2:$E$5000,4,FALSE),\"\")","v":""},{"$f":"IF(Score!C325>0,Score!C325,\"\")","v":""}]
[{"$f":"IF(Score!B326>0,Score!A326,\"\")","v":""},{"$f":"IF(Score!B326>0,IF(COUNTIF($E$3:E327,E327)>7,\"\",MAX($B$3:B326)+1),\"\")","v":""},{"$f":"IF(Score!B326>0,Score!B326,\"\")","v":""},{"$f":"IF(Score!B326>0,VLOOKUP(C327,Entrants!$A$2:$E$5000,3,FALSE),\"\")","v":""},{"$f":"IF(Score!B326>0,VLOOKUP(C327,Entrants!$A$2:$E$5000,2,FALSE),\"\")","v":""},{"$f":"IF(Score!B326>0,VLOOKUP(C327,Entrants!$A$2:$E$5000,4,FALSE),\"\")","v":""},{"$f":"IF(Score!C326>0,Score!C326,\"\")","v":""}]
[{"$f":"IF(Score!B327>0,Score!A327,\"\")","v":""},{"$f":"IF(Score!B327>0,IF(COUNTIF($E$3:E328,E328)>7,\"\",MAX($B$3:B327)+1),\"\")","v":""},{"$f":"IF(Score!B327>0,Score!B327,\"\")","v":""},{"$f":"IF(Score!B327>0,VLOOKUP(C328,Entrants!$A$2:$E$5000,3,FALSE),\"\")","v":""},{"$f":"IF(Score!B327>0,VLOOKUP(C328,Entrants!$A$2:$E$5000,2,FALSE),\"\")","v":""},{"$f":"IF(Score!B327>0,VLOOKUP(C328,Entrants!$A$2:$E$5000,4,FALSE),\"\")","v":""},{"$f":"IF(Score!C327>0,Score!C327,\"\")","v":""}]
[{"$f":"IF(Score!B328>0,Score!A328,\"\")","v":""},{"$f":"IF(Score!B328>0,IF(COUNTIF($E$3:E329,E329)>7,\"\",MAX($B$3:B328)+1),\"\")","v":""},{"$f":"IF(Score!B328>0,Score!B328,\"\")","v":""},{"$f":"IF(Score!B328>0,VLOOKUP(C329,Entrants!$A$2:$E$5000,3,FALSE),\"\")","v":""},{"$f":"IF(Score!B328>0,VLOOKUP(C329,Entrants!$A$2:$E$5000,2,FALSE),\"\")","v":""},{"$f":"IF(Score!B328>0,VLOOKUP(C329,Entrants!$A$2:$E$5000,4,FALSE),\"\")","v":""},{"$f":"IF(Score!C328>0,Score!C328,\"\")","v":""}]
[{"$f":"IF(Score!B329>0,Score!A329,\"\")","v":""},{"$f":"IF(Score!B329>0,IF(COUNTIF($E$3:E330,E330)>7,\"\",MAX($B$3:B329)+1),\"\")","v":""},{"$f":"IF(Score!B329>0,Score!B329,\"\")","v":""},{"$f":"IF(Score!B329>0,VLOOKUP(C330,Entrants!$A$2:$E$5000,3,FALSE),\"\")","v":""},{"$f":"IF(Score!B329>0,VLOOKUP(C330,Entrants!$A$2:$E$5000,2,FALSE),\"\")","v":""},{"$f":"IF(Score!B329>0,VLOOKUP(C330,Entrants!$A$2:$E$5000,4,FALSE),\"\")","v":""},{"$f":"IF(Score!C329>0,Score!C329,\"\")","v":""}]
[{"$f":"IF(Score!B330>0,Score!A330,\"\")","v":""},{"$f":"IF(Score!B330>0,IF(COUNTIF($E$3:E331,E331)>7,\"\",MAX($B$3:B330)+1),\"\")","v":""},{"$f":"IF(Score!B330>0,Score!B330,\"\")","v":""},{"$f":"IF(Score!B330>0,VLOOKUP(C331,Entrants!$A$2:$E$5000,3,FALSE),\"\")","v":""},{"$f":"IF(Score!B330>0,VLOOKUP(C331,Entrants!$A$2:$E$5000,2,FALSE),\"\")","v":""},{"$f":"IF(Score!B330>0,VLOOKUP(C331,Entrants!$A$2:$E$5000,4,FALSE),\"\")","v":""},{"$f":"IF(Score!C330>0,Score!C330,\"\")","v":""}]
[{"$f":"IF(Score!B331>0,Score!A331,\"\")","v":""},{"$f":"IF(Score!B331>0,IF(COUNTIF($E$3:E332,E332)>7,\"\",MAX($B$3:B331)+1),\"\")","v":""},{"$f":"IF(Score!B331>0,Score!B331,\"\")","v":""},{"$f":"IF(Score!B331>0,VLOOKUP(C332,Entrants!$A$2:$E$5000,3,FALSE),\"\")","v":""},{"$f":"IF(Score!B331>0,VLOOKUP(C332,Entrants!$A$2:$E$5000,2,FALSE),\"\")","v":""},{"$f":"IF(Score!B331>0,VLOOKUP(C332,Entrants!$A$2:$E$5000,4,FALSE),\"\")","v":""},{"$f":"IF(Score!C331>0,Score!C331,\"\")","v":""}]
[{"$f":"IF(Score!B332>0,Score!A332,\"\")","v":""},{"$f":"IF(Score!B332>0,IF(COUNTIF($E$3:E333,E333)>7,\"\",MAX($B$3:B332)+1),\"\")","v":""},{"$f":"IF(Score!B332>0,Score!B332,\"\")","v":""},{"$f":"IF(Score!B332>0,VLOOKUP(C333,Entrants!$A$2:$E$5000,3,FALSE),\"\")","v":""},{"$f":"IF(Score!B332>0,VLOOKUP(C333,Entrants!$A$2:$E$5000,2,FALSE),\"\")","v":""},{"$f":"IF(Score!B332>0,VLOOKUP(C333,Entrants!$A$2:$E$5000,4,FALSE),\"\")","v":""},{"$f":"IF(Score!C332>0,Score!C332,\"\")","v":""}]
[{"$f":"IF(Score!B333>0,Score!A333,\"\")","v":""},{"$f":"IF(Score!B333>0,IF(COUNTIF($E$3:E334,E334)>7,\"\",MAX($B$3:B333)+1),\"\")","v":""},{"$f":"IF(Score!B333>0,Score!B333,\"\")","v":""},{"$f":"IF(Score!B333>0,VLOOKUP(C334,Entrants!$A$2:$E$5000,3,FALSE),\"\")","v":""},{"$f":"IF(Score!B333>0,VLOOKUP(C334,Entrants!$A$2:$E$5000,2,FALSE),\"\")","v":""},{"$f":"IF(Score!B333>0,VLOOKUP(C334,Entrants!$A$2:$E$5000,4,FALSE),\"\")","v":""},{"$f":"IF(Score!C333>0,Score!C333,\"\")","v":""}]
[{"$f":"IF(Score!B334>0,Score!A334,\"\")","v":""},{"$f":"IF(Score!B334>0,IF(COUNTIF($E$3:E335,E335)>7,\"\",MAX($B$3:B334)+1),\"\")","v":""},{"$f":"IF(Score!B334>0,Score!B334,\"\")","v":""},{"$f":"IF(Score!B334>0,VLOOKUP(C335,Entrants!$A$2:$E$5000,3,FALSE),\"\")","v":""},{"$f":"IF(Score!B334>0,VLOOKUP(C335,Entrants!$A$2:$E$5000,2,FALSE),\"\")","v":""},{"$f":"IF(Score!B334>0,VLOOKUP(C335,Entrants!$A$2:$E$5000,4,FALSE),\"\")","v":""},{"$f":"IF(Score!C334>0,Score!C334,\"\")","v":""}]
[{"$f":"IF(Score!B335>0,Score!A335,\"\")","v":""},{"$f":"IF(Score!B335>0,IF(COUNTIF($E$3:E336,E336)>7,\"\",MAX($B$3:B335)+1),\"\")","v":""},{"$f":"IF(Score!B335>0,Score!B335,\"\")","v":""},{"$f":"IF(Score!B335>0,VLOOKUP(C336,Entrants!$A$2:$E$5000,3,FALSE),\"\")","v":""},{"$f":"IF(Score!B335>0,VLOOKUP(C336,Entrants!$A$2:$E$5000,2,FALSE),\"\")","v":""},{"$f":"IF(Score!B335>0,VLOOKUP(C336,Entrants!$A$2:$E$5000,4,FALSE),\"\")","v":""},{"$f":"IF(Score!C335>0,Score!C335,\"\")","v":""}]
[{"$f":"IF(Score!B336>0,Score!A336,\"\")","v":""},{"$f":"IF(Score!B336>0,IF(COUNTIF($E$3:E337,E337)>7,\"\",MAX($B$3:B336)+1),\"\")","v":""},{"$f":"IF(Score!B336>0,Score!B336,\"\")","v":""},{"$f":"IF(Score!B336>0,VLOOKUP(C337,Entrants!$A$2:$E$5000,3,FALSE),\"\")","v":""},{"$f":"IF(Score!B336>0,VLOOKUP(C337,Entrants!$A$2:$E$5000,2,FALSE),\"\")","v":""},{"$f":"IF(Score!B336>0,VLOOKUP(C337,Entrants!$A$2:$E$5000,4,FALSE),\"\")","v":""},{"$f":"IF(Score!C336>0,Score!C336,\"\")","v":""}]
[{"$f":"IF(Score!B337>0,Score!A337,\"\")","v":""},{"$f":"IF(Score!B337>0,IF(COUNTIF($E$3:E338,E338)>7,\"\",MAX($B$3:B337)+1),\"\")","v":""},{"$f":"IF(Score!B337>0,Score!B337,\"\")","v":""},{"$f":"IF(Score!B337>0,VLOOKUP(C338,Entrants!$A$2:$E$5000,3,FALSE),\"\")","v":""},{"$f":"IF(Score!B337>0,VLOOKUP(C338,Entrants!$A$2:$E$5000,2,FALSE),\"\")","v":""},{"$f":"IF(Score!B337>0,VLOOKUP(C338,Entrants!$A$2:$E$5000,4,FALSE),\"\")","v":""},{"$f":"IF(Score!C337>0,Score!C337,\"\")","v":""}]
[{"$f":"IF(Score!B338>0,Score!A338,\"\")","v":""},{"$f":"IF(Score!B338>0,IF(COUNTIF($E$3:E339,E339)>7,\"\",MAX($B$3:B338)+1),\"\")","v":""},{"$f":"IF(Score!B338>0,Score!B338,\"\")","v":""},{"$f":"IF(Score!B338>0,VLOOKUP(C339,Entrants!$A$2:$E$5000,3,FALSE),\"\")","v":""},{"$f":"IF(Score!B338>0,VLOOKUP(C339,Entrants!$A$2:$E$5000,2,FALSE),\"\")","v":""},{"$f":"IF(Score!B338>0,VLOOKUP(C339,Entrants!$A$2:$E$5000,4,FALSE),\"\")","v":""},{"$f":"IF(Score!C338>0,Score!C338,\"\")","v":""}]
[{"$f":"IF(Score!B339>0,Score!A339,\"\")","v":""},{"$f":"IF(Score!B339>0,IF(COUNTIF($E$3:E340,E340)>7,\"\",MAX($B$3:B339)+1),\"\")","v":""},{"$f":"IF(Score!B339>0,Score!B339,\"\")","v":""},{"$f":"IF(Score!B339>0,VLOOKUP(C340,Entrants!$A$2:$E$5000,3,FALSE),\"\")","v":""},{"$f":"IF(Score!B339>0,VLOOKUP(C340,Entrants!$A$2:$E$5000,2,FALSE),\"\")","v":""},{"$f":"IF(Score!B339>0,VLOOKUP(C340,Entrants!$A$2:$E$5000,4,FALSE),\"\")","v":""},{"$f":"IF(Score!C339>0,Score!C339,\"\")","v":""}]
[{"$f":"IF(Score!B340>0,Score!A340,\"\")","v":""},{"$f":"IF(Score!B340>0,IF(COUNTIF($E$3:E341,E341)>7,\"\",MAX($B$3:B340)+1),\"\")","v":""},{"$f":"IF(Score!B340>0,Score!B340,\"\")","v":""},{"$f":"IF(Score!B340>0,VLOOKUP(C341,Entrants!$A$2:$E$5000,3,FALSE),\"\")","v":""},{"$f":"IF(Score!B340>0,VLOOKUP(C341,Entrants!$A$2:$E$5000,2,FALSE),\"\")","v":""},{"$f":"IF(Score!B340>0,VLOOKUP(C341,Entrants!$A$2:$E$5000,4,FALSE),\"\")","v":""},{"$f":"IF(Score!C340>0,Score!C340,\"\")","v":""}]
[{"$f":"IF(Score!B341>0,Score!A341,\"\")","v":""},{"$f":"IF(Score!B341>0,IF(COUNTIF($E$3:E342,E342)>7,\"\",MAX($B$3:B341)+1),\"\")","v":""},{"$f":"IF(Score!B341>0,Score!B341,\"\")","v":""},{"$f":"IF(Score!B341>0,VLOOKUP(C342,Entrants!$A$2:$E$5000,3,FALSE),\"\")","v":""},{"$f":"IF(Score!B341>0,VLOOKUP(C342,Entrants!$A$2:$E$5000,2,FALSE),\"\")","v":""},{"$f":"IF(Score!B341>0,VLOOKUP(C342,Entrants!$A$2:$E$5000,4,FALSE),\"\")","v":""},{"$f":"IF(Score!C341>0,Score!C341,\"\")","v":""}]
[{"$f":"IF(Score!B342>0,Score!A342,\"\")","v":""},{"$f":"IF(Score!B342>0,IF(COUNTIF($E$3:E343,E343)>7,\"\",MAX($B$3:B342)+1),\"\")","v":""},{"$f":"IF(Score!B342>0,Score!B342,\"\")","v":""},{"$f":"IF(Score!B342>0,VLOOKUP(C343,Entrants!$A$2:$E$5000,3,FALSE),\"\")","v":""},{"$f":"IF(Score!B342>0,VLOOKUP(C343,Entrants!$A$2:$E$5000,2,FALSE),\"\")","v":""},{"$f":"IF(Score!B342>0,VLOOKUP(C343,Entrants!$A$2:$E$5000,4,FALSE),\"\")","v":""},{"$f":"IF(Score!C342>0,Score!C342,\"\")","v":""}]
[{"$f":"IF(Score!B343>0,Score!A343,\"\")","v":""},{"$f":"IF(Score!B343>0,IF(COUNTIF($E$3:E344,E344)>7,\"\",MAX($B$3:B343)+1),\"\")","v":""},{"$f":"IF(Score!B343>0,Score!B343,\"\")","v":""},{"$f":"IF(Score!B343>0,VLOOKUP(C344,Entrants!$A$2:$E$5000,3,FALSE),\"\")","v":""},{"$f":"IF(Score!B343>0,VLOOKUP(C344,Entrants!$A$2:$E$5000,2,FALSE),\"\")","v":""},{"$f":"IF(Score!B343>0,VLOOKUP(C344,Entrants!$A$2:$E$5000,4,FALSE),\"\")","v":""},{"$f":"IF(Score!C343>0,Score!C343,\"\")","v":""}]
[{"$f":"IF(Score!B344>0,Score!A344,\"\")","v":""},{"$f":"IF(Score!B344>0,IF(COUNTIF($E$3:E345,E345)>7,\"\",MAX($B$3:B344)+1),\"\")","v":""},{"$f":"IF(Score!B344>0,Score!B344,\"\")","v":""},{"$f":"IF(Score!B344>0,VLOOKUP(C345,Entrants!$A$2:$E$5000,3,FALSE),\"\")","v":""},{"$f":"IF(Score!B344>0,VLOOKUP(C345,Entrants!$A$2:$E$5000,2,FALSE),\"\")","v":""},{"$f":"IF(Score!B344>0,VLOOKUP(C345,Entrants!$A$2:$E$5000,4,FALSE),\"\")","v":""},{"$f":"IF(Score!C344>0,Score!C344,\"\")","v":""}]
[{"$f":"IF(Score!B345>0,Score!A345,\"\")","v":""},{"$f":"IF(Score!B345>0,IF(COUNTIF($E$3:E346,E346)>7,\"\",MAX($B$3:B345)+1),\"\")","v":""},{"$f":"IF(Score!B345>0,Score!B345,\"\")","v":""},{"$f":"IF(Score!B345>0,VLOOKUP(C346,Entrants!$A$2:$E$5000,3,FALSE),\"\")","v":""},{"$f":"IF(Score!B345>0,VLOOKUP(C346,Entrants!$A$2:$E$5000,2,FALSE),\"\")","v":""},{"$f":"IF(Score!B345>0,VLOOKUP(C346,Entrants!$A$2:$E$5000,4,FALSE),\"\")","v":""},{"$f":"IF(Score!C345>0,Score!C345,\"\")","v":""}]
[{"$f":"IF(Score!B346>0,Score!A346,\"\")","v":""},{"$f":"IF(Score!B346>0,IF(COUNTIF($E$3:E347,E347)>7,\"\",MAX($B$3:B346)+1),\"\")","v":""},{"$f":"IF(Score!B346>0,Score!B346,\"\")","v":""},{"$f":"IF(Score!B346>0,VLOOKUP(C347,Entrants!$A$2:$E$5000,3,FALSE),\"\")","v":""},{"$f":"IF(Score!B346>0,VLOOKUP(C347,Entrants!$A$2:$E$5000,2,FALSE),\"\")","v":""},{"$f":"IF(Score!B346>0,VLOOKUP(C347,Entrants!$A$2:$E$5000,4,FALSE),\"\")","v":""},{"$f":"IF(Score!C346>0,Score!C346,\"\")","v":""}]
[{"$f":"IF(Score!B347>0,Score!A347,\"\")","v":""},{"$f":"IF(Score!B347>0,IF(COUNTIF($E$3:E348,E348)>7,\"\",MAX($B$3:B347)+1),\"\")","v":""},{"$f":"IF(Score!B347>0,Score!B347,\"\")","v":""},{"$f":"IF(Score!B347>0,VLOOKUP(C348,Entrants!$A$2:$E$5000,3,FALSE),\"\")","v":""},{"$f":"IF(Score!B347>0,VLOOKUP(C348,Entrants!$A$2:$E$5000,2,FALSE),\"\")","v":""},{"$f":"IF(Score!B347>0,VLOOKUP(C348,Entrants!$A$2:$E$5000,4,FALSE),\"\")","v":""},{"$f":"IF(Score!C347>0,Score!C347,\"\")","v":""}]
[{"$f":"IF(Score!B348>0,Score!A348,\"\")","v":""},{"$f":"IF(Score!B348>0,IF(COUNTIF($E$3:E349,E349)>7,\"\",MAX($B$3:B348)+1),\"\")","v":""},{"$f":"IF(Score!B348>0,Score!B348,\"\")","v":""},{"$f":"IF(Score!B348>0,VLOOKUP(C349,Entrants!$A$2:$E$5000,3,FALSE),\"\")","v":""},{"$f":"IF(Score!B348>0,VLOOKUP(C349,Entrants!$A$2:$E$5000,2,FALSE),\"\")","v":""},{"$f":"IF(Score!B348>0,VLOOKUP(C349,Entrants!$A$2:$E$5000,4,FALSE),\"\")","v":""},{"$f":"IF(Score!C348>0,Score!C348,\"\")","v":""}]
[{"$f":"IF(Score!B349>0,Score!A349,\"\")","v":""},{"$f":"IF(Score!B349>0,IF(COUNTIF($E$3:E350,E350)>7,\"\",MAX($B$3:B349)+1),\"\")","v":""},{"$f":"IF(Score!B349>0,Score!B349,\"\")","v":""},{"$f":"IF(Score!B349>0,VLOOKUP(C350,Entrants!$A$2:$E$5000,3,FALSE),\"\")","v":""},{"$f":"IF(Score!B349>0,VLOOKUP(C350,Entrants!$A$2:$E$5000,2,FALSE),\"\")","v":""},{"$f":"IF(Score!B349>0,VLOOKUP(C350,Entrants!$A$2:$E$5000,4,FALSE),\"\")","v":""},{"$f":"IF(Score!C349>0,Score!C349,\"\")","v":""}]
[{"$f":"IF(Score!B350>0,Score!A350,\"\")","v":""},{"$f":"IF(Score!B350>0,IF(COUNTIF($E$3:E351,E351)>7,\"\",MAX($B$3:B350)+1),\"\")","v":""},{"$f":"IF(Score!B350>0,Score!B350,\"\")","v":""},{"$f":"IF(Score!B350>0,VLOOKUP(C351,Entrants!$A$2:$E$5000,3,FALSE),\"\")","v":""},{"$f":"IF(Score!B350>0,VLOOKUP(C351,Entrants!$A$2:$E$5000,2,FALSE),\"\")","v":""},{"$f":"IF(Score!B350>0,VLOOKUP(C351,Entrants!$A$2:$E$5000,4,FALSE),\"\")","v":""},{"$f":"IF(Score!C350>0,Score!C350,\"\")","v":""}]
[{"$f":"IF(Score!B351>0,Score!A351,\"\")","v":""},{"$f":"IF(Score!B351>0,IF(COUNTIF($E$3:E352,E352)>7,\"\",MAX($B$3:B351)+1),\"\")","v":""},{"$f":"IF(Score!B351>0,Score!B351,\"\")","v":""},{"$f":"IF(Score!B351>0,VLOOKUP(C352,Entrants!$A$2:$E$5000,3,FALSE),\"\")","v":""},{"$f":"IF(Score!B351>0,VLOOKUP(C352,Entrants!$A$2:$E$5000,2,FALSE),\"\")","v":""},{"$f":"IF(Score!B351>0,VLOOKUP(C352,Entrants!$A$2:$E$5000,4,FALSE),\"\")","v":""},{"$f":"IF(Score!C351>0,Score!C351,\"\")","v":""}]
[{"$f":"IF(Score!B352>0,Score!A352,\"\")","v":""},{"$f":"IF(Score!B352>0,IF(COUNTIF($E$3:E353,E353)>7,\"\",MAX($B$3:B352)+1),\"\")","v":""},{"$f":"IF(Score!B352>0,Score!B352,\"\")","v":""},{"$f":"IF(Score!B352>0,VLOOKUP(C353,Entrants!$A$2:$E$5000,3,FALSE),\"\")","v":""},{"$f":"IF(Score!B352>0,VLOOKUP(C353,Entrants!$A$2:$E$5000,2,FALSE),\"\")","v":""},{"$f":"IF(Score!B352>0,VLOOKUP(C353,Entrants!$A$2:$E$5000,4,FALSE),\"\")","v":""},{"$f":"IF(Score!C352>0,Score!C352,\"\")","v":""}]
[{"$f":"IF(Score!B353>0,Score!A353,\"\")","v":""},{"$f":"IF(Score!B353>0,IF(COUNTIF($E$3:E354,E354)>7,\"\",MAX($B$3:B353)+1),\"\")","v":""},{"$f":"IF(Score!B353>0,Score!B353,\"\")","v":""},{"$f":"IF(Score!B353>0,VLOOKUP(C354,Entrants!$A$2:$E$5000,3,FALSE),\"\")","v":""},{"$f":"IF(Score!B353>0,VLOOKUP(C354,Entrants!$A$2:$E$5000,2,FALSE),\"\")","v":""},{"$f":"IF(Score!B353>0,VLOOKUP(C354,Entrants!$A$2:$E$5000,4,FALSE),\"\")","v":""},{"$f":"IF(Score!C353>0,Score!C353,\"\")","v":""}]
[{"$f":"IF(Score!B354>0,Score!A354,\"\")","v":""},{"$f":"IF(Score!B354>0,IF(COUNTIF($E$3:E355,E355)>7,\"\",MAX($B$3:B354)+1),\"\")","v":""},{"$f":"IF(Score!B354>0,Score!B354,\"\")","v":""},{"$f":"IF(Score!B354>0,VLOOKUP(C355,Entrants!$A$2:$E$5000,3,FALSE),\"\")","v":""},{"$f":"IF(Score!B354>0,VLOOKUP(C355,Entrants!$A$2:$E$5000,2,FALSE),\"\")","v":""},{"$f":"IF(Score!B354>0,VLOOKUP(C355,Entrants!$A$2:$E$5000,4,FALSE),\"\")","v":""},{"$f":"IF(Score!C354>0,Score!C354,\"\")","v":""}]
[{"$f":"IF(Score!B355>0,Score!A355,\"\")","v":""},{"$f":"IF(Score!B355>0,IF(COUNTIF($E$3:E356,E356)>7,\"\",MAX($B$3:B355)+1),\"\")","v":""},{"$f":"IF(Score!B355>0,Score!B355,\"\")","v":""},{"$f":"IF(Score!B355>0,VLOOKUP(C356,Entrants!$A$2:$E$5000,3,FALSE),\"\")","v":""},{"$f":"IF(Score!B355>0,VLOOKUP(C356,Entrants!$A$2:$E$5000,2,FALSE),\"\")","v":""},{"$f":"IF(Score!B355>0,VLOOKUP(C356,Entrants!$A$2:$E$5000,4,FALSE),\"\")","v":""},{"$f":"IF(Score!C355>0,Score!C355,\"\")","v":""}]
[{"$f":"IF(Score!B356>0,Score!A356,\"\")","v":""},{"$f":"IF(Score!B356>0,IF(COUNTIF($E$3:E357,E357)>7,\"\",MAX($B$3:B356)+1),\"\")","v":""},{"$f":"IF(Score!B356>0,Score!B356,\"\")","v":""},{"$f":"IF(Score!B356>0,VLOOKUP(C357,Entrants!$A$2:$E$5000,3,FALSE),\"\")","v":""},{"$f":"IF(Score!B356>0,VLOOKUP(C357,Entrants!$A$2:$E$5000,2,FALSE),\"\")","v":""},{"$f":"IF(Score!B356>0,VLOOKUP(C357,Entrants!$A$2:$E$5000,4,FALSE),\"\")","v":""},{"$f":"IF(Score!C356>0,Score!C356,\"\")","v":""}]
[{"$f":"IF(Score!B357>0,Score!A357,\"\")","v":""},{"$f":"IF(Score!B357>0,IF(COUNTIF($E$3:E358,E358)>7,\"\",MAX($B$3:B357)+1),\"\")","v":""},{"$f":"IF(Score!B357>0,Score!B357,\"\")","v":""},{"$f":"IF(Score!B357>0,VLOOKUP(C358,Entrants!$A$2:$E$5000,3,FALSE),\"\")","v":""},{"$f":"IF(Score!B357>0,VLOOKUP(C358,Entrants!$A$2:$E$5000,2,FALSE),\"\")","v":""},{"$f":"IF(Score!B357>0,VLOOKUP(C358,Entrants!$A$2:$E$5000,4,FALSE),\"\")","v":""},{"$f":"IF(Score!C357>0,Score!C357,\"\")","v":""}]
[{"$f":"IF(Score!B358>0,Score!A358,\"\")","v":""},{"$f":"IF(Score!B358>0,IF(COUNTIF($E$3:E359,E359)>7,\"\",MAX($B$3:B358)+1),\"\")","v":""},{"$f":"IF(Score!B358>0,Score!B358,\"\")","v":""},{"$f":"IF(Score!B358>0,VLOOKUP(C359,Entrants!$A$2:$E$5000,3,FALSE),\"\")","v":""},{"$f":"IF(Score!B358>0,VLOOKUP(C359,Entrants!$A$2:$E$5000,2,FALSE),\"\")","v":""},{"$f":"IF(Score!B358>0,VLOOKUP(C359,Entrants!$A$2:$E$5000,4,FALSE),\"\")","v":""},{"$f":"IF(Score!C358>0,Score!C358,\"\")","v":""}]
[{"$f":"IF(Score!B359>0,Score!A359,\"\")","v":""},{"$f":"IF(Score!B359>0,IF(COUNTIF($E$3:E360,E360)>7,\"\",MAX($B$3:B359)+1),\"\")","v":""},{"$f":"IF(Score!B359>0,Score!B359,\"\")","v":""},{"$f":"IF(Score!B359>0,VLOOKUP(C360,Entrants!$A$2:$E$5000,3,FALSE),\"\")","v":""},{"$f":"IF(Score!B359>0,VLOOKUP(C360,Entrants!$A$2:$E$5000,2,FALSE),\"\")","v":""},{"$f":"IF(Score!B359>0,VLOOKUP(C360,Entrants!$A$2:$E$5000,4,FALSE),\"\")","v":""},{"$f":"IF(Score!C359>0,Score!C359,\"\")","v":""}]
[{"$f":"IF(Score!B360>0,Score!A360,\"\")","v":""},{"$f":"IF(Score!B360>0,IF(COUNTIF($E$3:E361,E361)>7,\"\",MAX($B$3:B360)+1),\"\")","v":""},{"$f":"IF(Score!B360>0,Score!B360,\"\")","v":""},{"$f":"IF(Score!B360>0,VLOOKUP(C361,Entrants!$A$2:$E$5000,3,FALSE),\"\")","v":""},{"$f":"IF(Score!B360>0,VLOOKUP(C361,Entrants!$A$2:$E$5000,2,FALSE),\"\")","v":""},{"$f":"IF(Score!B360>0,VLOOKUP(C361,Entrants!$A$2:$E$5000,4,FALSE),\"\")","v":""},{"$f":"IF(Score!C360>0,Score!C360,\"\")","v":""}]
[{"$f":"IF(Score!B361>0,Score!A361,\"\")","v":""},{"$f":"IF(Score!B361>0,IF(COUNTIF($E$3:E362,E362)>7,\"\",MAX($B$3:B361)+1),\"\")","v":""},{"$f":"IF(Score!B361>0,Score!B361,\"\")","v":""},{"$f":"IF(Score!B361>0,VLOOKUP(C362,Entrants!$A$2:$E$5000,3,FALSE),\"\")","v":""},{"$f":"IF(Score!B361>0,VLOOKUP(C362,Entrants!$A$2:$E$5000,2,FALSE),\"\")","v":""},{"$f":"IF(Score!B361>0,VLOOKUP(C362,Entrants!$A$2:$E$5000,4,FALSE),\"\")","v":""},{"$f":"IF(Score!C361>0,Score!C361,\"\")","v":""}]
[{"$f":"IF(Score!B362>0,Score!A362,\"\")","v":""},{"$f":"IF(Score!B362>0,IF(COUNTIF($E$3:E363,E363)>7,\"\",MAX($B$3:B362)+1),\"\")","v":""},{"$f":"IF(Score!B362>0,Score!B362,\"\")","v":""},{"$f":"IF(Score!B362>0,VLOOKUP(C363,Entrants!$A$2:$E$5000,3,FALSE),\"\")","v":""},{"$f":"IF(Score!B362>0,VLOOKUP(C363,Entrants!$A$2:$E$5000,2,FALSE),\"\")","v":""},{"$f":"IF(Score!B362>0,VLOOKUP(C363,Entrants!$A$2:$E$5000,4,FALSE),\"\")","v":""},{"$f":"IF(Score!C362>0,Score!C362,\"\")","v":""}]
[{"$f":"IF(Score!B363>0,Score!A363,\"\")","v":""},{"$f":"IF(Score!B363>0,IF(COUNTIF($E$3:E364,E364)>7,\"\",MAX($B$3:B363)+1),\"\")","v":""},{"$f":"IF(Score!B363>0,Score!B363,\"\")","v":""},{"$f":"IF(Score!B363>0,VLOOKUP(C364,Entrants!$A$2:$E$5000,3,FALSE),\"\")","v":""},{"$f":"IF(Score!B363>0,VLOOKUP(C364,Entrants!$A$2:$E$5000,2,FALSE),\"\")","v":""},{"$f":"IF(Score!B363>0,VLOOKUP(C364,Entrants!$A$2:$E$5000,4,FALSE),\"\")","v":""},{"$f":"IF(Score!C363>0,Score!C363,\"\")","v":""}]
[{"$f":"IF(Score!B364>0,Score!A364,\"\")","v":""},{"$f":"IF(Score!B364>0,IF(COUNTIF($E$3:E365,E365)>7,\"\",MAX($B$3:B364)+1),\"\")","v":""},{"$f":"IF(Score!B364>0,Score!B364,\"\")","v":""},{"$f":"IF(Score!B364>0,VLOOKUP(C365,Entrants!$A$2:$E$5000,3,FALSE),\"\")","v":""},{"$f":"IF(Score!B364>0,VLOOKUP(C365,Entrants!$A$2:$E$5000,2,FALSE),\"\")","v":""},{"$f":"IF(Score!B364>0,VLOOKUP(C365,Entrants!$A$2:$E$5000,4,FALSE),\"\")","v":""},{"$f":"IF(Score!C364>0,Score!C364,\"\")","v":""}]
[{"$f":"IF(Score!B365>0,Score!A365,\"\")","v":""},{"$f":"IF(Score!B365>0,IF(COUNTIF($E$3:E366,E366)>7,\"\",MAX($B$3:B365)+1),\"\")","v":""},{"$f":"IF(Score!B365>0,Score!B365,\"\")","v":""},{"$f":"IF(Score!B365>0,VLOOKUP(C366,Entrants!$A$2:$E$5000,3,FALSE),\"\")","v":""},{"$f":"IF(Score!B365>0,VLOOKUP(C366,Entrants!$A$2:$E$5000,2,FALSE),\"\")","v":""},{"$f":"IF(Score!B365>0,VLOOKUP(C366,Entrants!$A$2:$E$5000,4,FALSE),\"\")","v":""},{"$f":"IF(Score!C365>0,Score!C365,\"\")","v":""}]
[{"$f":"IF(Score!B366>0,Score!A366,\"\")","v":""},{"$f":"IF(Score!B366>0,IF(COUNTIF($E$3:E367,E367)>7,\"\",MAX($B$3:B366)+1),\"\")","v":""},{"$f":"IF(Score!B366>0,Score!B366,\"\")","v":""},{"$f":"IF(Score!B366>0,VLOOKUP(C367,Entrants!$A$2:$E$5000,3,FALSE),\"\")","v":""},{"$f":"IF(Score!B366>0,VLOOKUP(C367,Entrants!$A$2:$E$5000,2,FALSE),\"\")","v":""},{"$f":"IF(Score!B366>0,VLOOKUP(C367,Entrants!$A$2:$E$5000,4,FALSE),\"\")","v":""},{"$f":"IF(Score!C366>0,Score!C366,\"\")","v":""}]
[{"$f":"IF(Score!B367>0,Score!A367,\"\")","v":""},{"$f":"IF(Score!B367>0,IF(COUNTIF($E$3:E368,E368)>7,\"\",MAX($B$3:B367)+1),\"\")","v":""},{"$f":"IF(Score!B367>0,Score!B367,\"\")","v":""},{"$f":"IF(Score!B367>0,VLOOKUP(C368,Entrants!$A$2:$E$5000,3,FALSE),\"\")","v":""},{"$f":"IF(Score!B367>0,VLOOKUP(C368,Entrants!$A$2:$E$5000,2,FALSE),\"\")","v":""},{"$f":"IF(Score!B367>0,VLOOKUP(C368,Entrants!$A$2:$E$5000,4,FALSE),\"\")","v":""},{"$f":"IF(Score!C367>0,Score!C367,\"\")","v":""}]
[{"$f":"IF(Score!B368>0,Score!A368,\"\")","v":""},{"$f":"IF(Score!B368>0,IF(COUNTIF($E$3:E369,E369)>7,\"\",MAX($B$3:B368)+1),\"\")","v":""},{"$f":"IF(Score!B368>0,Score!B368,\"\")","v":""},{"$f":"IF(Score!B368>0,VLOOKUP(C369,Entrants!$A$2:$E$5000,3,FALSE),\"\")","v":""},{"$f":"IF(Score!B368>0,VLOOKUP(C369,Entrants!$A$2:$E$5000,2,FALSE),\"\")","v":""},{"$f":"IF(Score!B368>0,VLOOKUP(C369,Entrants!$A$2:$E$5000,4,FALSE),\"\")","v":""},{"$f":"IF(Score!C368>0,Score!C368,\"\")","v":""}]
[{"$f":"IF(Score!B369>0,Score!A369,\"\")","v":""},{"$f":"IF(Score!B369>0,IF(COUNTIF($E$3:E370,E370)>7,\"\",MAX($B$3:B369)+1),\"\")","v":""},{"$f":"IF(Score!B369>0,Score!B369,\"\")","v":""},{"$f":"IF(Score!B369>0,VLOOKUP(C370,Entrants!$A$2:$E$5000,3,FALSE),\"\")","v":""},{"$f":"IF(Score!B369>0,VLOOKUP(C370,Entrants!$A$2:$E$5000,2,FALSE),\"\")","v":""},{"$f":"IF(Score!B369>0,VLOOKUP(C370,Entrants!$A$2:$E$5000,4,FALSE),\"\")","v":""},{"$f":"IF(Score!C369>0,Score!C369,\"\")","v":""}]
[{"$f":"IF(Score!B370>0,Score!A370,\"\")","v":""},{"$f":"IF(Score!B370>0,IF(COUNTIF($E$3:E371,E371)>7,\"\",MAX($B$3:B370)+1),\"\")","v":""},{"$f":"IF(Score!B370>0,Score!B370,\"\")","v":""},{"$f":"IF(Score!B370>0,VLOOKUP(C371,Entrants!$A$2:$E$5000,3,FALSE),\"\")","v":""},{"$f":"IF(Score!B370>0,VLOOKUP(C371,Entrants!$A$2:$E$5000,2,FALSE),\"\")","v":""},{"$f":"IF(Score!B370>0,VLOOKUP(C371,Entrants!$A$2:$E$5000,4,FALSE),\"\")","v":""},{"$f":"IF(Score!C370>0,Score!C370,\"\")","v":""}]
[{"$f":"IF(Score!B371>0,Score!A371,\"\")","v":""},{"$f":"IF(Score!B371>0,IF(COUNTIF($E$3:E372,E372)>7,\"\",MAX($B$3:B371)+1),\"\")","v":""},{"$f":"IF(Score!B371>0,Score!B371,\"\")","v":""},{"$f":"IF(Score!B371>0,VLOOKUP(C372,Entrants!$A$2:$E$5000,3,FALSE),\"\")","v":""},{"$f":"IF(Score!B371>0,VLOOKUP(C372,Entrants!$A$2:$E$5000,2,FALSE),\"\")","v":""},{"$f":"IF(Score!B371>0,VLOOKUP(C372,Entrants!$A$2:$E$5000,4,FALSE),\"\")","v":""},{"$f":"IF(Score!C371>0,Score!C371,\"\")","v":""}]
[{"$f":"IF(Score!B372>0,Score!A372,\"\")","v":""},{"$f":"IF(Score!B372>0,IF(COUNTIF($E$3:E373,E373)>7,\"\",MAX($B$3:B372)+1),\"\")","v":""},{"$f":"IF(Score!B372>0,Score!B372,\"\")","v":""},{"$f":"IF(Score!B372>0,VLOOKUP(C373,Entrants!$A$2:$E$5000,3,FALSE),\"\")","v":""},{"$f":"IF(Score!B372>0,VLOOKUP(C373,Entrants!$A$2:$E$5000,2,FALSE),\"\")","v":""},{"$f":"IF(Score!B372>0,VLOOKUP(C373,Entrants!$A$2:$E$5000,4,FALSE),\"\")","v":""},{"$f":"IF(Score!C372>0,Score!C372,\"\")","v":""}]
[{"$f":"IF(Score!B373>0,Score!A373,\"\")","v":""},{"$f":"IF(Score!B373>0,IF(COUNTIF($E$3:E374,E374)>7,\"\",MAX($B$3:B373)+1),\"\")","v":""},{"$f":"IF(Score!B373>0,Score!B373,\"\")","v":""},{"$f":"IF(Score!B373>0,VLOOKUP(C374,Entrants!$A$2:$E$5000,3,FALSE),\"\")","v":""},{"$f":"IF(Score!B373>0,VLOOKUP(C374,Entrants!$A$2:$E$5000,2,FALSE),\"\")","v":""},{"$f":"IF(Score!B373>0,VLOOKUP(C374,Entrants!$A$2:$E$5000,4,FALSE),\"\")","v":""},{"$f":"IF(Score!C373>0,Score!C373,\"\")","v":""}]
[{"$f":"IF(Score!B374>0,Score!A374,\"\")","v":""},{"$f":"IF(Score!B374>0,IF(COUNTIF($E$3:E375,E375)>7,\"\",MAX($B$3:B374)+1),\"\")","v":""},{"$f":"IF(Score!B374>0,Score!B374,\"\")","v":""},{"$f":"IF(Score!B374>0,VLOOKUP(C375,Entrants!$A$2:$E$5000,3,FALSE),\"\")","v":""},{"$f":"IF(Score!B374>0,VLOOKUP(C375,Entrants!$A$2:$E$5000,2,FALSE),\"\")","v":""},{"$f":"IF(Score!B374>0,VLOOKUP(C375,Entrants!$A$2:$E$5000,4,FALSE),\"\")","v":""},{"$f":"IF(Score!C374>0,Score!C374,\"\")","v":""}]
[{"$f":"IF(Score!B375>0,Score!A375,\"\")","v":""},{"$f":"IF(Score!B375>0,IF(COUNTIF($E$3:E376,E376)>7,\"\",MAX($B$3:B375)+1),\"\")","v":""},{"$f":"IF(Score!B375>0,Score!B375,\"\")","v":""},{"$f":"IF(Score!B375>0,VLOOKUP(C376,Entrants!$A$2:$E$5000,3,FALSE),\"\")","v":""},{"$f":"IF(Score!B375>0,VLOOKUP(C376,Entrants!$A$2:$E$5000,2,FALSE),\"\")","v":""},{"$f":"IF(Score!B375>0,VLOOKUP(C376,Entrants!$A$2:$E$5000,4,FALSE),\"\")","v":""},{"$f":"IF(Score!C375>0,Score!C375,\"\")","v":""}]
[{"$f":"IF(Score!B376>0,Score!A376,\"\")","v":""},{"$f":"IF(Score!B376>0,IF(COUNTIF($E$3:E377,E377)>7,\"\",MAX($B$3:B376)+1),\"\")","v":""},{"$f":"IF(Score!B376>0,Score!B376,\"\")","v":""},{"$f":"IF(Score!B376>0,VLOOKUP(C377,Entrants!$A$2:$E$5000,3,FALSE),\"\")","v":""},{"$f":"IF(Score!B376>0,VLOOKUP(C377,Entrants!$A$2:$E$5000,2,FALSE),\"\")","v":""},{"$f":"IF(Score!B376>0,VLOOKUP(C377,Entrants!$A$2:$E$5000,4,FALSE),\"\")","v":""},{"$f":"IF(Score!C376>0,Score!C376,\"\")","v":""}]
[{"$f":"IF(Score!B377>0,Score!A377,\"\")","v":""},{"$f":"IF(Score!B377>0,IF(COUNTIF($E$3:E378,E378)>7,\"\",MAX($B$3:B377)+1),\"\")","v":""},{"$f":"IF(Score!B377>0,Score!B377,\"\")","v":""},{"$f":"IF(Score!B377>0,VLOOKUP(C378,Entrants!$A$2:$E$5000,3,FALSE),\"\")","v":""},{"$f":"IF(Score!B377>0,VLOOKUP(C378,Entrants!$A$2:$E$5000,2,FALSE),\"\")","v":""},{"$f":"IF(Score!B377>0,VLOOKUP(C378,Entrants!$A$2:$E$5000,4,FALSE),\"\")","v":""},{"$f":"IF(Score!C377>0,Score!C377,\"\")","v":""}]
[{"$f":"IF(Score!B378>0,Score!A378,\"\")","v":""},{"$f":"IF(Score!B378>0,IF(COUNTIF($E$3:E379,E379)>7,\"\",MAX($B$3:B378)+1),\"\")","v":""},{"$f":"IF(Score!B378>0,Score!B378,\"\")","v":""},{"$f":"IF(Score!B378>0,VLOOKUP(C379,Entrants!$A$2:$E$5000,3,FALSE),\"\")","v":""},{"$f":"IF(Score!B378>0,VLOOKUP(C379,Entrants!$A$2:$E$5000,2,FALSE),\"\")","v":""},{"$f":"IF(Score!B378>0,VLOOKUP(C379,Entrants!$A$2:$E$5000,4,FALSE),\"\")","v":""},{"$f":"IF(Score!C378>0,Score!C378,\"\")","v":""}]
[{"$f":"IF(Score!B379>0,Score!A379,\"\")","v":""},{"$f":"IF(Score!B379>0,IF(COUNTIF($E$3:E380,E380)>7,\"\",MAX($B$3:B379)+1),\"\")","v":""},{"$f":"IF(Score!B379>0,Score!B379,\"\")","v":""},{"$f":"IF(Score!B379>0,VLOOKUP(C380,Entrants!$A$2:$E$5000,3,FALSE),\"\")","v":""},{"$f":"IF(Score!B379>0,VLOOKUP(C380,Entrants!$A$2:$E$5000,2,FALSE),\"\")","v":""},{"$f":"IF(Score!B379>0,VLOOKUP(C380,Entrants!$A$2:$E$5000,4,FALSE),\"\")","v":""},{"$f":"IF(Score!C379>0,Score!C379,\"\")","v":""}]
[{"$f":"IF(Score!B380>0,Score!A380,\"\")","v":""},{"$f":"IF(Score!B380>0,IF(COUNTIF($E$3:E381,E381)>7,\"\",MAX($B$3:B380)+1),\"\")","v":""},{"$f":"IF(Score!B380>0,Score!B380,\"\")","v":""},{"$f":"IF(Score!B380>0,VLOOKUP(C381,Entrants!$A$2:$E$5000,3,FALSE),\"\")","v":""},{"$f":"IF(Score!B380>0,VLOOKUP(C381,Entrants!$A$2:$E$5000,2,FALSE),\"\")","v":""},{"$f":"IF(Score!B380>0,VLOOKUP(C381,Entrants!$A$2:$E$5000,4,FALSE),\"\")","v":""},{"$f":"IF(Score!C380>0,Score!C380,\"\")","v":""}]
[{"$f":"IF(Score!B381>0,Score!A381,\"\")","v":""},{"$f":"IF(Score!B381>0,IF(COUNTIF($E$3:E382,E382)>7,\"\",MAX($B$3:B381)+1),\"\")","v":""},{"$f":"IF(Score!B381>0,Score!B381,\"\")","v":""},{"$f":"IF(Score!B381>0,VLOOKUP(C382,Entrants!$A$2:$E$5000,3,FALSE),\"\")","v":""},{"$f":"IF(Score!B381>0,VLOOKUP(C382,Entrants!$A$2:$E$5000,2,FALSE),\"\")","v":""},{"$f":"IF(Score!B381>0,VLOOKUP(C382,Entrants!$A$2:$E$5000,4,FALSE),\"\")","v":""},{"$f":"IF(Score!C381>0,Score!C381,\"\")","v":""}]
[{"$f":"IF(Score!B382>0,Score!A382,\"\")","v":""},{"$f":"IF(Score!B382>0,IF(COUNTIF($E$3:E383,E383)>7,\"\",MAX($B$3:B382)+1),\"\")","v":""},{"$f":"IF(Score!B382>0,Score!B382,\"\")","v":""},{"$f":"IF(Score!B382>0,VLOOKUP(C383,Entrants!$A$2:$E$5000,3,FALSE),\"\")","v":""},{"$f":"IF(Score!B382>0,VLOOKUP(C383,Entrants!$A$2:$E$5000,2,FALSE),\"\")","v":""},{"$f":"IF(Score!B382>0,VLOOKUP(C383,Entrants!$A$2:$E$5000,4,FALSE),\"\")","v":""},{"$f":"IF(Score!C382>0,Score!C382,\"\")","v":""}]
[{"$f":"IF(Score!B383>0,Score!A383,\"\")","v":""},{"$f":"IF(Score!B383>0,IF(COUNTIF($E$3:E384,E384)>7,\"\",MAX($B$3:B383)+1),\"\")","v":""},{"$f":"IF(Score!B383>0,Score!B383,\"\")","v":""},{"$f":"IF(Score!B383>0,VLOOKUP(C384,Entrants!$A$2:$E$5000,3,FALSE),\"\")","v":""},{"$f":"IF(Score!B383>0,VLOOKUP(C384,Entrants!$A$2:$E$5000,2,FALSE),\"\")","v":""},{"$f":"IF(Score!B383>0,VLOOKUP(C384,Entrants!$A$2:$E$5000,4,FALSE),\"\")","v":""},{"$f":"IF(Score!C383>0,Score!C383,\"\")","v":""}]
[{"$f":"IF(Score!B384>0,Score!A384,\"\")","v":""},{"$f":"IF(Score!B384>0,IF(COUNTIF($E$3:E385,E385)>7,\"\",MAX($B$3:B384)+1),\"\")","v":""},{"$f":"IF(Score!B384>0,Score!B384,\"\")","v":""},{"$f":"IF(Score!B384>0,VLOOKUP(C385,Entrants!$A$2:$E$5000,3,FALSE),\"\")","v":""},{"$f":"IF(Score!B384>0,VLOOKUP(C385,Entrants!$A$2:$E$5000,2,FALSE),\"\")","v":""},{"$f":"IF(Score!B384>0,VLOOKUP(C385,Entrants!$A$2:$E$5000,4,FALSE),\"\")","v":""},{"$f":"IF(Score!C384>0,Score!C384,\"\")","v":""}]
[{"$f":"IF(Score!B385>0,Score!A385,\"\")","v":""},{"$f":"IF(Score!B385>0,IF(COUNTIF($E$3:E386,E386)>7,\"\",MAX($B$3:B385)+1),\"\")","v":""},{"$f":"IF(Score!B385>0,Score!B385,\"\")","v":""},{"$f":"IF(Score!B385>0,VLOOKUP(C386,Entrants!$A$2:$E$5000,3,FALSE),\"\")","v":""},{"$f":"IF(Score!B385>0,VLOOKUP(C386,Entrants!$A$2:$E$5000,2,FALSE),\"\")","v":""},{"$f":"IF(Score!B385>0,VLOOKUP(C386,Entrants!$A$2:$E$5000,4,FALSE),\"\")","v":""},{"$f":"IF(Score!C385>0,Score!C385,\"\")","v":""}]
[{"$f":"IF(Score!B386>0,Score!A386,\"\")","v":""},{"$f":"IF(Score!B386>0,IF(COUNTIF($E$3:E387,E387)>7,\"\",MAX($B$3:B386)+1),\"\")","v":""},{"$f":"IF(Score!B386>0,Score!B386,\"\")","v":""},{"$f":"IF(Score!B386>0,VLOOKUP(C387,Entrants!$A$2:$E$5000,3,FALSE),\"\")","v":""},{"$f":"IF(Score!B386>0,VLOOKUP(C387,Entrants!$A$2:$E$5000,2,FALSE),\"\")","v":""},{"$f":"IF(Score!B386>0,VLOOKUP(C387,Entrants!$A$2:$E$5000,4,FALSE),\"\")","v":""},{"$f":"IF(Score!C386>0,Score!C386,\"\")","v":""}]
[{"$f":"IF(Score!B387>0,Score!A387,\"\")","v":""},{"$f":"IF(Score!B387>0,IF(COUNTIF($E$3:E388,E388)>7,\"\",MAX($B$3:B387)+1),\"\")","v":""},{"$f":"IF(Score!B387>0,Score!B387,\"\")","v":""},{"$f":"IF(Score!B387>0,VLOOKUP(C388,Entrants!$A$2:$E$5000,3,FALSE),\"\")","v":""},{"$f":"IF(Score!B387>0,VLOOKUP(C388,Entrants!$A$2:$E$5000,2,FALSE),\"\")","v":""},{"$f":"IF(Score!B387>0,VLOOKUP(C388,Entrants!$A$2:$E$5000,4,FALSE),\"\")","v":""},{"$f":"IF(Score!C387>0,Score!C387,\"\")","v":""}]
[{"$f":"IF(Score!B388>0,Score!A388,\"\")","v":""},{"$f":"IF(Score!B388>0,IF(COUNTIF($E$3:E389,E389)>7,\"\",MAX($B$3:B388)+1),\"\")","v":""},{"$f":"IF(Score!B388>0,Score!B388,\"\")","v":""},{"$f":"IF(Score!B388>0,VLOOKUP(C389,Entrants!$A$2:$E$5000,3,FALSE),\"\")","v":""},{"$f":"IF(Score!B388>0,VLOOKUP(C389,Entrants!$A$2:$E$5000,2,FALSE),\"\")","v":""},{"$f":"IF(Score!B388>0,VLOOKUP(C389,Entrants!$A$2:$E$5000,4,FALSE),\"\")","v":""},{"$f":"IF(Score!C388>0,Score!C388,\"\")","v":""}]
[{"$f":"IF(Score!B389>0,Score!A389,\"\")","v":""},{"$f":"IF(Score!B389>0,IF(COUNTIF($E$3:E390,E390)>7,\"\",MAX($B$3:B389)+1),\"\")","v":""},{"$f":"IF(Score!B389>0,Score!B389,\"\")","v":""},{"$f":"IF(Score!B389>0,VLOOKUP(C390,Entrants!$A$2:$E$5000,3,FALSE),\"\")","v":""},{"$f":"IF(Score!B389>0,VLOOKUP(C390,Entrants!$A$2:$E$5000,2,FALSE),\"\")","v":""},{"$f":"IF(Score!B389>0,VLOOKUP(C390,Entrants!$A$2:$E$5000,4,FALSE),\"\")","v":""},{"$f":"IF(Score!C389>0,Score!C389,\"\")","v":""}]
[{"$f":"IF(Score!B390>0,Score!A390,\"\")","v":""},{"$f":"IF(Score!B390>0,IF(COUNTIF($E$3:E391,E391)>7,\"\",MAX($B$3:B390)+1),\"\")","v":""},{"$f":"IF(Score!B390>0,Score!B390,\"\")","v":""},{"$f":"IF(Score!B390>0,VLOOKUP(C391,Entrants!$A$2:$E$5000,3,FALSE),\"\")","v":""},{"$f":"IF(Score!B390>0,VLOOKUP(C391,Entrants!$A$2:$E$5000,2,FALSE),\"\")","v":""},{"$f":"IF(Score!B390>0,VLOOKUP(C391,Entrants!$A$2:$E$5000,4,FALSE),\"\")","v":""},{"$f":"IF(Score!C390>0,Score!C390,\"\")","v":""}]
[{"$f":"IF(Score!B391>0,Score!A391,\"\")","v":""},{"$f":"IF(Score!B391>0,IF(COUNTIF($E$3:E392,E392)>7,\"\",MAX($B$3:B391)+1),\"\")","v":""},{"$f":"IF(Score!B391>0,Score!B391,\"\")","v":""},{"$f":"IF(Score!B391>0,VLOOKUP(C392,Entrants!$A$2:$E$5000,3,FALSE),\"\")","v":""},{"$f":"IF(Score!B391>0,VLOOKUP(C392,Entrants!$A$2:$E$5000,2,FALSE),\"\")","v":""},{"$f":"IF(Score!B391>0,VLOOKUP(C392,Entrants!$A$2:$E$5000,4,FALSE),\"\")","v":""},{"$f":"IF(Score!C391>0,Score!C391,\"\")","v":""}]
[{"$f":"IF(Score!B392>0,Score!A392,\"\")","v":""},{"$f":"IF(Score!B392>0,IF(COUNTIF($E$3:E393,E393)>7,\"\",MAX($B$3:B392)+1),\"\")","v":""},{"$f":"IF(Score!B392>0,Score!B392,\"\")","v":""},{"$f":"IF(Score!B392>0,VLOOKUP(C393,Entrants!$A$2:$E$5000,3,FALSE),\"\")","v":""},{"$f":"IF(Score!B392>0,VLOOKUP(C393,Entrants!$A$2:$E$5000,2,FALSE),\"\")","v":""},{"$f":"IF(Score!B392>0,VLOOKUP(C393,Entrants!$A$2:$E$5000,4,FALSE),\"\")","v":""},{"$f":"IF(Score!C392>0,Score!C392,\"\")","v":""}]
[{"$f":"IF(Score!B393>0,Score!A393,\"\")","v":""},{"$f":"IF(Score!B393>0,IF(COUNTIF($E$3:E394,E394)>7,\"\",MAX($B$3:B393)+1),\"\")","v":""},{"$f":"IF(Score!B393>0,Score!B393,\"\")","v":""},{"$f":"IF(Score!B393>0,VLOOKUP(C394,Entrants!$A$2:$E$5000,3,FALSE),\"\")","v":""},{"$f":"IF(Score!B393>0,VLOOKUP(C394,Entrants!$A$2:$E$5000,2,FALSE),\"\")","v":""},{"$f":"IF(Score!B393>0,VLOOKUP(C394,Entrants!$A$2:$E$5000,4,FALSE),\"\")","v":""},{"$f":"IF(Score!C393>0,Score!C393,\"\")","v":""}]
[{"$f":"IF(Score!B394>0,Score!A394,\"\")","v":""},{"$f":"IF(Score!B394>0,IF(COUNTIF($E$3:E395,E395)>7,\"\",MAX($B$3:B394)+1),\"\")","v":""},{"$f":"IF(Score!B394>0,Score!B394,\"\")","v":""},{"$f":"IF(Score!B394>0,VLOOKUP(C395,Entrants!$A$2:$E$5000,3,FALSE),\"\")","v":""},{"$f":"IF(Score!B394>0,VLOOKUP(C395,Entrants!$A$2:$E$5000,2,FALSE),\"\")","v":""},{"$f":"IF(Score!B394>0,VLOOKUP(C395,Entrants!$A$2:$E$5000,4,FALSE),\"\")","v":""},{"$f":"IF(Score!C394>0,Score!C394,\"\")","v":""}]
[{"$f":"IF(Score!B395>0,Score!A395,\"\")","v":""},{"$f":"IF(Score!B395>0,IF(COUNTIF($E$3:E396,E396)>7,\"\",MAX($B$3:B395)+1),\"\")","v":""},{"$f":"IF(Score!B395>0,Score!B395,\"\")","v":""},{"$f":"IF(Score!B395>0,VLOOKUP(C396,Entrants!$A$2:$E$5000,3,FALSE),\"\")","v":""},{"$f":"IF(Score!B395>0,VLOOKUP(C396,Entrants!$A$2:$E$5000,2,FALSE),\"\")","v":""},{"$f":"IF(Score!B395>0,VLOOKUP(C396,Entrants!$A$2:$E$5000,4,FALSE),\"\")","v":""},{"$f":"IF(Score!C395>0,Score!C395,\"\")","v":""}]
[{"$f":"IF(Score!B396>0,Score!A396,\"\")","v":""},{"$f":"IF(Score!B396>0,IF(COUNTIF($E$3:E397,E397)>7,\"\",MAX($B$3:B396)+1),\"\")","v":""},{"$f":"IF(Score!B396>0,Score!B396,\"\")","v":""},{"$f":"IF(Score!B396>0,VLOOKUP(C397,Entrants!$A$2:$E$5000,3,FALSE),\"\")","v":""},{"$f":"IF(Score!B396>0,VLOOKUP(C397,Entrants!$A$2:$E$5000,2,FALSE),\"\")","v":""},{"$f":"IF(Score!B396>0,VLOOKUP(C397,Entrants!$A$2:$E$5000,4,FALSE),\"\")","v":""},{"$f":"IF(Score!C396>0,Score!C396,\"\")","v":""}]
[{"$f":"IF(Score!B397>0,Score!A397,\"\")","v":""},{"$f":"IF(Score!B397>0,IF(COUNTIF($E$3:E398,E398)>7,\"\",MAX($B$3:B397)+1),\"\")","v":""},{"$f":"IF(Score!B397>0,Score!B397,\"\")","v":""},{"$f":"IF(Score!B397>0,VLOOKUP(C398,Entrants!$A$2:$E$5000,3,FALSE),\"\")","v":""},{"$f":"IF(Score!B397>0,VLOOKUP(C398,Entrants!$A$2:$E$5000,2,FALSE),\"\")","v":""},{"$f":"IF(Score!B397>0,VLOOKUP(C398,Entrants!$A$2:$E$5000,4,FALSE),\"\")","v":""},{"$f":"IF(Score!C397>0,Score!C397,\"\")","v":""}]
[{"$f":"IF(Score!B398>0,Score!A398,\"\")","v":""},{"$f":"IF(Score!B398>0,IF(COUNTIF($E$3:E399,E399)>7,\"\",MAX($B$3:B398)+1),\"\")","v":""},{"$f":"IF(Score!B398>0,Score!B398,\"\")","v":""},{"$f":"IF(Score!B398>0,VLOOKUP(C399,Entrants!$A$2:$E$5000,3,FALSE),\"\")","v":""},{"$f":"IF(Score!B398>0,VLOOKUP(C399,Entrants!$A$2:$E$5000,2,FALSE),\"\")","v":""},{"$f":"IF(Score!B398>0,VLOOKUP(C399,Entrants!$A$2:$E$5000,4,FALSE),\"\")","v":""},{"$f":"IF(Score!C398>0,Score!C398,\"\")","v":""}]
[{"$f":"IF(Score!B399>0,Score!A399,\"\")","v":""},{"$f":"IF(Score!B399>0,IF(COUNTIF($E$3:E400,E400)>7,\"\",MAX($B$3:B399)+1),\"\")","v":""},{"$f":"IF(Score!B399>0,Score!B399,\"\")","v":""},{"$f":"IF(Score!B399>0,VLOOKUP(C400,Entrants!$A$2:$E$5000,3,FALSE),\"\")","v":""},{"$f":"IF(Score!B399>0,VLOOKUP(C400,Entrants!$A$2:$E$5000,2,FALSE),\"\")","v":""},{"$f":"IF(Score!B399>0,VLOOKUP(C400,Entrants!$A$2:$E$5000,4,FALSE),\"\")","v":""},{"$f":"IF(Score!C399>0,Score!C399,\"\")","v":""}]
[{"$f":"IF(Score!B400>0,Score!A400,\"\")","v":""},{"$f":"IF(Score!B400>0,IF(COUNTIF($E$3:E401,E401)>7,\"\",MAX($B$3:B400)+1),\"\")","v":""},{"$f":"IF(Score!B400>0,Score!B400,\"\")","v":""},{"$f":"IF(Score!B400>0,VLOOKUP(C401,Entrants!$A$2:$E$5000,3,FALSE),\"\")","v":""},{"$f":"IF(Score!B400>0,VLOOKUP(C401,Entrants!$A$2:$E$5000,2,FALSE),\"\")","v":""},{"$f":"IF(Score!B400>0,VLOOKUP(C401,Entrants!$A$2:$E$5000,4,FALSE),\"\")","v":""},{"$f":"IF(Score!C400>0,Score!C400,\"\")","v":""}]
[{"$f":"IF(Score!B401>0,Score!A401,\"\")","v":""},{"$f":"IF(Score!B401>0,IF(COUNTIF($E$3:E402,E402)>7,\"\",MAX($B$3:B401)+1),\"\")","v":""},{"$f":"IF(Score!B401>0,Score!B401,\"\")","v":""},{"$f":"IF(Score!B401>0,VLOOKUP(C402,Entrants!$A$2:$E$5000,3,FALSE),\"\")","v":""},{"$f":"IF(Score!B401>0,VLOOKUP(C402,Entrants!$A$2:$E$5000,2,FALSE),\"\")","v":""},{"$f":"IF(Score!B401>0,VLOOKUP(C402,Entrants!$A$2:$E$5000,4,FALSE),\"\")","v":""},{"$f":"IF(Score!C401>0,Score!C401,\"\")","v":""}]
[{"$f":"IF(Score!B402>0,Score!A402,\"\")","v":""},{"$f":"IF(Score!B402>0,IF(COUNTIF($E$3:E403,E403)>7,\"\",MAX($B$3:B402)+1),\"\")","v":""},{"$f":"IF(Score!B402>0,Score!B402,\"\")","v":""},{"$f":"IF(Score!B402>0,VLOOKUP(C403,Entrants!$A$2:$E$5000,3,FALSE),\"\")","v":""},{"$f":"IF(Score!B402>0,VLOOKUP(C403,Entrants!$A$2:$E$5000,2,FALSE),\"\")","v":""},{"$f":"IF(Score!B402>0,VLOOKUP(C403,Entrants!$A$2:$E$5000,4,FALSE),\"\")","v":""},{"$f":"IF(Score!C402>0,Score!C402,\"\")","v":""}]
[{"$f":"IF(Score!B403>0,Score!A403,\"\")","v":""},{"$f":"IF(Score!B403>0,IF(COUNTIF($E$3:E404,E404)>7,\"\",MAX($B$3:B403)+1),\"\")","v":""},{"$f":"IF(Score!B403>0,Score!B403,\"\")","v":""},{"$f":"IF(Score!B403>0,VLOOKUP(C404,Entrants!$A$2:$E$5000,3,FALSE),\"\")","v":""},{"$f":"IF(Score!B403>0,VLOOKUP(C404,Entrants!$A$2:$E$5000,2,FALSE),\"\")","v":""},{"$f":"IF(Score!B403>0,VLOOKUP(C404,Entrants!$A$2:$E$5000,4,FALSE),\"\")","v":""},{"$f":"IF(Score!C403>0,Score!C403,\"\")","v":""}]
[{"$f":"IF(Score!B404>0,Score!A404,\"\")","v":""},{"$f":"IF(Score!B404>0,IF(COUNTIF($E$3:E405,E405)>7,\"\",MAX($B$3:B404)+1),\"\")","v":""},{"$f":"IF(Score!B404>0,Score!B404,\"\")","v":""},{"$f":"IF(Score!B404>0,VLOOKUP(C405,Entrants!$A$2:$E$5000,3,FALSE),\"\")","v":""},{"$f":"IF(Score!B404>0,VLOOKUP(C405,Entrants!$A$2:$E$5000,2,FALSE),\"\")","v":""},{"$f":"IF(Score!B404>0,VLOOKUP(C405,Entrants!$A$2:$E$5000,4,FALSE),\"\")","v":""},{"$f":"IF(Score!C404>0,Score!C404,\"\")","v":""}]
[{"$f":"IF(Score!B405>0,Score!A405,\"\")","v":""},{"$f":"IF(Score!B405>0,IF(COUNTIF($E$3:E406,E406)>7,\"\",MAX($B$3:B405)+1),\"\")","v":""},{"$f":"IF(Score!B405>0,Score!B405,\"\")","v":""},{"$f":"IF(Score!B405>0,VLOOKUP(C406,Entrants!$A$2:$E$5000,3,FALSE),\"\")","v":""},{"$f":"IF(Score!B405>0,VLOOKUP(C406,Entrants!$A$2:$E$5000,2,FALSE),\"\")","v":""},{"$f":"IF(Score!B405>0,VLOOKUP(C406,Entrants!$A$2:$E$5000,4,FALSE),\"\")","v":""},{"$f":"IF(Score!C405>0,Score!C405,\"\")","v":""}]
[{"$f":"IF(Score!B406>0,Score!A406,\"\")","v":""},{"$f":"IF(Score!B406>0,IF(COUNTIF($E$3:E407,E407)>7,\"\",MAX($B$3:B406)+1),\"\")","v":""},{"$f":"IF(Score!B406>0,Score!B406,\"\")","v":""},{"$f":"IF(Score!B406>0,VLOOKUP(C407,Entrants!$A$2:$E$5000,3,FALSE),\"\")","v":""},{"$f":"IF(Score!B406>0,VLOOKUP(C407,Entrants!$A$2:$E$5000,2,FALSE),\"\")","v":""},{"$f":"IF(Score!B406>0,VLOOKUP(C407,Entrants!$A$2:$E$5000,4,FALSE),\"\")","v":""},{"$f":"IF(Score!C406>0,Score!C406,\"\")","v":""}]
[{"$f":"IF(Score!B407>0,Score!A407,\"\")","v":""},{"$f":"IF(Score!B407>0,IF(COUNTIF($E$3:E408,E408)>7,\"\",MAX($B$3:B407)+1),\"\")","v":""},{"$f":"IF(Score!B407>0,Score!B407,\"\")","v":""},{"$f":"IF(Score!B407>0,VLOOKUP(C408,Entrants!$A$2:$E$5000,3,FALSE),\"\")","v":""},{"$f":"IF(Score!B407>0,VLOOKUP(C408,Entrants!$A$2:$E$5000,2,FALSE),\"\")","v":""},{"$f":"IF(Score!B407>0,VLOOKUP(C408,Entrants!$A$2:$E$5000,4,FALSE),\"\")","v":""},{"$f":"IF(Score!C407>0,Score!C407,\"\")","v":""}]
[{"$f":"IF(Score!B408>0,Score!A408,\"\")","v":""},{"$f":"IF(Score!B408>0,IF(COUNTIF($E$3:E409,E409)>7,\"\",MAX($B$3:B408)+1),\"\")","v":""},{"$f":"IF(Score!B408>0,Score!B408,\"\")","v":""},{"$f":"IF(Score!B408>0,VLOOKUP(C409,Entrants!$A$2:$E$5000,3,FALSE),\"\")","v":""},{"$f":"IF(Score!B408>0,VLOOKUP(C409,Entrants!$A$2:$E$5000,2,FALSE),\"\")","v":""},{"$f":"IF(Score!B408>0,VLOOKUP(C409,Entrants!$A$2:$E$5000,4,FALSE),\"\")","v":""},{"$f":"IF(Score!C408>0,Score!C408,\"\")","v":""}]
[{"$f":"IF(Score!B409>0,Score!A409,\"\")","v":""},{"$f":"IF(Score!B409>0,IF(COUNTIF($E$3:E410,E410)>7,\"\",MAX($B$3:B409)+1),\"\")","v":""},{"$f":"IF(Score!B409>0,Score!B409,\"\")","v":""},{"$f":"IF(Score!B409>0,VLOOKUP(C410,Entrants!$A$2:$E$5000,3,FALSE),\"\")","v":""},{"$f":"IF(Score!B409>0,VLOOKUP(C410,Entrants!$A$2:$E$5000,2,FALSE),\"\")","v":""},{"$f":"IF(Score!B409>0,VLOOKUP(C410,Entrants!$A$2:$E$5000,4,FALSE),\"\")","v":""},{"$f":"IF(Score!C409>0,Score!C409,\"\")","v":""}]
[{"$f":"IF(Score!B410>0,Score!A410,\"\")","v":""},{"$f":"IF(Score!B410>0,IF(COUNTIF($E$3:E411,E411)>7,\"\",MAX($B$3:B410)+1),\"\")","v":""},{"$f":"IF(Score!B410>0,Score!B410,\"\")","v":""},{"$f":"IF(Score!B410>0,VLOOKUP(C411,Entrants!$A$2:$E$5000,3,FALSE),\"\")","v":""},{"$f":"IF(Score!B410>0,VLOOKUP(C411,Entrants!$A$2:$E$5000,2,FALSE),\"\")","v":""},{"$f":"IF(Score!B410>0,VLOOKUP(C411,Entrants!$A$2:$E$5000,4,FALSE),\"\")","v":""},{"$f":"IF(Score!C410>0,Score!C410,\"\")","v":""}]
[{"$f":"IF(Score!B411>0,Score!A411,\"\")","v":""},{"$f":"IF(Score!B411>0,IF(COUNTIF($E$3:E412,E412)>7,\"\",MAX($B$3:B411)+1),\"\")","v":""},{"$f":"IF(Score!B411>0,Score!B411,\"\")","v":""},{"$f":"IF(Score!B411>0,VLOOKUP(C412,Entrants!$A$2:$E$5000,3,FALSE),\"\")","v":""},{"$f":"IF(Score!B411>0,VLOOKUP(C412,Entrants!$A$2:$E$5000,2,FALSE),\"\")","v":""},{"$f":"IF(Score!B411>0,VLOOKUP(C412,Entrants!$A$2:$E$5000,4,FALSE),\"\")","v":""},{"$f":"IF(Score!C411>0,Score!C411,\"\")","v":""}]
[{"$f":"IF(Score!B412>0,Score!A412,\"\")","v":""},{"$f":"IF(Score!B412>0,IF(COUNTIF($E$3:E413,E413)>7,\"\",MAX($B$3:B412)+1),\"\")","v":""},{"$f":"IF(Score!B412>0,Score!B412,\"\")","v":""},{"$f":"IF(Score!B412>0,VLOOKUP(C413,Entrants!$A$2:$E$5000,3,FALSE),\"\")","v":""},{"$f":"IF(Score!B412>0,VLOOKUP(C413,Entrants!$A$2:$E$5000,2,FALSE),\"\")","v":""},{"$f":"IF(Score!B412>0,VLOOKUP(C413,Entrants!$A$2:$E$5000,4,FALSE),\"\")","v":""},{"$f":"IF(Score!C412>0,Score!C412,\"\")","v":""}]
[{"$f":"IF(Score!B413>0,Score!A413,\"\")","v":""},{"$f":"IF(Score!B413>0,IF(COUNTIF($E$3:E414,E414)>7,\"\",MAX($B$3:B413)+1),\"\")","v":""},{"$f":"IF(Score!B413>0,Score!B413,\"\")","v":""},{"$f":"IF(Score!B413>0,VLOOKUP(C414,Entrants!$A$2:$E$5000,3,FALSE),\"\")","v":""},{"$f":"IF(Score!B413>0,VLOOKUP(C414,Entrants!$A$2:$E$5000,2,FALSE),\"\")","v":""},{"$f":"IF(Score!B413>0,VLOOKUP(C414,Entrants!$A$2:$E$5000,4,FALSE),\"\")","v":""},{"$f":"IF(Score!C413>0,Score!C413,\"\")","v":""}]
[{"$f":"IF(Score!B414>0,Score!A414,\"\")","v":""},{"$f":"IF(Score!B414>0,IF(COUNTIF($E$3:E415,E415)>7,\"\",MAX($B$3:B414)+1),\"\")","v":""},{"$f":"IF(Score!B414>0,Score!B414,\"\")","v":""},{"$f":"IF(Score!B414>0,VLOOKUP(C415,Entrants!$A$2:$E$5000,3,FALSE),\"\")","v":""},{"$f":"IF(Score!B414>0,VLOOKUP(C415,Entrants!$A$2:$E$5000,2,FALSE),\"\")","v":""},{"$f":"IF(Score!B414>0,VLOOKUP(C415,Entrants!$A$2:$E$5000,4,FALSE),\"\")","v":""},{"$f":"IF(Score!C414>0,Score!C414,\"\")","v":""}]
[{"$f":"IF(Score!B415>0,Score!A415,\"\")","v":""},{"$f":"IF(Score!B415>0,IF(COUNTIF($E$3:E416,E416)>7,\"\",MAX($B$3:B415)+1),\"\")","v":""},{"$f":"IF(Score!B415>0,Score!B415,\"\")","v":""},{"$f":"IF(Score!B415>0,VLOOKUP(C416,Entrants!$A$2:$E$5000,3,FALSE),\"\")","v":""},{"$f":"IF(Score!B415>0,VLOOKUP(C416,Entrants!$A$2:$E$5000,2,FALSE),\"\")","v":""},{"$f":"IF(Score!B415>0,VLOOKUP(C416,Entrants!$A$2:$E$5000,4,FALSE),\"\")","v":""},{"$f":"IF(Score!C415>0,Score!C415,\"\")","v":""}]
[{"$f":"IF(Score!B416>0,Score!A416,\"\")","v":""},{"$f":"IF(Score!B416>0,IF(COUNTIF($E$3:E417,E417)>7,\"\",MAX($B$3:B416)+1),\"\")","v":""},{"$f":"IF(Score!B416>0,Score!B416,\"\")","v":""},{"$f":"IF(Score!B416>0,VLOOKUP(C417,Entrants!$A$2:$E$5000,3,FALSE),\"\")","v":""},{"$f":"IF(Score!B416>0,VLOOKUP(C417,Entrants!$A$2:$E$5000,2,FALSE),\"\")","v":""},{"$f":"IF(Score!B416>0,VLOOKUP(C417,Entrants!$A$2:$E$5000,4,FALSE),\"\")","v":""},{"$f":"IF(Score!C416>0,Score!C416,\"\")","v":""}]
[{"$f":"IF(Score!B417>0,Score!A417,\"\")","v":""},{"$f":"IF(Score!B417>0,IF(COUNTIF($E$3:E418,E418)>7,\"\",MAX($B$3:B417)+1),\"\")","v":""},{"$f":"IF(Score!B417>0,Score!B417,\"\")","v":""},{"$f":"IF(Score!B417>0,VLOOKUP(C418,Entrants!$A$2:$E$5000,3,FALSE),\"\")","v":""},{"$f":"IF(Score!B417>0,VLOOKUP(C418,Entrants!$A$2:$E$5000,2,FALSE),\"\")","v":""},{"$f":"IF(Score!B417>0,VLOOKUP(C418,Entrants!$A$2:$E$5000,4,FALSE),\"\")","v":""},{"$f":"IF(Score!C417>0,Score!C417,\"\")","v":""}]
[{"$f":"IF(Score!B418>0,Score!A418,\"\")","v":""},{"$f":"IF(Score!B418>0,IF(COUNTIF($E$3:E419,E419)>7,\"\",MAX($B$3:B418)+1),\"\")","v":""},{"$f":"IF(Score!B418>0,Score!B418,\"\")","v":""},{"$f":"IF(Score!B418>0,VLOOKUP(C419,Entrants!$A$2:$E$5000,3,FALSE),\"\")","v":""},{"$f":"IF(Score!B418>0,VLOOKUP(C419,Entrants!$A$2:$E$5000,2,FALSE),\"\")","v":""},{"$f":"IF(Score!B418>0,VLOOKUP(C419,Entrants!$A$2:$E$5000,4,FALSE),\"\")","v":""},{"$f":"IF(Score!C418>0,Score!C418,\"\")","v":""}]
[{"$f":"IF(Score!B419>0,Score!A419,\"\")","v":""},{"$f":"IF(Score!B419>0,IF(COUNTIF($E$3:E420,E420)>7,\"\",MAX($B$3:B419)+1),\"\")","v":""},{"$f":"IF(Score!B419>0,Score!B419,\"\")","v":""},{"$f":"IF(Score!B419>0,VLOOKUP(C420,Entrants!$A$2:$E$5000,3,FALSE),\"\")","v":""},{"$f":"IF(Score!B419>0,VLOOKUP(C420,Entrants!$A$2:$E$5000,2,FALSE),\"\")","v":""},{"$f":"IF(Score!B419>0,VLOOKUP(C420,Entrants!$A$2:$E$5000,4,FALSE),\"\")","v":""},{"$f":"IF(Score!C419>0,Score!C419,\"\")","v":""}]
[{"$f":"IF(Score!B420>0,Score!A420,\"\")","v":""},{"$f":"IF(Score!B420>0,IF(COUNTIF($E$3:E421,E421)>7,\"\",MAX($B$3:B420)+1),\"\")","v":""},{"$f":"IF(Score!B420>0,Score!B420,\"\")","v":""},{"$f":"IF(Score!B420>0,VLOOKUP(C421,Entrants!$A$2:$E$5000,3,FALSE),\"\")","v":""},{"$f":"IF(Score!B420>0,VLOOKUP(C421,Entrants!$A$2:$E$5000,2,FALSE),\"\")","v":""},{"$f":"IF(Score!B420>0,VLOOKUP(C421,Entrants!$A$2:$E$5000,4,FALSE),\"\")","v":""},{"$f":"IF(Score!C420>0,Score!C420,\"\")","v":""}]
[{"$f":"IF(Score!B421>0,Score!A421,\"\")","v":""},{"$f":"IF(Score!B421>0,IF(COUNTIF($E$3:E422,E422)>7,\"\",MAX($B$3:B421)+1),\"\")","v":""},{"$f":"IF(Score!B421>0,Score!B421,\"\")","v":""},{"$f":"IF(Score!B421>0,VLOOKUP(C422,Entrants!$A$2:$E$5000,3,FALSE),\"\")","v":""},{"$f":"IF(Score!B421>0,VLOOKUP(C422,Entrants!$A$2:$E$5000,2,FALSE),\"\")","v":""},{"$f":"IF(Score!B421>0,VLOOKUP(C422,Entrants!$A$2:$E$5000,4,FALSE),\"\")","v":""},{"$f":"IF(Score!C421>0,Score!C421,\"\")","v":""}]
[{"$f":"IF(Score!B422>0,Score!A422,\"\")","v":""},{"$f":"IF(Score!B422>0,IF(COUNTIF($E$3:E423,E423)>7,\"\",MAX($B$3:B422)+1),\"\")","v":""},{"$f":"IF(Score!B422>0,Score!B422,\"\")","v":""},{"$f":"IF(Score!B422>0,VLOOKUP(C423,Entrants!$A$2:$E$5000,3,FALSE),\"\")","v":""},{"$f":"IF(Score!B422>0,VLOOKUP(C423,Entrants!$A$2:$E$5000,2,FALSE),\"\")","v":""},{"$f":"IF(Score!B422>0,VLOOKUP(C423,Entrants!$A$2:$E$5000,4,FALSE),\"\")","v":""},{"$f":"IF(Score!C422>0,Score!C422,\"\")","v":""}]
[{"$f":"IF(Score!B423>0,Score!A423,\"\")","v":""},{"$f":"IF(Score!B423>0,IF(COUNTIF($E$3:E424,E424)>7,\"\",MAX($B$3:B423)+1),\"\")","v":""},{"$f":"IF(Score!B423>0,Score!B423,\"\")","v":""},{"$f":"IF(Score!B423>0,VLOOKUP(C424,Entrants!$A$2:$E$5000,3,FALSE),\"\")","v":""},{"$f":"IF(Score!B423>0,VLOOKUP(C424,Entrants!$A$2:$E$5000,2,FALSE),\"\")","v":""},{"$f":"IF(Score!B423>0,VLOOKUP(C424,Entrants!$A$2:$E$5000,4,FALSE),\"\")","v":""},{"$f":"IF(Score!C423>0,Score!C423,\"\")","v":""}]
[{"$f":"IF(Score!B424>0,Score!A424,\"\")","v":""},{"$f":"IF(Score!B424>0,IF(COUNTIF($E$3:E425,E425)>7,\"\",MAX($B$3:B424)+1),\"\")","v":""},{"$f":"IF(Score!B424>0,Score!B424,\"\")","v":""},{"$f":"IF(Score!B424>0,VLOOKUP(C425,Entrants!$A$2:$E$5000,3,FALSE),\"\")","v":""},{"$f":"IF(Score!B424>0,VLOOKUP(C425,Entrants!$A$2:$E$5000,2,FALSE),\"\")","v":""},{"$f":"IF(Score!B424>0,VLOOKUP(C425,Entrants!$A$2:$E$5000,4,FALSE),\"\")","v":""},{"$f":"IF(Score!C424>0,Score!C424,\"\")","v":""}]
[{"$f":"IF(Score!B425>0,Score!A425,\"\")","v":""},{"$f":"IF(Score!B425>0,IF(COUNTIF($E$3:E426,E426)>7,\"\",MAX($B$3:B425)+1),\"\")","v":""},{"$f":"IF(Score!B425>0,Score!B425,\"\")","v":""},{"$f":"IF(Score!B425>0,VLOOKUP(C426,Entrants!$A$2:$E$5000,3,FALSE),\"\")","v":""},{"$f":"IF(Score!B425>0,VLOOKUP(C426,Entrants!$A$2:$E$5000,2,FALSE),\"\")","v":""},{"$f":"IF(Score!B425>0,VLOOKUP(C426,Entrants!$A$2:$E$5000,4,FALSE),\"\")","v":""},{"$f":"IF(Score!C425>0,Score!C425,\"\")","v":""}]
[{"$f":"IF(Score!B426>0,Score!A426,\"\")","v":""},{"$f":"IF(Score!B426>0,IF(COUNTIF($E$3:E427,E427)>7,\"\",MAX($B$3:B426)+1),\"\")","v":""},{"$f":"IF(Score!B426>0,Score!B426,\"\")","v":""},{"$f":"IF(Score!B426>0,VLOOKUP(C427,Entrants!$A$2:$E$5000,3,FALSE),\"\")","v":""},{"$f":"IF(Score!B426>0,VLOOKUP(C427,Entrants!$A$2:$E$5000,2,FALSE),\"\")","v":""},{"$f":"IF(Score!B426>0,VLOOKUP(C427,Entrants!$A$2:$E$5000,4,FALSE),\"\")","v":""},{"$f":"IF(Score!C426>0,Score!C426,\"\")","v":""}]
[{"$f":"IF(Score!B427>0,Score!A427,\"\")","v":""},{"$f":"IF(Score!B427>0,IF(COUNTIF($E$3:E428,E428)>7,\"\",MAX($B$3:B427)+1),\"\")","v":""},{"$f":"IF(Score!B427>0,Score!B427,\"\")","v":""},{"$f":"IF(Score!B427>0,VLOOKUP(C428,Entrants!$A$2:$E$5000,3,FALSE),\"\")","v":""},{"$f":"IF(Score!B427>0,VLOOKUP(C428,Entrants!$A$2:$E$5000,2,FALSE),\"\")","v":""},{"$f":"IF(Score!B427>0,VLOOKUP(C428,Entrants!$A$2:$E$5000,4,FALSE),\"\")","v":""},{"$f":"IF(Score!C427>0,Score!C427,\"\")","v":""}]
[{"$f":"IF(Score!B428>0,Score!A428,\"\")","v":""},{"$f":"IF(Score!B428>0,IF(COUNTIF($E$3:E429,E429)>7,\"\",MAX($B$3:B428)+1),\"\")","v":""},{"$f":"IF(Score!B428>0,Score!B428,\"\")","v":""},{"$f":"IF(Score!B428>0,VLOOKUP(C429,Entrants!$A$2:$E$5000,3,FALSE),\"\")","v":""},{"$f":"IF(Score!B428>0,VLOOKUP(C429,Entrants!$A$2:$E$5000,2,FALSE),\"\")","v":""},{"$f":"IF(Score!B428>0,VLOOKUP(C429,Entrants!$A$2:$E$5000,4,FALSE),\"\")","v":""},{"$f":"IF(Score!C428>0,Score!C428,\"\")","v":""}]
[{"$f":"IF(Score!B429>0,Score!A429,\"\")","v":""},{"$f":"IF(Score!B429>0,IF(COUNTIF($E$3:E430,E430)>7,\"\",MAX($B$3:B429)+1),\"\")","v":""},{"$f":"IF(Score!B429>0,Score!B429,\"\")","v":""},{"$f":"IF(Score!B429>0,VLOOKUP(C430,Entrants!$A$2:$E$5000,3,FALSE),\"\")","v":""},{"$f":"IF(Score!B429>0,VLOOKUP(C430,Entrants!$A$2:$E$5000,2,FALSE),\"\")","v":""},{"$f":"IF(Score!B429>0,VLOOKUP(C430,Entrants!$A$2:$E$5000,4,FALSE),\"\")","v":""},{"$f":"IF(Score!C429>0,Score!C429,\"\")","v":""}]
[{"$f":"IF(Score!B430>0,Score!A430,\"\")","v":""},{"$f":"IF(Score!B430>0,IF(COUNTIF($E$3:E431,E431)>7,\"\",MAX($B$3:B430)+1),\"\")","v":""},{"$f":"IF(Score!B430>0,Score!B430,\"\")","v":""},{"$f":"IF(Score!B430>0,VLOOKUP(C431,Entrants!$A$2:$E$5000,3,FALSE),\"\")","v":""},{"$f":"IF(Score!B430>0,VLOOKUP(C431,Entrants!$A$2:$E$5000,2,FALSE),\"\")","v":""},{"$f":"IF(Score!B430>0,VLOOKUP(C431,Entrants!$A$2:$E$5000,4,FALSE),\"\")","v":""},{"$f":"IF(Score!C430>0,Score!C430,\"\")","v":""}]
[{"$f":"IF(Score!B431>0,Score!A431,\"\")","v":""},{"$f":"IF(Score!B431>0,IF(COUNTIF($E$3:E432,E432)>7,\"\",MAX($B$3:B431)+1),\"\")","v":""},{"$f":"IF(Score!B431>0,Score!B431,\"\")","v":""},{"$f":"IF(Score!B431>0,VLOOKUP(C432,Entrants!$A$2:$E$5000,3,FALSE),\"\")","v":""},{"$f":"IF(Score!B431>0,VLOOKUP(C432,Entrants!$A$2:$E$5000,2,FALSE),\"\")","v":""},{"$f":"IF(Score!B431>0,VLOOKUP(C432,Entrants!$A$2:$E$5000,4,FALSE),\"\")","v":""},{"$f":"IF(Score!C431>0,Score!C431,\"\")","v":""}]
[{"$f":"IF(Score!B432>0,Score!A432,\"\")","v":""},{"$f":"IF(Score!B432>0,IF(COUNTIF($E$3:E433,E433)>7,\"\",MAX($B$3:B432)+1),\"\")","v":""},{"$f":"IF(Score!B432>0,Score!B432,\"\")","v":""},{"$f":"IF(Score!B432>0,VLOOKUP(C433,Entrants!$A$2:$E$5000,3,FALSE),\"\")","v":""},{"$f":"IF(Score!B432>0,VLOOKUP(C433,Entrants!$A$2:$E$5000,2,FALSE),\"\")","v":""},{"$f":"IF(Score!B432>0,VLOOKUP(C433,Entrants!$A$2:$E$5000,4,FALSE),\"\")","v":""},{"$f":"IF(Score!C432>0,Score!C432,\"\")","v":""}]
[{"$f":"IF(Score!B433>0,Score!A433,\"\")","v":""},{"$f":"IF(Score!B433>0,IF(COUNTIF($E$3:E434,E434)>7,\"\",MAX($B$3:B433)+1),\"\")","v":""},{"$f":"IF(Score!B433>0,Score!B433,\"\")","v":""},{"$f":"IF(Score!B433>0,VLOOKUP(C434,Entrants!$A$2:$E$5000,3,FALSE),\"\")","v":""},{"$f":"IF(Score!B433>0,VLOOKUP(C434,Entrants!$A$2:$E$5000,2,FALSE),\"\")","v":""},{"$f":"IF(Score!B433>0,VLOOKUP(C434,Entrants!$A$2:$E$5000,4,FALSE),\"\")","v":""},{"$f":"IF(Score!C433>0,Score!C433,\"\")","v":""}]
[{"$f":"IF(Score!B434>0,Score!A434,\"\")","v":""},{"$f":"IF(Score!B434>0,IF(COUNTIF($E$3:E435,E435)>7,\"\",MAX($B$3:B434)+1),\"\")","v":""},{"$f":"IF(Score!B434>0,Score!B434,\"\")","v":""},{"$f":"IF(Score!B434>0,VLOOKUP(C435,Entrants!$A$2:$E$5000,3,FALSE),\"\")","v":""},{"$f":"IF(Score!B434>0,VLOOKUP(C435,Entrants!$A$2:$E$5000,2,FALSE),\"\")","v":""},{"$f":"IF(Score!B434>0,VLOOKUP(C435,Entrants!$A$2:$E$5000,4,FALSE),\"\")","v":""},{"$f":"IF(Score!C434>0,Score!C434,\"\")","v":""}]
[{"$f":"IF(Score!B435>0,Score!A435,\"\")","v":""},{"$f":"IF(Score!B435>0,IF(COUNTIF($E$3:E436,E436)>7,\"\",MAX($B$3:B435)+1),\"\")","v":""},{"$f":"IF(Score!B435>0,Score!B435,\"\")","v":""},{"$f":"IF(Score!B435>0,VLOOKUP(C436,Entrants!$A$2:$E$5000,3,FALSE),\"\")","v":""},{"$f":"IF(Score!B435>0,VLOOKUP(C436,Entrants!$A$2:$E$5000,2,FALSE),\"\")","v":""},{"$f":"IF(Score!B435>0,VLOOKUP(C436,Entrants!$A$2:$E$5000,4,FALSE),\"\")","v":""},{"$f":"IF(Score!C435>0,Score!C435,\"\")","v":""}]
[{"$f":"IF(Score!B436>0,Score!A436,\"\")","v":""},{"$f":"IF(Score!B436>0,IF(COUNTIF($E$3:E437,E437)>7,\"\",MAX($B$3:B436)+1),\"\")","v":""},{"$f":"IF(Score!B436>0,Score!B436,\"\")","v":""},{"$f":"IF(Score!B436>0,VLOOKUP(C437,Entrants!$A$2:$E$5000,3,FALSE),\"\")","v":""},{"$f":"IF(Score!B436>0,VLOOKUP(C437,Entrants!$A$2:$E$5000,2,FALSE),\"\")","v":""},{"$f":"IF(Score!B436>0,VLOOKUP(C437,Entrants!$A$2:$E$5000,4,FALSE),\"\")","v":""},{"$f":"IF(Score!C436>0,Score!C436,\"\")","v":""}]
[{"$f":"IF(Score!B437>0,Score!A437,\"\")","v":""},{"$f":"IF(Score!B437>0,IF(COUNTIF($E$3:E438,E438)>7,\"\",MAX($B$3:B437)+1),\"\")","v":""},{"$f":"IF(Score!B437>0,Score!B437,\"\")","v":""},{"$f":"IF(Score!B437>0,VLOOKUP(C438,Entrants!$A$2:$E$5000,3,FALSE),\"\")","v":""},{"$f":"IF(Score!B437>0,VLOOKUP(C438,Entrants!$A$2:$E$5000,2,FALSE),\"\")","v":""},{"$f":"IF(Score!B437>0,VLOOKUP(C438,Entrants!$A$2:$E$5000,4,FALSE),\"\")","v":""},{"$f":"IF(Score!C437>0,Score!C437,\"\")","v":""}]
[{"$f":"IF(Score!B438>0,Score!A438,\"\")","v":""},{"$f":"IF(Score!B438>0,IF(COUNTIF($E$3:E439,E439)>7,\"\",MAX($B$3:B438)+1),\"\")","v":""},{"$f":"IF(Score!B438>0,Score!B438,\"\")","v":""},{"$f":"IF(Score!B438>0,VLOOKUP(C439,Entrants!$A$2:$E$5000,3,FALSE),\"\")","v":""},{"$f":"IF(Score!B438>0,VLOOKUP(C439,Entrants!$A$2:$E$5000,2,FALSE),\"\")","v":""},{"$f":"IF(Score!B438>0,VLOOKUP(C439,Entrants!$A$2:$E$5000,4,FALSE),\"\")","v":""},{"$f":"IF(Score!C438>0,Score!C438,\"\")","v":""}]
[{"$f":"IF(Score!B439>0,Score!A439,\"\")","v":""},{"$f":"IF(Score!B439>0,IF(COUNTIF($E$3:E440,E440)>7,\"\",MAX($B$3:B439)+1),\"\")","v":""},{"$f":"IF(Score!B439>0,Score!B439,\"\")","v":""},{"$f":"IF(Score!B439>0,VLOOKUP(C440,Entrants!$A$2:$E$5000,3,FALSE),\"\")","v":""},{"$f":"IF(Score!B439>0,VLOOKUP(C440,Entrants!$A$2:$E$5000,2,FALSE),\"\")","v":""},{"$f":"IF(Score!B439>0,VLOOKUP(C440,Entrants!$A$2:$E$5000,4,FALSE),\"\")","v":""},{"$f":"IF(Score!C439>0,Score!C439,\"\")","v":""}]
[{"$f":"IF(Score!B440>0,Score!A440,\"\")","v":""},{"$f":"IF(Score!B440>0,IF(COUNTIF($E$3:E441,E441)>7,\"\",MAX($B$3:B440)+1),\"\")","v":""},{"$f":"IF(Score!B440>0,Score!B440,\"\")","v":""},{"$f":"IF(Score!B440>0,VLOOKUP(C441,Entrants!$A$2:$E$5000,3,FALSE),\"\")","v":""},{"$f":"IF(Score!B440>0,VLOOKUP(C441,Entrants!$A$2:$E$5000,2,FALSE),\"\")","v":""},{"$f":"IF(Score!B440>0,VLOOKUP(C441,Entrants!$A$2:$E$5000,4,FALSE),\"\")","v":""},{"$f":"IF(Score!C440>0,Score!C440,\"\")","v":""}]
[{"$f":"IF(Score!B441>0,Score!A441,\"\")","v":""},{"$f":"IF(Score!B441>0,IF(COUNTIF($E$3:E442,E442)>7,\"\",MAX($B$3:B441)+1),\"\")","v":""},{"$f":"IF(Score!B441>0,Score!B441,\"\")","v":""},{"$f":"IF(Score!B441>0,VLOOKUP(C442,Entrants!$A$2:$E$5000,3,FALSE),\"\")","v":""},{"$f":"IF(Score!B441>0,VLOOKUP(C442,Entrants!$A$2:$E$5000,2,FALSE),\"\")","v":""},{"$f":"IF(Score!B441>0,VLOOKUP(C442,Entrants!$A$2:$E$5000,4,FALSE),\"\")","v":""},{"$f":"IF(Score!C441>0,Score!C441,\"\")","v":""}]
[{"$f":"IF(Score!B442>0,Score!A442,\"\")","v":""},{"$f":"IF(Score!B442>0,IF(COUNTIF($E$3:E443,E443)>7,\"\",MAX($B$3:B442)+1),\"\")","v":""},{"$f":"IF(Score!B442>0,Score!B442,\"\")","v":""},{"$f":"IF(Score!B442>0,VLOOKUP(C443,Entrants!$A$2:$E$5000,3,FALSE),\"\")","v":""},{"$f":"IF(Score!B442>0,VLOOKUP(C443,Entrants!$A$2:$E$5000,2,FALSE),\"\")","v":""},{"$f":"IF(Score!B442>0,VLOOKUP(C443,Entrants!$A$2:$E$5000,4,FALSE),\"\")","v":""},{"$f":"IF(Score!C442>0,Score!C442,\"\")","v":""}]
[{"$f":"IF(Score!B443>0,Score!A443,\"\")","v":""},{"$f":"IF(Score!B443>0,IF(COUNTIF($E$3:E444,E444)>7,\"\",MAX($B$3:B443)+1),\"\")","v":""},{"$f":"IF(Score!B443>0,Score!B443,\"\")","v":""},{"$f":"IF(Score!B443>0,VLOOKUP(C444,Entrants!$A$2:$E$5000,3,FALSE),\"\")","v":""},{"$f":"IF(Score!B443>0,VLOOKUP(C444,Entrants!$A$2:$E$5000,2,FALSE),\"\")","v":""},{"$f":"IF(Score!B443>0,VLOOKUP(C444,Entrants!$A$2:$E$5000,4,FALSE),\"\")","v":""},{"$f":"IF(Score!C443>0,Score!C443,\"\")","v":""}]
[{"$f":"IF(Score!B444>0,Score!A444,\"\")","v":""},{"$f":"IF(Score!B444>0,IF(COUNTIF($E$3:E445,E445)>7,\"\",MAX($B$3:B444)+1),\"\")","v":""},{"$f":"IF(Score!B444>0,Score!B444,\"\")","v":""},{"$f":"IF(Score!B444>0,VLOOKUP(C445,Entrants!$A$2:$E$5000,3,FALSE),\"\")","v":""},{"$f":"IF(Score!B444>0,VLOOKUP(C445,Entrants!$A$2:$E$5000,2,FALSE),\"\")","v":""},{"$f":"IF(Score!B444>0,VLOOKUP(C445,Entrants!$A$2:$E$5000,4,FALSE),\"\")","v":""},{"$f":"IF(Score!C444>0,Score!C444,\"\")","v":""}]
[{"$f":"IF(Score!B445>0,Score!A445,\"\")","v":""},{"$f":"IF(Score!B445>0,IF(COUNTIF($E$3:E446,E446)>7,\"\",MAX($B$3:B445)+1),\"\")","v":""},{"$f":"IF(Score!B445>0,Score!B445,\"\")","v":""},{"$f":"IF(Score!B445>0,VLOOKUP(C446,Entrants!$A$2:$E$5000,3,FALSE),\"\")","v":""},{"$f":"IF(Score!B445>0,VLOOKUP(C446,Entrants!$A$2:$E$5000,2,FALSE),\"\")","v":""},{"$f":"IF(Score!B445>0,VLOOKUP(C446,Entrants!$A$2:$E$5000,4,FALSE),\"\")","v":""},{"$f":"IF(Score!C445>0,Score!C445,\"\")","v":""}]
[{"$f":"IF(Score!B446>0,Score!A446,\"\")","v":""},{"$f":"IF(Score!B446>0,IF(COUNTIF($E$3:E447,E447)>7,\"\",MAX($B$3:B446)+1),\"\")","v":""},{"$f":"IF(Score!B446>0,Score!B446,\"\")","v":""},{"$f":"IF(Score!B446>0,VLOOKUP(C447,Entrants!$A$2:$E$5000,3,FALSE),\"\")","v":""},{"$f":"IF(Score!B446>0,VLOOKUP(C447,Entrants!$A$2:$E$5000,2,FALSE),\"\")","v":""},{"$f":"IF(Score!B446>0,VLOOKUP(C447,Entrants!$A$2:$E$5000,4,FALSE),\"\")","v":""},{"$f":"IF(Score!C446>0,Score!C446,\"\")","v":""}]
[{"$f":"IF(Score!B447>0,Score!A447,\"\")","v":""},{"$f":"IF(Score!B447>0,IF(COUNTIF($E$3:E448,E448)>7,\"\",MAX($B$3:B447)+1),\"\")","v":""},{"$f":"IF(Score!B447>0,Score!B447,\"\")","v":""},{"$f":"IF(Score!B447>0,VLOOKUP(C448,Entrants!$A$2:$E$5000,3,FALSE),\"\")","v":""},{"$f":"IF(Score!B447>0,VLOOKUP(C448,Entrants!$A$2:$E$5000,2,FALSE),\"\")","v":""},{"$f":"IF(Score!B447>0,VLOOKUP(C448,Entrants!$A$2:$E$5000,4,FALSE),\"\")","v":""},{"$f":"IF(Score!C447>0,Score!C447,\"\")","v":""}]
[{"$f":"IF(Score!B448>0,Score!A448,\"\")","v":""},{"$f":"IF(Score!B448>0,IF(COUNTIF($E$3:E449,E449)>7,\"\",MAX($B$3:B448)+1),\"\")","v":""},{"$f":"IF(Score!B448>0,Score!B448,\"\")","v":""},{"$f":"IF(Score!B448>0,VLOOKUP(C449,Entrants!$A$2:$E$5000,3,FALSE),\"\")","v":""},{"$f":"IF(Score!B448>0,VLOOKUP(C449,Entrants!$A$2:$E$5000,2,FALSE),\"\")","v":""},{"$f":"IF(Score!B448>0,VLOOKUP(C449,Entrants!$A$2:$E$5000,4,FALSE),\"\")","v":""},{"$f":"IF(Score!C448>0,Score!C448,\"\")","v":""}]
[{"$f":"IF(Score!B449>0,Score!A449,\"\")","v":""},{"$f":"IF(Score!B449>0,IF(COUNTIF($E$3:E450,E450)>7,\"\",MAX($B$3:B449)+1),\"\")","v":""},{"$f":"IF(Score!B449>0,Score!B449,\"\")","v":""},{"$f":"IF(Score!B449>0,VLOOKUP(C450,Entrants!$A$2:$E$5000,3,FALSE),\"\")","v":""},{"$f":"IF(Score!B449>0,VLOOKUP(C450,Entrants!$A$2:$E$5000,2,FALSE),\"\")","v":""},{"$f":"IF(Score!B449>0,VLOOKUP(C450,Entrants!$A$2:$E$5000,4,FALSE),\"\")","v":""},{"$f":"IF(Score!C449>0,Score!C449,\"\")","v":""}]
[{"$f":"IF(Score!B450>0,Score!A450,\"\")","v":""},{"$f":"IF(Score!B450>0,IF(COUNTIF($E$3:E451,E451)>7,\"\",MAX($B$3:B450)+1),\"\")","v":""},{"$f":"IF(Score!B450>0,Score!B450,\"\")","v":""},{"$f":"IF(Score!B450>0,VLOOKUP(C451,Entrants!$A$2:$E$5000,3,FALSE),\"\")","v":""},{"$f":"IF(Score!B450>0,VLOOKUP(C451,Entrants!$A$2:$E$5000,2,FALSE),\"\")","v":""},{"$f":"IF(Score!B450>0,VLOOKUP(C451,Entrants!$A$2:$E$5000,4,FALSE),\"\")","v":""},{"$f":"IF(Score!C450>0,Score!C450,\"\")","v":""}]
[{"$f":"IF(Score!B451>0,Score!A451,\"\")","v":""},{"$f":"IF(Score!B451>0,IF(COUNTIF($E$3:E452,E452)>7,\"\",MAX($B$3:B451)+1),\"\")","v":""},{"$f":"IF(Score!B451>0,Score!B451,\"\")","v":""},{"$f":"IF(Score!B451>0,VLOOKUP(C452,Entrants!$A$2:$E$5000,3,FALSE),\"\")","v":""},{"$f":"IF(Score!B451>0,VLOOKUP(C452,Entrants!$A$2:$E$5000,2,FALSE),\"\")","v":""},{"$f":"IF(Score!B451>0,VLOOKUP(C452,Entrants!$A$2:$E$5000,4,FALSE),\"\")","v":""},{"$f":"IF(Score!C451>0,Score!C451,\"\")","v":""}]
[{"$f":"IF(Score!B452>0,Score!A452,\"\")","v":""},{"$f":"IF(Score!B452>0,IF(COUNTIF($E$3:E453,E453)>7,\"\",MAX($B$3:B452)+1),\"\")","v":""},{"$f":"IF(Score!B452>0,Score!B452,\"\")","v":""},{"$f":"IF(Score!B452>0,VLOOKUP(C453,Entrants!$A$2:$E$5000,3,FALSE),\"\")","v":""},{"$f":"IF(Score!B452>0,VLOOKUP(C453,Entrants!$A$2:$E$5000,2,FALSE),\"\")","v":""},{"$f":"IF(Score!B452>0,VLOOKUP(C453,Entrants!$A$2:$E$5000,4,FALSE),\"\")","v":""},{"$f":"IF(Score!C452>0,Score!C452,\"\")","v":""}]
[{"$f":"IF(Score!B453>0,Score!A453,\"\")","v":""},{"$f":"IF(Score!B453>0,IF(COUNTIF($E$3:E454,E454)>7,\"\",MAX($B$3:B453)+1),\"\")","v":""},{"$f":"IF(Score!B453>0,Score!B453,\"\")","v":""},{"$f":"IF(Score!B453>0,VLOOKUP(C454,Entrants!$A$2:$E$5000,3,FALSE),\"\")","v":""},{"$f":"IF(Score!B453>0,VLOOKUP(C454,Entrants!$A$2:$E$5000,2,FALSE),\"\")","v":""},{"$f":"IF(Score!B453>0,VLOOKUP(C454,Entrants!$A$2:$E$5000,4,FALSE),\"\")","v":""},{"$f":"IF(Score!C453>0,Score!C453,\"\")","v":""}]
[{"$f":"IF(Score!B454>0,Score!A454,\"\")","v":""},{"$f":"IF(Score!B454>0,IF(COUNTIF($E$3:E455,E455)>7,\"\",MAX($B$3:B454)+1),\"\")","v":""},{"$f":"IF(Score!B454>0,Score!B454,\"\")","v":""},{"$f":"IF(Score!B454>0,VLOOKUP(C455,Entrants!$A$2:$E$5000,3,FALSE),\"\")","v":""},{"$f":"IF(Score!B454>0,VLOOKUP(C455,Entrants!$A$2:$E$5000,2,FALSE),\"\")","v":""},{"$f":"IF(Score!B454>0,VLOOKUP(C455,Entrants!$A$2:$E$5000,4,FALSE),\"\")","v":""},{"$f":"IF(Score!C454>0,Score!C454,\"\")","v":""}]
[{"$f":"IF(Score!B455>0,Score!A455,\"\")","v":""},{"$f":"IF(Score!B455>0,IF(COUNTIF($E$3:E456,E456)>7,\"\",MAX($B$3:B455)+1),\"\")","v":""},{"$f":"IF(Score!B455>0,Score!B455,\"\")","v":""},{"$f":"IF(Score!B455>0,VLOOKUP(C456,Entrants!$A$2:$E$5000,3,FALSE),\"\")","v":""},{"$f":"IF(Score!B455>0,VLOOKUP(C456,Entrants!$A$2:$E$5000,2,FALSE),\"\")","v":""},{"$f":"IF(Score!B455>0,VLOOKUP(C456,Entrants!$A$2:$E$5000,4,FALSE),\"\")","v":""},{"$f":"IF(Score!C455>0,Score!C455,\"\")","v":""}]
[{"$f":"IF(Score!B456>0,Score!A456,\"\")","v":""},{"$f":"IF(Score!B456>0,IF(COUNTIF($E$3:E457,E457)>7,\"\",MAX($B$3:B456)+1),\"\")","v":""},{"$f":"IF(Score!B456>0,Score!B456,\"\")","v":""},{"$f":"IF(Score!B456>0,VLOOKUP(C457,Entrants!$A$2:$E$5000,3,FALSE),\"\")","v":""},{"$f":"IF(Score!B456>0,VLOOKUP(C457,Entrants!$A$2:$E$5000,2,FALSE),\"\")","v":""},{"$f":"IF(Score!B456>0,VLOOKUP(C457,Entrants!$A$2:$E$5000,4,FALSE),\"\")","v":""},{"$f":"IF(Score!C456>0,Score!C456,\"\")","v":""}]
[{"$f":"IF(Score!B457>0,Score!A457,\"\")","v":""},{"$f":"IF(Score!B457>0,IF(COUNTIF($E$3:E458,E458)>7,\"\",MAX($B$3:B457)+1),\"\")","v":""},{"$f":"IF(Score!B457>0,Score!B457,\"\")","v":""},{"$f":"IF(Score!B457>0,VLOOKUP(C458,Entrants!$A$2:$E$5000,3,FALSE),\"\")","v":""},{"$f":"IF(Score!B457>0,VLOOKUP(C458,Entrants!$A$2:$E$5000,2,FALSE),\"\")","v":""},{"$f":"IF(Score!B457>0,VLOOKUP(C458,Entrants!$A$2:$E$5000,4,FALSE),\"\")","v":""},{"$f":"IF(Score!C457>0,Score!C457,\"\")","v":""}]
[{"$f":"IF(Score!B458>0,Score!A458,\"\")","v":""},{"$f":"IF(Score!B458>0,IF(COUNTIF($E$3:E459,E459)>7,\"\",MAX($B$3:B458)+1),\"\")","v":""},{"$f":"IF(Score!B458>0,Score!B458,\"\")","v":""},{"$f":"IF(Score!B458>0,VLOOKUP(C459,Entrants!$A$2:$E$5000,3,FALSE),\"\")","v":""},{"$f":"IF(Score!B458>0,VLOOKUP(C459,Entrants!$A$2:$E$5000,2,FALSE),\"\")","v":""},{"$f":"IF(Score!B458>0,VLOOKUP(C459,Entrants!$A$2:$E$5000,4,FALSE),\"\")","v":""},{"$f":"IF(Score!C458>0,Score!C458,\"\")","v":""}]
[{"$f":"IF(Score!B459>0,Score!A459,\"\")","v":""},{"$f":"IF(Score!B459>0,IF(COUNTIF($E$3:E460,E460)>7,\"\",MAX($B$3:B459)+1),\"\")","v":""},{"$f":"IF(Score!B459>0,Score!B459,\"\")","v":""},{"$f":"IF(Score!B459>0,VLOOKUP(C460,Entrants!$A$2:$E$5000,3,FALSE),\"\")","v":""},{"$f":"IF(Score!B459>0,VLOOKUP(C460,Entrants!$A$2:$E$5000,2,FALSE),\"\")","v":""},{"$f":"IF(Score!B459>0,VLOOKUP(C460,Entrants!$A$2:$E$5000,4,FALSE),\"\")","v":""},{"$f":"IF(Score!C459>0,Score!C459,\"\")","v":""}]
[{"$f":"IF(Score!B460>0,Score!A460,\"\")","v":""},{"$f":"IF(Score!B460>0,IF(COUNTIF($E$3:E461,E461)>7,\"\",MAX($B$3:B460)+1),\"\")","v":""},{"$f":"IF(Score!B460>0,Score!B460,\"\")","v":""},{"$f":"IF(Score!B460>0,VLOOKUP(C461,Entrants!$A$2:$E$5000,3,FALSE),\"\")","v":""},{"$f":"IF(Score!B460>0,VLOOKUP(C461,Entrants!$A$2:$E$5000,2,FALSE),\"\")","v":""},{"$f":"IF(Score!B460>0,VLOOKUP(C461,Entrants!$A$2:$E$5000,4,FALSE),\"\")","v":""},{"$f":"IF(Score!C460>0,Score!C460,\"\")","v":""}]
[{"$f":"IF(Score!B461>0,Score!A461,\"\")","v":""},{"$f":"IF(Score!B461>0,IF(COUNTIF($E$3:E462,E462)>7,\"\",MAX($B$3:B461)+1),\"\")","v":""},{"$f":"IF(Score!B461>0,Score!B461,\"\")","v":""},{"$f":"IF(Score!B461>0,VLOOKUP(C462,Entrants!$A$2:$E$5000,3,FALSE),\"\")","v":""},{"$f":"IF(Score!B461>0,VLOOKUP(C462,Entrants!$A$2:$E$5000,2,FALSE),\"\")","v":""},{"$f":"IF(Score!B461>0,VLOOKUP(C462,Entrants!$A$2:$E$5000,4,FALSE),\"\")","v":""},{"$f":"IF(Score!C461>0,Score!C461,\"\")","v":""}]
[{"$f":"IF(Score!B462>0,Score!A462,\"\")","v":""},{"$f":"IF(Score!B462>0,IF(COUNTIF($E$3:E463,E463)>7,\"\",MAX($B$3:B462)+1),\"\")","v":""},{"$f":"IF(Score!B462>0,Score!B462,\"\")","v":""},{"$f":"IF(Score!B462>0,VLOOKUP(C463,Entrants!$A$2:$E$5000,3,FALSE),\"\")","v":""},{"$f":"IF(Score!B462>0,VLOOKUP(C463,Entrants!$A$2:$E$5000,2,FALSE),\"\")","v":""},{"$f":"IF(Score!B462>0,VLOOKUP(C463,Entrants!$A$2:$E$5000,4,FALSE),\"\")","v":""},{"$f":"IF(Score!C462>0,Score!C462,\"\")","v":""}]
[{"$f":"IF(Score!B463>0,Score!A463,\"\")","v":""},{"$f":"IF(Score!B463>0,IF(COUNTIF($E$3:E464,E464)>7,\"\",MAX($B$3:B463)+1),\"\")","v":""},{"$f":"IF(Score!B463>0,Score!B463,\"\")","v":""},{"$f":"IF(Score!B463>0,VLOOKUP(C464,Entrants!$A$2:$E$5000,3,FALSE),\"\")","v":""},{"$f":"IF(Score!B463>0,VLOOKUP(C464,Entrants!$A$2:$E$5000,2,FALSE),\"\")","v":""},{"$f":"IF(Score!B463>0,VLOOKUP(C464,Entrants!$A$2:$E$5000,4,FALSE),\"\")","v":""},{"$f":"IF(Score!C463>0,Score!C463,\"\")","v":""}]
[{"$f":"IF(Score!B464>0,Score!A464,\"\")","v":""},{"$f":"IF(Score!B464>0,IF(COUNTIF($E$3:E465,E465)>7,\"\",MAX($B$3:B464)+1),\"\")","v":""},{"$f":"IF(Score!B464>0,Score!B464,\"\")","v":""},{"$f":"IF(Score!B464>0,VLOOKUP(C465,Entrants!$A$2:$E$5000,3,FALSE),\"\")","v":""},{"$f":"IF(Score!B464>0,VLOOKUP(C465,Entrants!$A$2:$E$5000,2,FALSE),\"\")","v":""},{"$f":"IF(Score!B464>0,VLOOKUP(C465,Entrants!$A$2:$E$5000,4,FALSE),\"\")","v":""},{"$f":"IF(Score!C464>0,Score!C464,\"\")","v":""}]
[{"$f":"IF(Score!B465>0,Score!A465,\"\")","v":""},{"$f":"IF(Score!B465>0,IF(COUNTIF($E$3:E466,E466)>7,\"\",MAX($B$3:B465)+1),\"\")","v":""},{"$f":"IF(Score!B465>0,Score!B465,\"\")","v":""},{"$f":"IF(Score!B465>0,VLOOKUP(C466,Entrants!$A$2:$E$5000,3,FALSE),\"\")","v":""},{"$f":"IF(Score!B465>0,VLOOKUP(C466,Entrants!$A$2:$E$5000,2,FALSE),\"\")","v":""},{"$f":"IF(Score!B465>0,VLOOKUP(C466,Entrants!$A$2:$E$5000,4,FALSE),\"\")","v":""},{"$f":"IF(Score!C465>0,Score!C465,\"\")","v":""}]
[{"$f":"IF(Score!B466>0,Score!A466,\"\")","v":""},{"$f":"IF(Score!B466>0,IF(COUNTIF($E$3:E467,E467)>7,\"\",MAX($B$3:B466)+1),\"\")","v":""},{"$f":"IF(Score!B466>0,Score!B466,\"\")","v":""},{"$f":"IF(Score!B466>0,VLOOKUP(C467,Entrants!$A$2:$E$5000,3,FALSE),\"\")","v":""},{"$f":"IF(Score!B466>0,VLOOKUP(C467,Entrants!$A$2:$E$5000,2,FALSE),\"\")","v":""},{"$f":"IF(Score!B466>0,VLOOKUP(C467,Entrants!$A$2:$E$5000,4,FALSE),\"\")","v":""},{"$f":"IF(Score!C466>0,Score!C466,\"\")","v":""}]
[{"$f":"IF(Score!B467>0,Score!A467,\"\")","v":""},{"$f":"IF(Score!B467>0,IF(COUNTIF($E$3:E468,E468)>7,\"\",MAX($B$3:B467)+1),\"\")","v":""},{"$f":"IF(Score!B467>0,Score!B467,\"\")","v":""},{"$f":"IF(Score!B467>0,VLOOKUP(C468,Entrants!$A$2:$E$5000,3,FALSE),\"\")","v":""},{"$f":"IF(Score!B467>0,VLOOKUP(C468,Entrants!$A$2:$E$5000,2,FALSE),\"\")","v":""},{"$f":"IF(Score!B467>0,VLOOKUP(C468,Entrants!$A$2:$E$5000,4,FALSE),\"\")","v":""},{"$f":"IF(Score!C467>0,Score!C467,\"\")","v":""}]
[{"$f":"IF(Score!B468>0,Score!A468,\"\")","v":""},{"$f":"IF(Score!B468>0,IF(COUNTIF($E$3:E469,E469)>7,\"\",MAX($B$3:B468)+1),\"\")","v":""},{"$f":"IF(Score!B468>0,Score!B468,\"\")","v":""},{"$f":"IF(Score!B468>0,VLOOKUP(C469,Entrants!$A$2:$E$5000,3,FALSE),\"\")","v":""},{"$f":"IF(Score!B468>0,VLOOKUP(C469,Entrants!$A$2:$E$5000,2,FALSE),\"\")","v":""},{"$f":"IF(Score!B468>0,VLOOKUP(C469,Entrants!$A$2:$E$5000,4,FALSE),\"\")","v":""},{"$f":"IF(Score!C468>0,Score!C468,\"\")","v":""}]
[{"$f":"IF(Score!B469>0,Score!A469,\"\")","v":""},{"$f":"IF(Score!B469>0,IF(COUNTIF($E$3:E470,E470)>7,\"\",MAX($B$3:B469)+1),\"\")","v":""},{"$f":"IF(Score!B469>0,Score!B469,\"\")","v":""},{"$f":"IF(Score!B469>0,VLOOKUP(C470,Entrants!$A$2:$E$5000,3,FALSE),\"\")","v":""},{"$f":"IF(Score!B469>0,VLOOKUP(C470,Entrants!$A$2:$E$5000,2,FALSE),\"\")","v":""},{"$f":"IF(Score!B469>0,VLOOKUP(C470,Entrants!$A$2:$E$5000,4,FALSE),\"\")","v":""},{"$f":"IF(Score!C469>0,Score!C469,\"\")","v":""}]
[{"$f":"IF(Score!B470>0,Score!A470,\"\")","v":""},{"$f":"IF(Score!B470>0,IF(COUNTIF($E$3:E471,E471)>7,\"\",MAX($B$3:B470)+1),\"\")","v":""},{"$f":"IF(Score!B470>0,Score!B470,\"\")","v":""},{"$f":"IF(Score!B470>0,VLOOKUP(C471,Entrants!$A$2:$E$5000,3,FALSE),\"\")","v":""},{"$f":"IF(Score!B470>0,VLOOKUP(C471,Entrants!$A$2:$E$5000,2,FALSE),\"\")","v":""},{"$f":"IF(Score!B470>0,VLOOKUP(C471,Entrants!$A$2:$E$5000,4,FALSE),\"\")","v":""},{"$f":"IF(Score!C470>0,Score!C470,\"\")","v":""}]
[{"$f":"IF(Score!B471>0,Score!A471,\"\")","v":""},{"$f":"IF(Score!B471>0,IF(COUNTIF($E$3:E472,E472)>7,\"\",MAX($B$3:B471)+1),\"\")","v":""},{"$f":"IF(Score!B471>0,Score!B471,\"\")","v":""},{"$f":"IF(Score!B471>0,VLOOKUP(C472,Entrants!$A$2:$E$5000,3,FALSE),\"\")","v":""},{"$f":"IF(Score!B471>0,VLOOKUP(C472,Entrants!$A$2:$E$5000,2,FALSE),\"\")","v":""},{"$f":"IF(Score!B471>0,VLOOKUP(C472,Entrants!$A$2:$E$5000,4,FALSE),\"\")","v":""},{"$f":"IF(Score!C471>0,Score!C471,\"\")","v":""}]
[{"$f":"IF(Score!B472>0,Score!A472,\"\")","v":""},{"$f":"IF(Score!B472>0,IF(COUNTIF($E$3:E473,E473)>7,\"\",MAX($B$3:B472)+1),\"\")","v":""},{"$f":"IF(Score!B472>0,Score!B472,\"\")","v":""},{"$f":"IF(Score!B472>0,VLOOKUP(C473,Entrants!$A$2:$E$5000,3,FALSE),\"\")","v":""},{"$f":"IF(Score!B472>0,VLOOKUP(C473,Entrants!$A$2:$E$5000,2,FALSE),\"\")","v":""},{"$f":"IF(Score!B472>0,VLOOKUP(C473,Entrants!$A$2:$E$5000,4,FALSE),\"\")","v":""},{"$f":"IF(Score!C472>0,Score!C472,\"\")","v":""}]
[{"$f":"IF(Score!B473>0,Score!A473,\"\")","v":""},{"$f":"IF(Score!B473>0,IF(COUNTIF($E$3:E474,E474)>7,\"\",MAX($B$3:B473)+1),\"\")","v":""},{"$f":"IF(Score!B473>0,Score!B473,\"\")","v":""},{"$f":"IF(Score!B473>0,VLOOKUP(C474,Entrants!$A$2:$E$5000,3,FALSE),\"\")","v":""},{"$f":"IF(Score!B473>0,VLOOKUP(C474,Entrants!$A$2:$E$5000,2,FALSE),\"\")","v":""},{"$f":"IF(Score!B473>0,VLOOKUP(C474,Entrants!$A$2:$E$5000,4,FALSE),\"\")","v":""},{"$f":"IF(Score!C473>0,Score!C473,\"\")","v":""}]
[{"$f":"IF(Score!B474>0,Score!A474,\"\")","v":""},{"$f":"IF(Score!B474>0,IF(COUNTIF($E$3:E475,E475)>7,\"\",MAX($B$3:B474)+1),\"\")","v":""},{"$f":"IF(Score!B474>0,Score!B474,\"\")","v":""},{"$f":"IF(Score!B474>0,VLOOKUP(C475,Entrants!$A$2:$E$5000,3,FALSE),\"\")","v":""},{"$f":"IF(Score!B474>0,VLOOKUP(C475,Entrants!$A$2:$E$5000,2,FALSE),\"\")","v":""},{"$f":"IF(Score!B474>0,VLOOKUP(C475,Entrants!$A$2:$E$5000,4,FALSE),\"\")","v":""},{"$f":"IF(Score!C474>0,Score!C474,\"\")","v":""}]
[{"$f":"IF(Score!B475>0,Score!A475,\"\")","v":""},{"$f":"IF(Score!B475>0,IF(COUNTIF($E$3:E476,E476)>7,\"\",MAX($B$3:B475)+1),\"\")","v":""},{"$f":"IF(Score!B475>0,Score!B475,\"\")","v":""},{"$f":"IF(Score!B475>0,VLOOKUP(C476,Entrants!$A$2:$E$5000,3,FALSE),\"\")","v":""},{"$f":"IF(Score!B475>0,VLOOKUP(C476,Entrants!$A$2:$E$5000,2,FALSE),\"\")","v":""},{"$f":"IF(Score!B475>0,VLOOKUP(C476,Entrants!$A$2:$E$5000,4,FALSE),\"\")","v":""},{"$f":"IF(Score!C475>0,Score!C475,\"\")","v":""}]
[{"$f":"IF(Score!B476>0,Score!A476,\"\")","v":""},{"$f":"IF(Score!B476>0,IF(COUNTIF($E$3:E477,E477)>7,\"\",MAX($B$3:B476)+1),\"\")","v":""},{"$f":"IF(Score!B476>0,Score!B476,\"\")","v":""},{"$f":"IF(Score!B476>0,VLOOKUP(C477,Entrants!$A$2:$E$5000,3,FALSE),\"\")","v":""},{"$f":"IF(Score!B476>0,VLOOKUP(C477,Entrants!$A$2:$E$5000,2,FALSE),\"\")","v":""},{"$f":"IF(Score!B476>0,VLOOKUP(C477,Entrants!$A$2:$E$5000,4,FALSE),\"\")","v":""},{"$f":"IF(Score!C476>0,Score!C476,\"\")","v":""}]
[{"$f":"IF(Score!B477>0,Score!A477,\"\")","v":""},{"$f":"IF(Score!B477>0,IF(COUNTIF($E$3:E478,E478)>7,\"\",MAX($B$3:B477)+1),\"\")","v":""},{"$f":"IF(Score!B477>0,Score!B477,\"\")","v":""},{"$f":"IF(Score!B477>0,VLOOKUP(C478,Entrants!$A$2:$E$5000,3,FALSE),\"\")","v":""},{"$f":"IF(Score!B477>0,VLOOKUP(C478,Entrants!$A$2:$E$5000,2,FALSE),\"\")","v":""},{"$f":"IF(Score!B477>0,VLOOKUP(C478,Entrants!$A$2:$E$5000,4,FALSE),\"\")","v":""},{"$f":"IF(Score!C477>0,Score!C477,\"\")","v":""}]
[{"$f":"IF(Score!B478>0,Score!A478,\"\")","v":""},{"$f":"IF(Score!B478>0,IF(COUNTIF($E$3:E479,E479)>7,\"\",MAX($B$3:B478)+1),\"\")","v":""},{"$f":"IF(Score!B478>0,Score!B478,\"\")","v":""},{"$f":"IF(Score!B478>0,VLOOKUP(C479,Entrants!$A$2:$E$5000,3,FALSE),\"\")","v":""},{"$f":"IF(Score!B478>0,VLOOKUP(C479,Entrants!$A$2:$E$5000,2,FALSE),\"\")","v":""},{"$f":"IF(Score!B478>0,VLOOKUP(C479,Entrants!$A$2:$E$5000,4,FALSE),\"\")","v":""},{"$f":"IF(Score!C478>0,Score!C478,\"\")","v":""}]
[{"$f":"IF(Score!B479>0,Score!A479,\"\")","v":""},{"$f":"IF(Score!B479>0,IF(COUNTIF($E$3:E480,E480)>7,\"\",MAX($B$3:B479)+1),\"\")","v":""},{"$f":"IF(Score!B479>0,Score!B479,\"\")","v":""},{"$f":"IF(Score!B479>0,VLOOKUP(C480,Entrants!$A$2:$E$5000,3,FALSE),\"\")","v":""},{"$f":"IF(Score!B479>0,VLOOKUP(C480,Entrants!$A$2:$E$5000,2,FALSE),\"\")","v":""},{"$f":"IF(Score!B479>0,VLOOKUP(C480,Entrants!$A$2:$E$5000,4,FALSE),\"\")","v":""},{"$f":"IF(Score!C479>0,Score!C479,\"\")","v":""}]
[{"$f":"IF(Score!B480>0,Score!A480,\"\")","v":""},{"$f":"IF(Score!B480>0,IF(COUNTIF($E$3:E481,E481)>7,\"\",MAX($B$3:B480)+1),\"\")","v":""},{"$f":"IF(Score!B480>0,Score!B480,\"\")","v":""},{"$f":"IF(Score!B480>0,VLOOKUP(C481,Entrants!$A$2:$E$5000,3,FALSE),\"\")","v":""},{"$f":"IF(Score!B480>0,VLOOKUP(C481,Entrants!$A$2:$E$5000,2,FALSE),\"\")","v":""},{"$f":"IF(Score!B480>0,VLOOKUP(C481,Entrants!$A$2:$E$5000,4,FALSE),\"\")","v":""},{"$f":"IF(Score!C480>0,Score!C480,\"\")","v":""}]
[{"$f":"IF(Score!B481>0,Score!A481,\"\")","v":""},{"$f":"IF(Score!B481>0,IF(COUNTIF($E$3:E482,E482)>7,\"\",MAX($B$3:B481)+1),\"\")","v":""},{"$f":"IF(Score!B481>0,Score!B481,\"\")","v":""},{"$f":"IF(Score!B481>0,VLOOKUP(C482,Entrants!$A$2:$E$5000,3,FALSE),\"\")","v":""},{"$f":"IF(Score!B481>0,VLOOKUP(C482,Entrants!$A$2:$E$5000,2,FALSE),\"\")","v":""},{"$f":"IF(Score!B481>0,VLOOKUP(C482,Entrants!$A$2:$E$5000,4,FALSE),\"\")","v":""},{"$f":"IF(Score!C481>0,Score!C481,\"\")","v":""}]
[{"$f":"IF(Score!B482>0,Score!A482,\"\")","v":""},{"$f":"IF(Score!B482>0,IF(COUNTIF($E$3:E483,E483)>7,\"\",MAX($B$3:B482)+1),\"\")","v":""},{"$f":"IF(Score!B482>0,Score!B482,\"\")","v":""},{"$f":"IF(Score!B482>0,VLOOKUP(C483,Entrants!$A$2:$E$5000,3,FALSE),\"\")","v":""},{"$f":"IF(Score!B482>0,VLOOKUP(C483,Entrants!$A$2:$E$5000,2,FALSE),\"\")","v":""},{"$f":"IF(Score!B482>0,VLOOKUP(C483,Entrants!$A$2:$E$5000,4,FALSE),\"\")","v":""},{"$f":"IF(Score!C482>0,Score!C482,\"\")","v":""}]
[{"$f":"IF(Score!B483>0,Score!A483,\"\")","v":""},{"$f":"IF(Score!B483>0,IF(COUNTIF($E$3:E484,E484)>7,\"\",MAX($B$3:B483)+1),\"\")","v":""},{"$f":"IF(Score!B483>0,Score!B483,\"\")","v":""},{"$f":"IF(Score!B483>0,VLOOKUP(C484,Entrants!$A$2:$E$5000,3,FALSE),\"\")","v":""},{"$f":"IF(Score!B483>0,VLOOKUP(C484,Entrants!$A$2:$E$5000,2,FALSE),\"\")","v":""},{"$f":"IF(Score!B483>0,VLOOKUP(C484,Entrants!$A$2:$E$5000,4,FALSE),\"\")","v":""},{"$f":"IF(Score!C483>0,Score!C483,\"\")","v":""}]
[{"$f":"IF(Score!B484>0,Score!A484,\"\")","v":""},{"$f":"IF(Score!B484>0,IF(COUNTIF($E$3:E485,E485)>7,\"\",MAX($B$3:B484)+1),\"\")","v":""},{"$f":"IF(Score!B484>0,Score!B484,\"\")","v":""},{"$f":"IF(Score!B484>0,VLOOKUP(C485,Entrants!$A$2:$E$5000,3,FALSE),\"\")","v":""},{"$f":"IF(Score!B484>0,VLOOKUP(C485,Entrants!$A$2:$E$5000,2,FALSE),\"\")","v":""},{"$f":"IF(Score!B484>0,VLOOKUP(C485,Entrants!$A$2:$E$5000,4,FALSE),\"\")","v":""},{"$f":"IF(Score!C484>0,Score!C484,\"\")","v":""}]
[{"$f":"IF(Score!B485>0,Score!A485,\"\")","v":""},{"$f":"IF(Score!B485>0,IF(COUNTIF($E$3:E486,E486)>7,\"\",MAX($B$3:B485)+1),\"\")","v":""},{"$f":"IF(Score!B485>0,Score!B485,\"\")","v":""},{"$f":"IF(Score!B485>0,VLOOKUP(C486,Entrants!$A$2:$E$5000,3,FALSE),\"\")","v":""},{"$f":"IF(Score!B485>0,VLOOKUP(C486,Entrants!$A$2:$E$5000,2,FALSE),\"\")","v":""},{"$f":"IF(Score!B485>0,VLOOKUP(C486,Entrants!$A$2:$E$5000,4,FALSE),\"\")","v":""},{"$f":"IF(Score!C485>0,Score!C485,\"\")","v":""}]
[{"$f":"IF(Score!B486>0,Score!A486,\"\")","v":""},{"$f":"IF(Score!B486>0,IF(COUNTIF($E$3:E487,E487)>7,\"\",MAX($B$3:B486)+1),\"\")","v":""},{"$f":"IF(Score!B486>0,Score!B486,\"\")","v":""},{"$f":"IF(Score!B486>0,VLOOKUP(C487,Entrants!$A$2:$E$5000,3,FALSE),\"\")","v":""},{"$f":"IF(Score!B486>0,VLOOKUP(C487,Entrants!$A$2:$E$5000,2,FALSE),\"\")","v":""},{"$f":"IF(Score!B486>0,VLOOKUP(C487,Entrants!$A$2:$E$5000,4,FALSE),\"\")","v":""},{"$f":"IF(Score!C486>0,Score!C486,\"\")","v":""}]
[{"$f":"IF(Score!B487>0,Score!A487,\"\")","v":""},{"$f":"IF(Score!B487>0,IF(COUNTIF($E$3:E488,E488)>7,\"\",MAX($B$3:B487)+1),\"\")","v":""},{"$f":"IF(Score!B487>0,Score!B487,\"\")","v":""},{"$f":"IF(Score!B487>0,VLOOKUP(C488,Entrants!$A$2:$E$5000,3,FALSE),\"\")","v":""},{"$f":"IF(Score!B487>0,VLOOKUP(C488,Entrants!$A$2:$E$5000,2,FALSE),\"\")","v":""},{"$f":"IF(Score!B487>0,VLOOKUP(C488,Entrants!$A$2:$E$5000,4,FALSE),\"\")","v":""},{"$f":"IF(Score!C487>0,Score!C487,\"\")","v":""}]
[{"$f":"IF(Score!B488>0,Score!A488,\"\")","v":""},{"$f":"IF(Score!B488>0,IF(COUNTIF($E$3:E489,E489)>7,\"\",MAX($B$3:B488)+1),\"\")","v":""},{"$f":"IF(Score!B488>0,Score!B488,\"\")","v":""},{"$f":"IF(Score!B488>0,VLOOKUP(C489,Entrants!$A$2:$E$5000,3,FALSE),\"\")","v":""},{"$f":"IF(Score!B488>0,VLOOKUP(C489,Entrants!$A$2:$E$5000,2,FALSE),\"\")","v":""},{"$f":"IF(Score!B488>0,VLOOKUP(C489,Entrants!$A$2:$E$5000,4,FALSE),\"\")","v":""},{"$f":"IF(Score!C488>0,Score!C488,\"\")","v":""}]
[{"$f":"IF(Score!B489>0,Score!A489,\"\")","v":""},{"$f":"IF(Score!B489>0,IF(COUNTIF($E$3:E490,E490)>7,\"\",MAX($B$3:B489)+1),\"\")","v":""},{"$f":"IF(Score!B489>0,Score!B489,\"\")","v":""},{"$f":"IF(Score!B489>0,VLOOKUP(C490,Entrants!$A$2:$E$5000,3,FALSE),\"\")","v":""},{"$f":"IF(Score!B489>0,VLOOKUP(C490,Entrants!$A$2:$E$5000,2,FALSE),\"\")","v":""},{"$f":"IF(Score!B489>0,VLOOKUP(C490,Entrants!$A$2:$E$5000,4,FALSE),\"\")","v":""},{"$f":"IF(Score!C489>0,Score!C489,\"\")","v":""}]
[{"$f":"IF(Score!B490>0,Score!A490,\"\")","v":""},{"$f":"IF(Score!B490>0,IF(COUNTIF($E$3:E491,E491)>7,\"\",MAX($B$3:B490)+1),\"\")","v":""},{"$f":"IF(Score!B490>0,Score!B490,\"\")","v":""},{"$f":"IF(Score!B490>0,VLOOKUP(C491,Entrants!$A$2:$E$5000,3,FALSE),\"\")","v":""},{"$f":"IF(Score!B490>0,VLOOKUP(C491,Entrants!$A$2:$E$5000,2,FALSE),\"\")","v":""},{"$f":"IF(Score!B490>0,VLOOKUP(C491,Entrants!$A$2:$E$5000,4,FALSE),\"\")","v":""},{"$f":"IF(Score!C490>0,Score!C490,\"\")","v":""}]
[{"$f":"IF(Score!B491>0,Score!A491,\"\")","v":""},{"$f":"IF(Score!B491>0,IF(COUNTIF($E$3:E492,E492)>7,\"\",MAX($B$3:B491)+1),\"\")","v":""},{"$f":"IF(Score!B491>0,Score!B491,\"\")","v":""},{"$f":"IF(Score!B491>0,VLOOKUP(C492,Entrants!$A$2:$E$5000,3,FALSE),\"\")","v":""},{"$f":"IF(Score!B491>0,VLOOKUP(C492,Entrants!$A$2:$E$5000,2,FALSE),\"\")","v":""},{"$f":"IF(Score!B491>0,VLOOKUP(C492,Entrants!$A$2:$E$5000,4,FALSE),\"\")","v":""},{"$f":"IF(Score!C491>0,Score!C491,\"\")","v":""}]
[{"$f":"IF(Score!B492>0,Score!A492,\"\")","v":""},{"$f":"IF(Score!B492>0,IF(COUNTIF($E$3:E493,E493)>7,\"\",MAX($B$3:B492)+1),\"\")","v":""},{"$f":"IF(Score!B492>0,Score!B492,\"\")","v":""},{"$f":"IF(Score!B492>0,VLOOKUP(C493,Entrants!$A$2:$E$5000,3,FALSE),\"\")","v":""},{"$f":"IF(Score!B492>0,VLOOKUP(C493,Entrants!$A$2:$E$5000,2,FALSE),\"\")","v":""},{"$f":"IF(Score!B492>0,VLOOKUP(C493,Entrants!$A$2:$E$5000,4,FALSE),\"\")","v":""},{"$f":"IF(Score!C492>0,Score!C492,\"\")","v":""}]
[{"$f":"IF(Score!B493>0,Score!A493,\"\")","v":""},{"$f":"IF(Score!B493>0,IF(COUNTIF($E$3:E494,E494)>7,\"\",MAX($B$3:B493)+1),\"\")","v":""},{"$f":"IF(Score!B493>0,Score!B493,\"\")","v":""},{"$f":"IF(Score!B493>0,VLOOKUP(C494,Entrants!$A$2:$E$5000,3,FALSE),\"\")","v":""},{"$f":"IF(Score!B493>0,VLOOKUP(C494,Entrants!$A$2:$E$5000,2,FALSE),\"\")","v":""},{"$f":"IF(Score!B493>0,VLOOKUP(C494,Entrants!$A$2:$E$5000,4,FALSE),\"\")","v":""},{"$f":"IF(Score!C493>0,Score!C493,\"\")","v":""}]
[{"$f":"IF(Score!B494>0,Score!A494,\"\")","v":""},{"$f":"IF(Score!B494>0,IF(COUNTIF($E$3:E495,E495)>7,\"\",MAX($B$3:B494)+1),\"\")","v":""},{"$f":"IF(Score!B494>0,Score!B494,\"\")","v":""},{"$f":"IF(Score!B494>0,VLOOKUP(C495,Entrants!$A$2:$E$5000,3,FALSE),\"\")","v":""},{"$f":"IF(Score!B494>0,VLOOKUP(C495,Entrants!$A$2:$E$5000,2,FALSE),\"\")","v":""},{"$f":"IF(Score!B494>0,VLOOKUP(C495,Entrants!$A$2:$E$5000,4,FALSE),\"\")","v":""},{"$f":"IF(Score!C494>0,Score!C494,\"\")","v":""}]
[{"$f":"IF(Score!B495>0,Score!A495,\"\")","v":""},{"$f":"IF(Score!B495>0,IF(COUNTIF($E$3:E496,E496)>7,\"\",MAX($B$3:B495)+1),\"\")","v":""},{"$f":"IF(Score!B495>0,Score!B495,\"\")","v":""},{"$f":"IF(Score!B495>0,VLOOKUP(C496,Entrants!$A$2:$E$5000,3,FALSE),\"\")","v":""},{"$f":"IF(Score!B495>0,VLOOKUP(C496,Entrants!$A$2:$E$5000,2,FALSE),\"\")","v":""},{"$f":"IF(Score!B495>0,VLOOKUP(C496,Entrants!$A$2:$E$5000,4,FALSE),\"\")","v":""},{"$f":"IF(Score!C495>0,Score!C495,\"\")","v":""}]
[{"$f":"IF(Score!B496>0,Score!A496,\"\")","v":""},{"$f":"IF(Score!B496>0,IF(COUNTIF($E$3:E497,E497)>7,\"\",MAX($B$3:B496)+1),\"\")","v":""},{"$f":"IF(Score!B496>0,Score!B496,\"\")","v":""},{"$f":"IF(Score!B496>0,VLOOKUP(C497,Entrants!$A$2:$E$5000,3,FALSE),\"\")","v":""},{"$f":"IF(Score!B496>0,VLOOKUP(C497,Entrants!$A$2:$E$5000,2,FALSE),\"\")","v":""},{"$f":"IF(Score!B496>0,VLOOKUP(C497,Entrants!$A$2:$E$5000,4,FALSE),\"\")","v":""},{"$f":"IF(Score!C496>0,Score!C496,\"\")","v":""}]
[{"$f":"IF(Score!B497>0,Score!A497,\"\")","v":""},{"$f":"IF(Score!B497>0,IF(COUNTIF($E$3:E498,E498)>7,\"\",MAX($B$3:B497)+1),\"\")","v":""},{"$f":"IF(Score!B497>0,Score!B497,\"\")","v":""},{"$f":"IF(Score!B497>0,VLOOKUP(C498,Entrants!$A$2:$E$5000,3,FALSE),\"\")","v":""},{"$f":"IF(Score!B497>0,VLOOKUP(C498,Entrants!$A$2:$E$5000,2,FALSE),\"\")","v":""},{"$f":"IF(Score!B497>0,VLOOKUP(C498,Entrants!$A$2:$E$5000,4,FALSE),\"\")","v":""},{"$f":"IF(Score!C497>0,Score!C497,\"\")","v":""}]
[{"$f":"IF(Score!B498>0,Score!A498,\"\")","v":""},{"$f":"IF(Score!B498>0,IF(COUNTIF($E$3:E499,E499)>7,\"\",MAX($B$3:B498)+1),\"\")","v":""},{"$f":"IF(Score!B498>0,Score!B498,\"\")","v":""},{"$f":"IF(Score!B498>0,VLOOKUP(C499,Entrants!$A$2:$E$5000,3,FALSE),\"\")","v":""},{"$f":"IF(Score!B498>0,VLOOKUP(C499,Entrants!$A$2:$E$5000,2,FALSE),\"\")","v":""},{"$f":"IF(Score!B498>0,VLOOKUP(C499,Entrants!$A$2:$E$5000,4,FALSE),\"\")","v":""},{"$f":"IF(Score!C498>0,Score!C498,\"\")","v":""}]
[{"$f":"IF(Score!B499>0,Score!A499,\"\")","v":""},{"$f":"IF(Score!B499>0,IF(COUNTIF($E$3:E500,E500)>7,\"\",MAX($B$3:B499)+1),\"\")","v":""},{"$f":"IF(Score!B499>0,Score!B499,\"\")","v":""},{"$f":"IF(Score!B499>0,VLOOKUP(C500,Entrants!$A$2:$E$5000,3,FALSE),\"\")","v":""},{"$f":"IF(Score!B499>0,VLOOKUP(C500,Entrants!$A$2:$E$5000,2,FALSE),\"\")","v":""},{"$f":"IF(Score!B499>0,VLOOKUP(C500,Entrants!$A$2:$E$5000,4,FALSE),\"\")","v":""},{"$f":"IF(Score!C499>0,Score!C499,\"\")","v":""}]
[{"$f":"IF(Score!B500>0,Score!A500,\"\")","v":""},{"$f":"IF(Score!B500>0,IF(COUNTIF($E$3:E501,E501)>7,\"\",MAX($B$3:B500)+1),\"\")","v":""},{"$f":"IF(Score!B500>0,Score!B500,\"\")","v":""},{"$f":"IF(Score!B500>0,VLOOKUP(C501,Entrants!$A$2:$E$5000,3,FALSE),\"\")","v":""},{"$f":"IF(Score!B500>0,VLOOKUP(C501,Entrants!$A$2:$E$5000,2,FALSE),\"\")","v":""},{"$f":"IF(Score!B500>0,VLOOKUP(C501,Entrants!$A$2:$E$5000,4,FALSE),\"\")","v":""},{"$f":"IF(Score!C500>0,Score!C500,\"\")","v":""}]
[{"$f":"IF(Score!B501>0,Score!A501,\"\")","v":""},{"$f":"IF(Score!B501>0,IF(COUNTIF($E$3:E502,E502)>7,\"\",MAX($B$3:B501)+1),\"\")","v":""},{"$f":"IF(Score!B501>0,Score!B501,\"\")","v":""},{"$f":"IF(Score!B501>0,VLOOKUP(C502,Entrants!$A$2:$E$5000,3,FALSE),\"\")","v":""},{"$f":"IF(Score!B501>0,VLOOKUP(C502,Entrants!$A$2:$E$5000,2,FALSE),\"\")","v":""},{"$f":"IF(Score!B501>0,VLOOKUP(C502,Entrants!$A$2:$E$5000,4,FALSE),\"\")","v":""},{"$f":"IF(Score!C501>0,Score!C501,\"\")","v":""}]
[{"$f":"IF(Score!B502>0,Score!A502,\"\")","v":""},{"$f":"IF(Score!B502>0,IF(COUNTIF($E$3:E503,E503)>7,\"\",MAX($B$3:B502)+1),\"\")","v":""},{"$f":"IF(Score!B502>0,Score!B502,\"\")","v":""},{"$f":"IF(Score!B502>0,VLOOKUP(C503,Entrants!$A$2:$E$5000,3,FALSE),\"\")","v":""},{"$f":"IF(Score!B502>0,VLOOKUP(C503,Entrants!$A$2:$E$5000,2,FALSE),\"\")","v":""},{"$f":"IF(Score!B502>0,VLOOKUP(C503,Entrants!$A$2:$E$5000,4,FALSE),\"\")","v":""},{"$f":"IF(Score!C502>0,Score!C502,\"\")","v":""}]
[{"$f":"IF(Score!B503>0,Score!A503,\"\")","v":""},{"$f":"IF(Score!B503>0,IF(COUNTIF($E$3:E504,E504)>7,\"\",MAX($B$3:B503)+1),\"\")","v":""},{"$f":"IF(Score!B503>0,Score!B503,\"\")","v":""},{"$f":"IF(Score!B503>0,VLOOKUP(C504,Entrants!$A$2:$E$5000,3,FALSE),\"\")","v":""},{"$f":"IF(Score!B503>0,VLOOKUP(C504,Entrants!$A$2:$E$5000,2,FALSE),\"\")","v":""},{"$f":"IF(Score!B503>0,VLOOKUP(C504,Entrants!$A$2:$E$5000,4,FALSE),\"\")","v":""},{"$f":"IF(Score!C503>0,Score!C503,\"\")","v":""}]
[{"$f":"IF(Score!B504>0,Score!A504,\"\")","v":""},{"$f":"IF(Score!B504>0,IF(COUNTIF($E$3:E505,E505)>7,\"\",MAX($B$3:B504)+1),\"\")","v":""},{"$f":"IF(Score!B504>0,Score!B504,\"\")","v":""},{"$f":"IF(Score!B504>0,VLOOKUP(C505,Entrants!$A$2:$E$5000,3,FALSE),\"\")","v":""},{"$f":"IF(Score!B504>0,VLOOKUP(C505,Entrants!$A$2:$E$5000,2,FALSE),\"\")","v":""},{"$f":"IF(Score!B504>0,VLOOKUP(C505,Entrants!$A$2:$E$5000,4,FALSE),\"\")","v":""},{"$f":"IF(Score!C504>0,Score!C504,\"\")","v":""}]
[{"$f":"IF(Score!B505>0,Score!A505,\"\")","v":""},{"$f":"IF(Score!B505>0,IF(COUNTIF($E$3:E506,E506)>7,\"\",MAX($B$3:B505)+1),\"\")","v":""},{"$f":"IF(Score!B505>0,Score!B505,\"\")","v":""},{"$f":"IF(Score!B505>0,VLOOKUP(C506,Entrants!$A$2:$E$5000,3,FALSE),\"\")","v":""},{"$f":"IF(Score!B505>0,VLOOKUP(C506,Entrants!$A$2:$E$5000,2,FALSE),\"\")","v":""},{"$f":"IF(Score!B505>0,VLOOKUP(C506,Entrants!$A$2:$E$5000,4,FALSE),\"\")","v":""},{"$f":"IF(Score!C505>0,Score!C505,\"\")","v":""}]
[{"$f":"IF(Score!B506>0,Score!A506,\"\")","v":""},{"$f":"IF(Score!B506>0,IF(COUNTIF($E$3:E507,E507)>7,\"\",MAX($B$3:B506)+1),\"\")","v":""},{"$f":"IF(Score!B506>0,Score!B506,\"\")","v":""},{"$f":"IF(Score!B506>0,VLOOKUP(C507,Entrants!$A$2:$E$5000,3,FALSE),\"\")","v":""},{"$f":"IF(Score!B506>0,VLOOKUP(C507,Entrants!$A$2:$E$5000,2,FALSE),\"\")","v":""},{"$f":"IF(Score!B506>0,VLOOKUP(C507,Entrants!$A$2:$E$5000,4,FALSE),\"\")","v":""},{"$f":"IF(Score!C506>0,Score!C506,\"\")","v":""}]
[{"$f":"IF(Score!B507>0,Score!A507,\"\")","v":""},{"$f":"IF(Score!B507>0,IF(COUNTIF($E$3:E508,E508)>7,\"\",MAX($B$3:B507)+1),\"\")","v":""},{"$f":"IF(Score!B507>0,Score!B507,\"\")","v":""},{"$f":"IF(Score!B507>0,VLOOKUP(C508,Entrants!$A$2:$E$5000,3,FALSE),\"\")","v":""},{"$f":"IF(Score!B507>0,VLOOKUP(C508,Entrants!$A$2:$E$5000,2,FALSE),\"\")","v":""},{"$f":"IF(Score!B507>0,VLOOKUP(C508,Entrants!$A$2:$E$5000,4,FALSE),\"\")","v":""},{"$f":"IF(Score!C507>0,Score!C507,\"\")","v":""}]
[{"$f":"IF(Score!B508>0,Score!A508,\"\")","v":""},{"$f":"IF(Score!B508>0,IF(COUNTIF($E$3:E509,E509)>7,\"\",MAX($B$3:B508)+1),\"\")","v":""},{"$f":"IF(Score!B508>0,Score!B508,\"\")","v":""},{"$f":"IF(Score!B508>0,VLOOKUP(C509,Entrants!$A$2:$E$5000,3,FALSE),\"\")","v":""},{"$f":"IF(Score!B508>0,VLOOKUP(C509,Entrants!$A$2:$E$5000,2,FALSE),\"\")","v":""},{"$f":"IF(Score!B508>0,VLOOKUP(C509,Entrants!$A$2:$E$5000,4,FALSE),\"\")","v":""},{"$f":"IF(Score!C508>0,Score!C508,\"\")","v":""}]
[{"$f":"IF(Score!B509>0,Score!A509,\"\")","v":""},{"$f":"IF(Score!B509>0,IF(COUNTIF($E$3:E510,E510)>7,\"\",MAX($B$3:B509)+1),\"\")","v":""},{"$f":"IF(Score!B509>0,Score!B509,\"\")","v":""},{"$f":"IF(Score!B509>0,VLOOKUP(C510,Entrants!$A$2:$E$5000,3,FALSE),\"\")","v":""},{"$f":"IF(Score!B509>0,VLOOKUP(C510,Entrants!$A$2:$E$5000,2,FALSE),\"\")","v":""},{"$f":"IF(Score!B509>0,VLOOKUP(C510,Entrants!$A$2:$E$5000,4,FALSE),\"\")","v":""},{"$f":"IF(Score!C509>0,Score!C509,\"\")","v":""}]
[{"$f":"IF(Score!B510>0,Score!A510,\"\")","v":""},{"$f":"IF(Score!B510>0,IF(COUNTIF($E$3:E511,E511)>7,\"\",MAX($B$3:B510)+1),\"\")","v":""},{"$f":"IF(Score!B510>0,Score!B510,\"\")","v":""},{"$f":"IF(Score!B510>0,VLOOKUP(C511,Entrants!$A$2:$E$5000,3,FALSE),\"\")","v":""},{"$f":"IF(Score!B510>0,VLOOKUP(C511,Entrants!$A$2:$E$5000,2,FALSE),\"\")","v":""},{"$f":"IF(Score!B510>0,VLOOKUP(C511,Entrants!$A$2:$E$5000,4,FALSE),\"\")","v":""},{"$f":"IF(Score!C510>0,Score!C510,\"\")","v":""}]
[{"$f":"IF(Score!B511>0,Score!A511,\"\")","v":""},{"$f":"IF(Score!B511>0,IF(COUNTIF($E$3:E512,E512)>7,\"\",MAX($B$3:B511)+1),\"\")","v":""},{"$f":"IF(Score!B511>0,Score!B511,\"\")","v":""},{"$f":"IF(Score!B511>0,VLOOKUP(C512,Entrants!$A$2:$E$5000,3,FALSE),\"\")","v":""},{"$f":"IF(Score!B511>0,VLOOKUP(C512,Entrants!$A$2:$E$5000,2,FALSE),\"\")","v":""},{"$f":"IF(Score!B511>0,VLOOKUP(C512,Entrants!$A$2:$E$5000,4,FALSE),\"\")","v":""},{"$f":"IF(Score!C511>0,Score!C511,\"\")","v":""}]
[{"$f":"IF(Score!B512>0,Score!A512,\"\")","v":""},{"$f":"IF(Score!B512>0,IF(COUNTIF($E$3:E513,E513)>7,\"\",MAX($B$3:B512)+1),\"\")","v":""},{"$f":"IF(Score!B512>0,Score!B512,\"\")","v":""},{"$f":"IF(Score!B512>0,VLOOKUP(C513,Entrants!$A$2:$E$5000,3,FALSE),\"\")","v":""},{"$f":"IF(Score!B512>0,VLOOKUP(C513,Entrants!$A$2:$E$5000,2,FALSE),\"\")","v":""},{"$f":"IF(Score!B512>0,VLOOKUP(C513,Entrants!$A$2:$E$5000,4,FALSE),\"\")","v":""},{"$f":"IF(Score!C512>0,Score!C512,\"\")","v":""}]
[{"$f":"IF(Score!B513>0,Score!A513,\"\")","v":""},{"$f":"IF(Score!B513>0,IF(COUNTIF($E$3:E514,E514)>7,\"\",MAX($B$3:B513)+1),\"\")","v":""},{"$f":"IF(Score!B513>0,Score!B513,\"\")","v":""},{"$f":"IF(Score!B513>0,VLOOKUP(C514,Entrants!$A$2:$E$5000,3,FALSE),\"\")","v":""},{"$f":"IF(Score!B513>0,VLOOKUP(C514,Entrants!$A$2:$E$5000,2,FALSE),\"\")","v":""},{"$f":"IF(Score!B513>0,VLOOKUP(C514,Entrants!$A$2:$E$5000,4,FALSE),\"\")","v":""},{"$f":"IF(Score!C513>0,Score!C513,\"\")","v":""}]
[{"$f":"IF(Score!B514>0,Score!A514,\"\")","v":""},{"$f":"IF(Score!B514>0,IF(COUNTIF($E$3:E515,E515)>7,\"\",MAX($B$3:B514)+1),\"\")","v":""},{"$f":"IF(Score!B514>0,Score!B514,\"\")","v":""},{"$f":"IF(Score!B514>0,VLOOKUP(C515,Entrants!$A$2:$E$5000,3,FALSE),\"\")","v":""},{"$f":"IF(Score!B514>0,VLOOKUP(C515,Entrants!$A$2:$E$5000,2,FALSE),\"\")","v":""},{"$f":"IF(Score!B514>0,VLOOKUP(C515,Entrants!$A$2:$E$5000,4,FALSE),\"\")","v":""},{"$f":"IF(Score!C514>0,Score!C514,\"\")","v":""}]
[{"$f":"IF(Score!B515>0,Score!A515,\"\")","v":""},{"$f":"IF(Score!B515>0,IF(COUNTIF($E$3:E516,E516)>7,\"\",MAX($B$3:B515)+1),\"\")","v":""},{"$f":"IF(Score!B515>0,Score!B515,\"\")","v":""},{"$f":"IF(Score!B515>0,VLOOKUP(C516,Entrants!$A$2:$E$5000,3,FALSE),\"\")","v":""},{"$f":"IF(Score!B515>0,VLOOKUP(C516,Entrants!$A$2:$E$5000,2,FALSE),\"\")","v":""},{"$f":"IF(Score!B515>0,VLOOKUP(C516,Entrants!$A$2:$E$5000,4,FALSE),\"\")","v":""},{"$f":"IF(Score!C515>0,Score!C515,\"\")","v":""}]
[{"$f":"IF(Score!B516>0,Score!A516,\"\")","v":""},{"$f":"IF(Score!B516>0,IF(COUNTIF($E$3:E517,E517)>7,\"\",MAX($B$3:B516)+1),\"\")","v":""},{"$f":"IF(Score!B516>0,Score!B516,\"\")","v":""},{"$f":"IF(Score!B516>0,VLOOKUP(C517,Entrants!$A$2:$E$5000,3,FALSE),\"\")","v":""},{"$f":"IF(Score!B516>0,VLOOKUP(C517,Entrants!$A$2:$E$5000,2,FALSE),\"\")","v":""},{"$f":"IF(Score!B516>0,VLOOKUP(C517,Entrants!$A$2:$E$5000,4,FALSE),\"\")","v":""},{"$f":"IF(Score!C516>0,Score!C516,\"\")","v":""}]
[{"$f":"IF(Score!B517>0,Score!A517,\"\")","v":""},{"$f":"IF(Score!B517>0,IF(COUNTIF($E$3:E518,E518)>7,\"\",MAX($B$3:B517)+1),\"\")","v":""},{"$f":"IF(Score!B517>0,Score!B517,\"\")","v":""},{"$f":"IF(Score!B517>0,VLOOKUP(C518,Entrants!$A$2:$E$5000,3,FALSE),\"\")","v":""},{"$f":"IF(Score!B517>0,VLOOKUP(C518,Entrants!$A$2:$E$5000,2,FALSE),\"\")","v":""},{"$f":"IF(Score!B517>0,VLOOKUP(C518,Entrants!$A$2:$E$5000,4,FALSE),\"\")","v":""},{"$f":"IF(Score!C517>0,Score!C517,\"\")","v":""}]
[{"$f":"IF(Score!B518>0,Score!A518,\"\")","v":""},{"$f":"IF(Score!B518>0,IF(COUNTIF($E$3:E519,E519)>7,\"\",MAX($B$3:B518)+1),\"\")","v":""},{"$f":"IF(Score!B518>0,Score!B518,\"\")","v":""},{"$f":"IF(Score!B518>0,VLOOKUP(C519,Entrants!$A$2:$E$5000,3,FALSE),\"\")","v":""},{"$f":"IF(Score!B518>0,VLOOKUP(C519,Entrants!$A$2:$E$5000,2,FALSE),\"\")","v":""},{"$f":"IF(Score!B518>0,VLOOKUP(C519,Entrants!$A$2:$E$5000,4,FALSE),\"\")","v":""},{"$f":"IF(Score!C518>0,Score!C518,\"\")","v":""}]
[{"$f":"IF(Score!B519>0,Score!A519,\"\")","v":""},{"$f":"IF(Score!B519>0,IF(COUNTIF($E$3:E520,E520)>7,\"\",MAX($B$3:B519)+1),\"\")","v":""},{"$f":"IF(Score!B519>0,Score!B519,\"\")","v":""},{"$f":"IF(Score!B519>0,VLOOKUP(C520,Entrants!$A$2:$E$5000,3,FALSE),\"\")","v":""},{"$f":"IF(Score!B519>0,VLOOKUP(C520,Entrants!$A$2:$E$5000,2,FALSE),\"\")","v":""},{"$f":"IF(Score!B519>0,VLOOKUP(C520,Entrants!$A$2:$E$5000,4,FALSE),\"\")","v":""},{"$f":"IF(Score!C519>0,Score!C519,\"\")","v":""}]
[{"$f":"IF(Score!B520>0,Score!A520,\"\")","v":""},{"$f":"IF(Score!B520>0,IF(COUNTIF($E$3:E521,E521)>7,\"\",MAX($B$3:B520)+1),\"\")","v":""},{"$f":"IF(Score!B520>0,Score!B520,\"\")","v":""},{"$f":"IF(Score!B520>0,VLOOKUP(C521,Entrants!$A$2:$E$5000,3,FALSE),\"\")","v":""},{"$f":"IF(Score!B520>0,VLOOKUP(C521,Entrants!$A$2:$E$5000,2,FALSE),\"\")","v":""},{"$f":"IF(Score!B520>0,VLOOKUP(C521,Entrants!$A$2:$E$5000,4,FALSE),\"\")","v":""},{"$f":"IF(Score!C520>0,Score!C520,\"\")","v":""}]
[{"$f":"IF(Score!B521>0,Score!A521,\"\")","v":""},{"$f":"IF(Score!B521>0,IF(COUNTIF($E$3:E522,E522)>7,\"\",MAX($B$3:B521)+1),\"\")","v":""},{"$f":"IF(Score!B521>0,Score!B521,\"\")","v":""},{"$f":"IF(Score!B521>0,VLOOKUP(C522,Entrants!$A$2:$E$5000,3,FALSE),\"\")","v":""},{"$f":"IF(Score!B521>0,VLOOKUP(C522,Entrants!$A$2:$E$5000,2,FALSE),\"\")","v":""},{"$f":"IF(Score!B521>0,VLOOKUP(C522,Entrants!$A$2:$E$5000,4,FALSE),\"\")","v":""},{"$f":"IF(Score!C521>0,Score!C521,\"\")","v":""}]
[{"$f":"IF(Score!B522>0,Score!A522,\"\")","v":""},{"$f":"IF(Score!B522>0,IF(COUNTIF($E$3:E523,E523)>7,\"\",MAX($B$3:B522)+1),\"\")","v":""},{"$f":"IF(Score!B522>0,Score!B522,\"\")","v":""},{"$f":"IF(Score!B522>0,VLOOKUP(C523,Entrants!$A$2:$E$5000,3,FALSE),\"\")","v":""},{"$f":"IF(Score!B522>0,VLOOKUP(C523,Entrants!$A$2:$E$5000,2,FALSE),\"\")","v":""},{"$f":"IF(Score!B522>0,VLOOKUP(C523,Entrants!$A$2:$E$5000,4,FALSE),\"\")","v":""},{"$f":"IF(Score!C522>0,Score!C522,\"\")","v":""}]
[{"$f":"IF(Score!B523>0,Score!A523,\"\")","v":""},{"$f":"IF(Score!B523>0,IF(COUNTIF($E$3:E524,E524)>7,\"\",MAX($B$3:B523)+1),\"\")","v":""},{"$f":"IF(Score!B523>0,Score!B523,\"\")","v":""},{"$f":"IF(Score!B523>0,VLOOKUP(C524,Entrants!$A$2:$E$5000,3,FALSE),\"\")","v":""},{"$f":"IF(Score!B523>0,VLOOKUP(C524,Entrants!$A$2:$E$5000,2,FALSE),\"\")","v":""},{"$f":"IF(Score!B523>0,VLOOKUP(C524,Entrants!$A$2:$E$5000,4,FALSE),\"\")","v":""},{"$f":"IF(Score!C523>0,Score!C523,\"\")","v":""}]
[{"$f":"IF(Score!B524>0,Score!A524,\"\")","v":""},{"$f":"IF(Score!B524>0,IF(COUNTIF($E$3:E525,E525)>7,\"\",MAX($B$3:B524)+1),\"\")","v":""},{"$f":"IF(Score!B524>0,Score!B524,\"\")","v":""},{"$f":"IF(Score!B524>0,VLOOKUP(C525,Entrants!$A$2:$E$5000,3,FALSE),\"\")","v":""},{"$f":"IF(Score!B524>0,VLOOKUP(C525,Entrants!$A$2:$E$5000,2,FALSE),\"\")","v":""},{"$f":"IF(Score!B524>0,VLOOKUP(C525,Entrants!$A$2:$E$5000,4,FALSE),\"\")","v":""},{"$f":"IF(Score!C524>0,Score!C524,\"\")","v":""}]
[{"$f":"IF(Score!B525>0,Score!A525,\"\")","v":""},{"$f":"IF(Score!B525>0,IF(COUNTIF($E$3:E526,E526)>7,\"\",MAX($B$3:B525)+1),\"\")","v":""},{"$f":"IF(Score!B525>0,Score!B525,\"\")","v":""},{"$f":"IF(Score!B525>0,VLOOKUP(C526,Entrants!$A$2:$E$5000,3,FALSE),\"\")","v":""},{"$f":"IF(Score!B525>0,VLOOKUP(C526,Entrants!$A$2:$E$5000,2,FALSE),\"\")","v":""},{"$f":"IF(Score!B525>0,VLOOKUP(C526,Entrants!$A$2:$E$5000,4,FALSE),\"\")","v":""},{"$f":"IF(Score!C525>0,Score!C525,\"\")","v":""}]
[{"$f":"IF(Score!B526>0,Score!A526,\"\")","v":""},{"$f":"IF(Score!B526>0,IF(COUNTIF($E$3:E527,E527)>7,\"\",MAX($B$3:B526)+1),\"\")","v":""},{"$f":"IF(Score!B526>0,Score!B526,\"\")","v":""},{"$f":"IF(Score!B526>0,VLOOKUP(C527,Entrants!$A$2:$E$5000,3,FALSE),\"\")","v":""},{"$f":"IF(Score!B526>0,VLOOKUP(C527,Entrants!$A$2:$E$5000,2,FALSE),\"\")","v":""},{"$f":"IF(Score!B526>0,VLOOKUP(C527,Entrants!$A$2:$E$5000,4,FALSE),\"\")","v":""},{"$f":"IF(Score!C526>0,Score!C526,\"\")","v":""}]
[{"$f":"IF(Score!B527>0,Score!A527,\"\")","v":""},{"$f":"IF(Score!B527>0,IF(COUNTIF($E$3:E528,E528)>7,\"\",MAX($B$3:B527)+1),\"\")","v":""},{"$f":"IF(Score!B527>0,Score!B527,\"\")","v":""},{"$f":"IF(Score!B527>0,VLOOKUP(C528,Entrants!$A$2:$E$5000,3,FALSE),\"\")","v":""},{"$f":"IF(Score!B527>0,VLOOKUP(C528,Entrants!$A$2:$E$5000,2,FALSE),\"\")","v":""},{"$f":"IF(Score!B527>0,VLOOKUP(C528,Entrants!$A$2:$E$5000,4,FALSE),\"\")","v":""},{"$f":"IF(Score!C527>0,Score!C527,\"\")","v":""}]
[{"$f":"IF(Score!B528>0,Score!A528,\"\")","v":""},{"$f":"IF(Score!B528>0,IF(COUNTIF($E$3:E529,E529)>7,\"\",MAX($B$3:B528)+1),\"\")","v":""},{"$f":"IF(Score!B528>0,Score!B528,\"\")","v":""},{"$f":"IF(Score!B528>0,VLOOKUP(C529,Entrants!$A$2:$E$5000,3,FALSE),\"\")","v":""},{"$f":"IF(Score!B528>0,VLOOKUP(C529,Entrants!$A$2:$E$5000,2,FALSE),\"\")","v":""},{"$f":"IF(Score!B528>0,VLOOKUP(C529,Entrants!$A$2:$E$5000,4,FALSE),\"\")","v":""},{"$f":"IF(Score!C528>0,Score!C528,\"\")","v":""}]
[{"$f":"IF(Score!B529>0,Score!A529,\"\")","v":""},{"$f":"IF(Score!B529>0,IF(COUNTIF($E$3:E530,E530)>7,\"\",MAX($B$3:B529)+1),\"\")","v":""},{"$f":"IF(Score!B529>0,Score!B529,\"\")","v":""},{"$f":"IF(Score!B529>0,VLOOKUP(C530,Entrants!$A$2:$E$5000,3,FALSE),\"\")","v":""},{"$f":"IF(Score!B529>0,VLOOKUP(C530,Entrants!$A$2:$E$5000,2,FALSE),\"\")","v":""},{"$f":"IF(Score!B529>0,VLOOKUP(C530,Entrants!$A$2:$E$5000,4,FALSE),\"\")","v":""},{"$f":"IF(Score!C529>0,Score!C529,\"\")","v":""}]
[{"$f":"IF(Score!B530>0,Score!A530,\"\")","v":""},{"$f":"IF(Score!B530>0,IF(COUNTIF($E$3:E531,E531)>7,\"\",MAX($B$3:B530)+1),\"\")","v":""},{"$f":"IF(Score!B530>0,Score!B530,\"\")","v":""},{"$f":"IF(Score!B530>0,VLOOKUP(C531,Entrants!$A$2:$E$5000,3,FALSE),\"\")","v":""},{"$f":"IF(Score!B530>0,VLOOKUP(C531,Entrants!$A$2:$E$5000,2,FALSE),\"\")","v":""},{"$f":"IF(Score!B530>0,VLOOKUP(C531,Entrants!$A$2:$E$5000,4,FALSE),\"\")","v":""},{"$f":"IF(Score!C530>0,Score!C530,\"\")","v":""}]
[{"$f":"IF(Score!B531>0,Score!A531,\"\")","v":""},{"$f":"IF(Score!B531>0,IF(COUNTIF($E$3:E532,E532)>7,\"\",MAX($B$3:B531)+1),\"\")","v":""},{"$f":"IF(Score!B531>0,Score!B531,\"\")","v":""},{"$f":"IF(Score!B531>0,VLOOKUP(C532,Entrants!$A$2:$E$5000,3,FALSE),\"\")","v":""},{"$f":"IF(Score!B531>0,VLOOKUP(C532,Entrants!$A$2:$E$5000,2,FALSE),\"\")","v":""},{"$f":"IF(Score!B531>0,VLOOKUP(C532,Entrants!$A$2:$E$5000,4,FALSE),\"\")","v":""},{"$f":"IF(Score!C531>0,Score!C531,\"\")","v":""}]
[{"$f":"IF(Score!B532>0,Score!A532,\"\")","v":""},{"$f":"IF(Score!B532>0,IF(COUNTIF($E$3:E533,E533)>7,\"\",MAX($B$3:B532)+1),\"\")","v":""},{"$f":"IF(Score!B532>0,Score!B532,\"\")","v":""},{"$f":"IF(Score!B532>0,VLOOKUP(C533,Entrants!$A$2:$E$5000,3,FALSE),\"\")","v":""},{"$f":"IF(Score!B532>0,VLOOKUP(C533,Entrants!$A$2:$E$5000,2,FALSE),\"\")","v":""},{"$f":"IF(Score!B532>0,VLOOKUP(C533,Entrants!$A$2:$E$5000,4,FALSE),\"\")","v":""},{"$f":"IF(Score!C532>0,Score!C532,\"\")","v":""}]
[{"$f":"IF(Score!B533>0,Score!A533,\"\")","v":""},{"$f":"IF(Score!B533>0,IF(COUNTIF($E$3:E534,E534)>7,\"\",MAX($B$3:B533)+1),\"\")","v":""},{"$f":"IF(Score!B533>0,Score!B533,\"\")","v":""},{"$f":"IF(Score!B533>0,VLOOKUP(C534,Entrants!$A$2:$E$5000,3,FALSE),\"\")","v":""},{"$f":"IF(Score!B533>0,VLOOKUP(C534,Entrants!$A$2:$E$5000,2,FALSE),\"\")","v":""},{"$f":"IF(Score!B533>0,VLOOKUP(C534,Entrants!$A$2:$E$5000,4,FALSE),\"\")","v":""},{"$f":"IF(Score!C533>0,Score!C533,\"\")","v":""}]
[{"$f":"IF(Score!B534>0,Score!A534,\"\")","v":""},{"$f":"IF(Score!B534>0,IF(COUNTIF($E$3:E535,E535)>7,\"\",MAX($B$3:B534)+1),\"\")","v":""},{"$f":"IF(Score!B534>0,Score!B534,\"\")","v":""},{"$f":"IF(Score!B534>0,VLOOKUP(C535,Entrants!$A$2:$E$5000,3,FALSE),\"\")","v":""},{"$f":"IF(Score!B534>0,VLOOKUP(C535,Entrants!$A$2:$E$5000,2,FALSE),\"\")","v":""},{"$f":"IF(Score!B534>0,VLOOKUP(C535,Entrants!$A$2:$E$5000,4,FALSE),\"\")","v":""},{"$f":"IF(Score!C534>0,Score!C534,\"\")","v":""}]
[{"$f":"IF(Score!B535>0,Score!A535,\"\")","v":""},{"$f":"IF(Score!B535>0,IF(COUNTIF($E$3:E536,E536)>7,\"\",MAX($B$3:B535)+1),\"\")","v":""},{"$f":"IF(Score!B535>0,Score!B535,\"\")","v":""},{"$f":"IF(Score!B535>0,VLOOKUP(C536,Entrants!$A$2:$E$5000,3,FALSE),\"\")","v":""},{"$f":"IF(Score!B535>0,VLOOKUP(C536,Entrants!$A$2:$E$5000,2,FALSE),\"\")","v":""},{"$f":"IF(Score!B535>0,VLOOKUP(C536,Entrants!$A$2:$E$5000,4,FALSE),\"\")","v":""},{"$f":"IF(Score!C535>0,Score!C535,\"\")","v":""}]
[{"$f":"IF(Score!B536>0,Score!A536,\"\")","v":""},{"$f":"IF(Score!B536>0,IF(COUNTIF($E$3:E537,E537)>7,\"\",MAX($B$3:B536)+1),\"\")","v":""},{"$f":"IF(Score!B536>0,Score!B536,\"\")","v":""},{"$f":"IF(Score!B536>0,VLOOKUP(C537,Entrants!$A$2:$E$5000,3,FALSE),\"\")","v":""},{"$f":"IF(Score!B536>0,VLOOKUP(C537,Entrants!$A$2:$E$5000,2,FALSE),\"\")","v":""},{"$f":"IF(Score!B536>0,VLOOKUP(C537,Entrants!$A$2:$E$5000,4,FALSE),\"\")","v":""},{"$f":"IF(Score!C536>0,Score!C536,\"\")","v":""}]
[{"$f":"IF(Score!B537>0,Score!A537,\"\")","v":""},{"$f":"IF(Score!B537>0,IF(COUNTIF($E$3:E538,E538)>7,\"\",MAX($B$3:B537)+1),\"\")","v":""},{"$f":"IF(Score!B537>0,Score!B537,\"\")","v":""},{"$f":"IF(Score!B537>0,VLOOKUP(C538,Entrants!$A$2:$E$5000,3,FALSE),\"\")","v":""},{"$f":"IF(Score!B537>0,VLOOKUP(C538,Entrants!$A$2:$E$5000,2,FALSE),\"\")","v":""},{"$f":"IF(Score!B537>0,VLOOKUP(C538,Entrants!$A$2:$E$5000,4,FALSE),\"\")","v":""},{"$f":"IF(Score!C537>0,Score!C537,\"\")","v":""}]
[{"$f":"IF(Score!B538>0,Score!A538,\"\")","v":""},{"$f":"IF(Score!B538>0,IF(COUNTIF($E$3:E539,E539)>7,\"\",MAX($B$3:B538)+1),\"\")","v":""},{"$f":"IF(Score!B538>0,Score!B538,\"\")","v":""},{"$f":"IF(Score!B538>0,VLOOKUP(C539,Entrants!$A$2:$E$5000,3,FALSE),\"\")","v":""},{"$f":"IF(Score!B538>0,VLOOKUP(C539,Entrants!$A$2:$E$5000,2,FALSE),\"\")","v":""},{"$f":"IF(Score!B538>0,VLOOKUP(C539,Entrants!$A$2:$E$5000,4,FALSE),\"\")","v":""},{"$f":"IF(Score!C538>0,Score!C538,\"\")","v":""}]
[{"$f":"IF(Score!B539>0,Score!A539,\"\")","v":""},{"$f":"IF(Score!B539>0,IF(COUNTIF($E$3:E540,E540)>7,\"\",MAX($B$3:B539)+1),\"\")","v":""},{"$f":"IF(Score!B539>0,Score!B539,\"\")","v":""},{"$f":"IF(Score!B539>0,VLOOKUP(C540,Entrants!$A$2:$E$5000,3,FALSE),\"\")","v":""},{"$f":"IF(Score!B539>0,VLOOKUP(C540,Entrants!$A$2:$E$5000,2,FALSE),\"\")","v":""},{"$f":"IF(Score!B539>0,VLOOKUP(C540,Entrants!$A$2:$E$5000,4,FALSE),\"\")","v":""},{"$f":"IF(Score!C539>0,Score!C539,\"\")","v":""}]
[{"$f":"IF(Score!B540>0,Score!A540,\"\")","v":""},{"$f":"IF(Score!B540>0,IF(COUNTIF($E$3:E541,E541)>7,\"\",MAX($B$3:B540)+1),\"\")","v":""},{"$f":"IF(Score!B540>0,Score!B540,\"\")","v":""},{"$f":"IF(Score!B540>0,VLOOKUP(C541,Entrants!$A$2:$E$5000,3,FALSE),\"\")","v":""},{"$f":"IF(Score!B540>0,VLOOKUP(C541,Entrants!$A$2:$E$5000,2,FALSE),\"\")","v":""},{"$f":"IF(Score!B540>0,VLOOKUP(C541,Entrants!$A$2:$E$5000,4,FALSE),\"\")","v":""},{"$f":"IF(Score!C540>0,Score!C540,\"\")","v":""}]
[{"$f":"IF(Score!B541>0,Score!A541,\"\")","v":""},{"$f":"IF(Score!B541>0,IF(COUNTIF($E$3:E542,E542)>7,\"\",MAX($B$3:B541)+1),\"\")","v":""},{"$f":"IF(Score!B541>0,Score!B541,\"\")","v":""},{"$f":"IF(Score!B541>0,VLOOKUP(C542,Entrants!$A$2:$E$5000,3,FALSE),\"\")","v":""},{"$f":"IF(Score!B541>0,VLOOKUP(C542,Entrants!$A$2:$E$5000,2,FALSE),\"\")","v":""},{"$f":"IF(Score!B541>0,VLOOKUP(C542,Entrants!$A$2:$E$5000,4,FALSE),\"\")","v":""},{"$f":"IF(Score!C541>0,Score!C541,\"\")","v":""}]
[{"$f":"IF(Score!B542>0,Score!A542,\"\")","v":""},{"$f":"IF(Score!B542>0,IF(COUNTIF($E$3:E543,E543)>7,\"\",MAX($B$3:B542)+1),\"\")","v":""},{"$f":"IF(Score!B542>0,Score!B542,\"\")","v":""},{"$f":"IF(Score!B542>0,VLOOKUP(C543,Entrants!$A$2:$E$5000,3,FALSE),\"\")","v":""},{"$f":"IF(Score!B542>0,VLOOKUP(C543,Entrants!$A$2:$E$5000,2,FALSE),\"\")","v":""},{"$f":"IF(Score!B542>0,VLOOKUP(C543,Entrants!$A$2:$E$5000,4,FALSE),\"\")","v":""},{"$f":"IF(Score!C542>0,Score!C542,\"\")","v":""}]
[{"$f":"IF(Score!B543>0,Score!A543,\"\")","v":""},{"$f":"IF(Score!B543>0,IF(COUNTIF($E$3:E544,E544)>7,\"\",MAX($B$3:B543)+1),\"\")","v":""},{"$f":"IF(Score!B543>0,Score!B543,\"\")","v":""},{"$f":"IF(Score!B543>0,VLOOKUP(C544,Entrants!$A$2:$E$5000,3,FALSE),\"\")","v":""},{"$f":"IF(Score!B543>0,VLOOKUP(C544,Entrants!$A$2:$E$5000,2,FALSE),\"\")","v":""},{"$f":"IF(Score!B543>0,VLOOKUP(C544,Entrants!$A$2:$E$5000,4,FALSE),\"\")","v":""},{"$f":"IF(Score!C543>0,Score!C543,\"\")","v":""}]
[{"$f":"IF(Score!B544>0,Score!A544,\"\")","v":""},{"$f":"IF(Score!B544>0,IF(COUNTIF($E$3:E545,E545)>7,\"\",MAX($B$3:B544)+1),\"\")","v":""},{"$f":"IF(Score!B544>0,Score!B544,\"\")","v":""},{"$f":"IF(Score!B544>0,VLOOKUP(C545,Entrants!$A$2:$E$5000,3,FALSE),\"\")","v":""},{"$f":"IF(Score!B544>0,VLOOKUP(C545,Entrants!$A$2:$E$5000,2,FALSE),\"\")","v":""},{"$f":"IF(Score!B544>0,VLOOKUP(C545,Entrants!$A$2:$E$5000,4,FALSE),\"\")","v":""},{"$f":"IF(Score!C544>0,Score!C544,\"\")","v":""}]
[{"$f":"IF(Score!B545>0,Score!A545,\"\")","v":""},{"$f":"IF(Score!B545>0,IF(COUNTIF($E$3:E546,E546)>7,\"\",MAX($B$3:B545)+1),\"\")","v":""},{"$f":"IF(Score!B545>0,Score!B545,\"\")","v":""},{"$f":"IF(Score!B545>0,VLOOKUP(C546,Entrants!$A$2:$E$5000,3,FALSE),\"\")","v":""},{"$f":"IF(Score!B545>0,VLOOKUP(C546,Entrants!$A$2:$E$5000,2,FALSE),\"\")","v":""},{"$f":"IF(Score!B545>0,VLOOKUP(C546,Entrants!$A$2:$E$5000,4,FALSE),\"\")","v":""},{"$f":"IF(Score!C545>0,Score!C545,\"\")","v":""}]
[{"$f":"IF(Score!B546>0,Score!A546,\"\")","v":""},{"$f":"IF(Score!B546>0,IF(COUNTIF($E$3:E547,E547)>7,\"\",MAX($B$3:B546)+1),\"\")","v":""},{"$f":"IF(Score!B546>0,Score!B546,\"\")","v":""},{"$f":"IF(Score!B546>0,VLOOKUP(C547,Entrants!$A$2:$E$5000,3,FALSE),\"\")","v":""},{"$f":"IF(Score!B546>0,VLOOKUP(C547,Entrants!$A$2:$E$5000,2,FALSE),\"\")","v":""},{"$f":"IF(Score!B546>0,VLOOKUP(C547,Entrants!$A$2:$E$5000,4,FALSE),\"\")","v":""},{"$f":"IF(Score!C546>0,Score!C546,\"\")","v":""}]
[{"$f":"IF(Score!B547>0,Score!A547,\"\")","v":""},{"$f":"IF(Score!B547>0,IF(COUNTIF($E$3:E548,E548)>7,\"\",MAX($B$3:B547)+1),\"\")","v":""},{"$f":"IF(Score!B547>0,Score!B547,\"\")","v":""},{"$f":"IF(Score!B547>0,VLOOKUP(C548,Entrants!$A$2:$E$5000,3,FALSE),\"\")","v":""},{"$f":"IF(Score!B547>0,VLOOKUP(C548,Entrants!$A$2:$E$5000,2,FALSE),\"\")","v":""},{"$f":"IF(Score!B547>0,VLOOKUP(C548,Entrants!$A$2:$E$5000,4,FALSE),\"\")","v":""},{"$f":"IF(Score!C547>0,Score!C547,\"\")","v":""}]
[{"$f":"IF(Score!B548>0,Score!A548,\"\")","v":""},{"$f":"IF(Score!B548>0,IF(COUNTIF($E$3:E549,E549)>7,\"\",MAX($B$3:B548)+1),\"\")","v":""},{"$f":"IF(Score!B548>0,Score!B548,\"\")","v":""},{"$f":"IF(Score!B548>0,VLOOKUP(C549,Entrants!$A$2:$E$5000,3,FALSE),\"\")","v":""},{"$f":"IF(Score!B548>0,VLOOKUP(C549,Entrants!$A$2:$E$5000,2,FALSE),\"\")","v":""},{"$f":"IF(Score!B548>0,VLOOKUP(C549,Entrants!$A$2:$E$5000,4,FALSE),\"\")","v":""},{"$f":"IF(Score!C548>0,Score!C548,\"\")","v":""}]
[{"$f":"IF(Score!B549>0,Score!A549,\"\")","v":""},{"$f":"IF(Score!B549>0,IF(COUNTIF($E$3:E550,E550)>7,\"\",MAX($B$3:B549)+1),\"\")","v":""},{"$f":"IF(Score!B549>0,Score!B549,\"\")","v":""},{"$f":"IF(Score!B549>0,VLOOKUP(C550,Entrants!$A$2:$E$5000,3,FALSE),\"\")","v":""},{"$f":"IF(Score!B549>0,VLOOKUP(C550,Entrants!$A$2:$E$5000,2,FALSE),\"\")","v":""},{"$f":"IF(Score!B549>0,VLOOKUP(C550,Entrants!$A$2:$E$5000,4,FALSE),\"\")","v":""},{"$f":"IF(Score!C549>0,Score!C549,\"\")","v":""}]
[{"$f":"IF(Score!B550>0,Score!A550,\"\")","v":""},{"$f":"IF(Score!B550>0,IF(COUNTIF($E$3:E551,E551)>7,\"\",MAX($B$3:B550)+1),\"\")","v":""},{"$f":"IF(Score!B550>0,Score!B550,\"\")","v":""},{"$f":"IF(Score!B550>0,VLOOKUP(C551,Entrants!$A$2:$E$5000,3,FALSE),\"\")","v":""},{"$f":"IF(Score!B550>0,VLOOKUP(C551,Entrants!$A$2:$E$5000,2,FALSE),\"\")","v":""},{"$f":"IF(Score!B550>0,VLOOKUP(C551,Entrants!$A$2:$E$5000,4,FALSE),\"\")","v":""},{"$f":"IF(Score!C550>0,Score!C550,\"\")","v":""}]
[{"$f":"IF(Score!B551>0,Score!A551,\"\")","v":""},{"$f":"IF(Score!B551>0,IF(COUNTIF($E$3:E552,E552)>7,\"\",MAX($B$3:B551)+1),\"\")","v":""},{"$f":"IF(Score!B551>0,Score!B551,\"\")","v":""},{"$f":"IF(Score!B551>0,VLOOKUP(C552,Entrants!$A$2:$E$5000,3,FALSE),\"\")","v":""},{"$f":"IF(Score!B551>0,VLOOKUP(C552,Entrants!$A$2:$E$5000,2,FALSE),\"\")","v":""},{"$f":"IF(Score!B551>0,VLOOKUP(C552,Entrants!$A$2:$E$5000,4,FALSE),\"\")","v":""},{"$f":"IF(Score!C551>0,Score!C551,\"\")","v":""}]
[{"$f":"IF(Score!B552>0,Score!A552,\"\")","v":""},{"$f":"IF(Score!B552>0,IF(COUNTIF($E$3:E553,E553)>7,\"\",MAX($B$3:B552)+1),\"\")","v":""},{"$f":"IF(Score!B552>0,Score!B552,\"\")","v":""},{"$f":"IF(Score!B552>0,VLOOKUP(C553,Entrants!$A$2:$E$5000,3,FALSE),\"\")","v":""},{"$f":"IF(Score!B552>0,VLOOKUP(C553,Entrants!$A$2:$E$5000,2,FALSE),\"\")","v":""},{"$f":"IF(Score!B552>0,VLOOKUP(C553,Entrants!$A$2:$E$5000,4,FALSE),\"\")","v":""},{"$f":"IF(Score!C552>0,Score!C552,\"\")","v":""}]
[{"$f":"IF(Score!B553>0,Score!A553,\"\")","v":""},{"$f":"IF(Score!B553>0,IF(COUNTIF($E$3:E554,E554)>7,\"\",MAX($B$3:B553)+1),\"\")","v":""},{"$f":"IF(Score!B553>0,Score!B553,\"\")","v":""},{"$f":"IF(Score!B553>0,VLOOKUP(C554,Entrants!$A$2:$E$5000,3,FALSE),\"\")","v":""},{"$f":"IF(Score!B553>0,VLOOKUP(C554,Entrants!$A$2:$E$5000,2,FALSE),\"\")","v":""},{"$f":"IF(Score!B553>0,VLOOKUP(C554,Entrants!$A$2:$E$5000,4,FALSE),\"\")","v":""},{"$f":"IF(Score!C553>0,Score!C553,\"\")","v":""}]
[{"$f":"IF(Score!B554>0,Score!A554,\"\")","v":""},{"$f":"IF(Score!B554>0,IF(COUNTIF($E$3:E555,E555)>7,\"\",MAX($B$3:B554)+1),\"\")","v":""},{"$f":"IF(Score!B554>0,Score!B554,\"\")","v":""},{"$f":"IF(Score!B554>0,VLOOKUP(C555,Entrants!$A$2:$E$5000,3,FALSE),\"\")","v":""},{"$f":"IF(Score!B554>0,VLOOKUP(C555,Entrants!$A$2:$E$5000,2,FALSE),\"\")","v":""},{"$f":"IF(Score!B554>0,VLOOKUP(C555,Entrants!$A$2:$E$5000,4,FALSE),\"\")","v":""},{"$f":"IF(Score!C554>0,Score!C554,\"\")","v":""}]
[{"$f":"IF(Score!B555>0,Score!A555,\"\")","v":""},{"$f":"IF(Score!B555>0,IF(COUNTIF($E$3:E556,E556)>7,\"\",MAX($B$3:B555)+1),\"\")","v":""},{"$f":"IF(Score!B555>0,Score!B555,\"\")","v":""},{"$f":"IF(Score!B555>0,VLOOKUP(C556,Entrants!$A$2:$E$5000,3,FALSE),\"\")","v":""},{"$f":"IF(Score!B555>0,VLOOKUP(C556,Entrants!$A$2:$E$5000,2,FALSE),\"\")","v":""},{"$f":"IF(Score!B555>0,VLOOKUP(C556,Entrants!$A$2:$E$5000,4,FALSE),\"\")","v":""},{"$f":"IF(Score!C555>0,Score!C555,\"\")","v":""}]
[{"$f":"IF(Score!B556>0,Score!A556,\"\")","v":""},{"$f":"IF(Score!B556>0,IF(COUNTIF($E$3:E557,E557)>7,\"\",MAX($B$3:B556)+1),\"\")","v":""},{"$f":"IF(Score!B556>0,Score!B556,\"\")","v":""},{"$f":"IF(Score!B556>0,VLOOKUP(C557,Entrants!$A$2:$E$5000,3,FALSE),\"\")","v":""},{"$f":"IF(Score!B556>0,VLOOKUP(C557,Entrants!$A$2:$E$5000,2,FALSE),\"\")","v":""},{"$f":"IF(Score!B556>0,VLOOKUP(C557,Entrants!$A$2:$E$5000,4,FALSE),\"\")","v":""},{"$f":"IF(Score!C556>0,Score!C556,\"\")","v":""}]
[{"$f":"IF(Score!B557>0,Score!A557,\"\")","v":""},{"$f":"IF(Score!B557>0,IF(COUNTIF($E$3:E558,E558)>7,\"\",MAX($B$3:B557)+1),\"\")","v":""},{"$f":"IF(Score!B557>0,Score!B557,\"\")","v":""},{"$f":"IF(Score!B557>0,VLOOKUP(C558,Entrants!$A$2:$E$5000,3,FALSE),\"\")","v":""},{"$f":"IF(Score!B557>0,VLOOKUP(C558,Entrants!$A$2:$E$5000,2,FALSE),\"\")","v":""},{"$f":"IF(Score!B557>0,VLOOKUP(C558,Entrants!$A$2:$E$5000,4,FALSE),\"\")","v":""},{"$f":"IF(Score!C557>0,Score!C557,\"\")","v":""}]
[{"$f":"IF(Score!B558>0,Score!A558,\"\")","v":""},{"$f":"IF(Score!B558>0,IF(COUNTIF($E$3:E559,E559)>7,\"\",MAX($B$3:B558)+1),\"\")","v":""},{"$f":"IF(Score!B558>0,Score!B558,\"\")","v":""},{"$f":"IF(Score!B558>0,VLOOKUP(C559,Entrants!$A$2:$E$5000,3,FALSE),\"\")","v":""},{"$f":"IF(Score!B558>0,VLOOKUP(C559,Entrants!$A$2:$E$5000,2,FALSE),\"\")","v":""},{"$f":"IF(Score!B558>0,VLOOKUP(C559,Entrants!$A$2:$E$5000,4,FALSE),\"\")","v":""},{"$f":"IF(Score!C558>0,Score!C558,\"\")","v":""}]
[{"$f":"IF(Score!B559>0,Score!A559,\"\")","v":""},{"$f":"IF(Score!B559>0,IF(COUNTIF($E$3:E560,E560)>7,\"\",MAX($B$3:B559)+1),\"\")","v":""},{"$f":"IF(Score!B559>0,Score!B559,\"\")","v":""},{"$f":"IF(Score!B559>0,VLOOKUP(C560,Entrants!$A$2:$E$5000,3,FALSE),\"\")","v":""},{"$f":"IF(Score!B559>0,VLOOKUP(C560,Entrants!$A$2:$E$5000,2,FALSE),\"\")","v":""},{"$f":"IF(Score!B559>0,VLOOKUP(C560,Entrants!$A$2:$E$5000,4,FALSE),\"\")","v":""},{"$f":"IF(Score!C559>0,Score!C559,\"\")","v":""}]
[{"$f":"IF(Score!B560>0,Score!A560,\"\")","v":""},{"$f":"IF(Score!B560>0,IF(COUNTIF($E$3:E561,E561)>7,\"\",MAX($B$3:B560)+1),\"\")","v":""},{"$f":"IF(Score!B560>0,Score!B560,\"\")","v":""},{"$f":"IF(Score!B560>0,VLOOKUP(C561,Entrants!$A$2:$E$5000,3,FALSE),\"\")","v":""},{"$f":"IF(Score!B560>0,VLOOKUP(C561,Entrants!$A$2:$E$5000,2,FALSE),\"\")","v":""},{"$f":"IF(Score!B560>0,VLOOKUP(C561,Entrants!$A$2:$E$5000,4,FALSE),\"\")","v":""},{"$f":"IF(Score!C560>0,Score!C560,\"\")","v":""}]
[{"$f":"IF(Score!B561>0,Score!A561,\"\")","v":""},{"$f":"IF(Score!B561>0,IF(COUNTIF($E$3:E562,E562)>7,\"\",MAX($B$3:B561)+1),\"\")","v":""},{"$f":"IF(Score!B561>0,Score!B561,\"\")","v":""},{"$f":"IF(Score!B561>0,VLOOKUP(C562,Entrants!$A$2:$E$5000,3,FALSE),\"\")","v":""},{"$f":"IF(Score!B561>0,VLOOKUP(C562,Entrants!$A$2:$E$5000,2,FALSE),\"\")","v":""},{"$f":"IF(Score!B561>0,VLOOKUP(C562,Entrants!$A$2:$E$5000,4,FALSE),\"\")","v":""},{"$f":"IF(Score!C561>0,Score!C561,\"\")","v":""}]
[{"$f":"IF(Score!B562>0,Score!A562,\"\")","v":""},{"$f":"IF(Score!B562>0,IF(COUNTIF($E$3:E563,E563)>7,\"\",MAX($B$3:B562)+1),\"\")","v":""},{"$f":"IF(Score!B562>0,Score!B562,\"\")","v":""},{"$f":"IF(Score!B562>0,VLOOKUP(C563,Entrants!$A$2:$E$5000,3,FALSE),\"\")","v":""},{"$f":"IF(Score!B562>0,VLOOKUP(C563,Entrants!$A$2:$E$5000,2,FALSE),\"\")","v":""},{"$f":"IF(Score!B562>0,VLOOKUP(C563,Entrants!$A$2:$E$5000,4,FALSE),\"\")","v":""},{"$f":"IF(Score!C562>0,Score!C562,\"\")","v":""}]
[{"$f":"IF(Score!B563>0,Score!A563,\"\")","v":""},{"$f":"IF(Score!B563>0,IF(COUNTIF($E$3:E564,E564)>7,\"\",MAX($B$3:B563)+1),\"\")","v":""},{"$f":"IF(Score!B563>0,Score!B563,\"\")","v":""},{"$f":"IF(Score!B563>0,VLOOKUP(C564,Entrants!$A$2:$E$5000,3,FALSE),\"\")","v":""},{"$f":"IF(Score!B563>0,VLOOKUP(C564,Entrants!$A$2:$E$5000,2,FALSE),\"\")","v":""},{"$f":"IF(Score!B563>0,VLOOKUP(C564,Entrants!$A$2:$E$5000,4,FALSE),\"\")","v":""},{"$f":"IF(Score!C563>0,Score!C563,\"\")","v":""}]
[{"$f":"IF(Score!B564>0,Score!A564,\"\")","v":""},{"$f":"IF(Score!B564>0,IF(COUNTIF($E$3:E565,E565)>7,\"\",MAX($B$3:B564)+1),\"\")","v":""},{"$f":"IF(Score!B564>0,Score!B564,\"\")","v":""},{"$f":"IF(Score!B564>0,VLOOKUP(C565,Entrants!$A$2:$E$5000,3,FALSE),\"\")","v":""},{"$f":"IF(Score!B564>0,VLOOKUP(C565,Entrants!$A$2:$E$5000,2,FALSE),\"\")","v":""},{"$f":"IF(Score!B564>0,VLOOKUP(C565,Entrants!$A$2:$E$5000,4,FALSE),\"\")","v":""},{"$f":"IF(Score!C564>0,Score!C564,\"\")","v":""}]
[{"$f":"IF(Score!B565>0,Score!A565,\"\")","v":""},{"$f":"IF(Score!B565>0,IF(COUNTIF($E$3:E566,E566)>7,\"\",MAX($B$3:B565)+1),\"\")","v":""},{"$f":"IF(Score!B565>0,Score!B565,\"\")","v":""},{"$f":"IF(Score!B565>0,VLOOKUP(C566,Entrants!$A$2:$E$5000,3,FALSE),\"\")","v":""},{"$f":"IF(Score!B565>0,VLOOKUP(C566,Entrants!$A$2:$E$5000,2,FALSE),\"\")","v":""},{"$f":"IF(Score!B565>0,VLOOKUP(C566,Entrants!$A$2:$E$5000,4,FALSE),\"\")","v":""},{"$f":"IF(Score!C565>0,Score!C565,\"\")","v":""}]
[{"$f":"IF(Score!B566>0,Score!A566,\"\")","v":""},{"$f":"IF(Score!B566>0,IF(COUNTIF($E$3:E567,E567)>7,\"\",MAX($B$3:B566)+1),\"\")","v":""},{"$f":"IF(Score!B566>0,Score!B566,\"\")","v":""},{"$f":"IF(Score!B566>0,VLOOKUP(C567,Entrants!$A$2:$E$5000,3,FALSE),\"\")","v":""},{"$f":"IF(Score!B566>0,VLOOKUP(C567,Entrants!$A$2:$E$5000,2,FALSE),\"\")","v":""},{"$f":"IF(Score!B566>0,VLOOKUP(C567,Entrants!$A$2:$E$5000,4,FALSE),\"\")","v":""},{"$f":"IF(Score!C566>0,Score!C566,\"\")","v":""}]
[{"$f":"IF(Score!B567>0,Score!A567,\"\")","v":""},{"$f":"IF(Score!B567>0,IF(COUNTIF($E$3:E568,E568)>7,\"\",MAX($B$3:B567)+1),\"\")","v":""},{"$f":"IF(Score!B567>0,Score!B567,\"\")","v":""},{"$f":"IF(Score!B567>0,VLOOKUP(C568,Entrants!$A$2:$E$5000,3,FALSE),\"\")","v":""},{"$f":"IF(Score!B567>0,VLOOKUP(C568,Entrants!$A$2:$E$5000,2,FALSE),\"\")","v":""},{"$f":"IF(Score!B567>0,VLOOKUP(C568,Entrants!$A$2:$E$5000,4,FALSE),\"\")","v":""},{"$f":"IF(Score!C567>0,Score!C567,\"\")","v":""}]
[{"$f":"IF(Score!B568>0,Score!A568,\"\")","v":""},{"$f":"IF(Score!B568>0,IF(COUNTIF($E$3:E569,E569)>7,\"\",MAX($B$3:B568)+1),\"\")","v":""},{"$f":"IF(Score!B568>0,Score!B568,\"\")","v":""},{"$f":"IF(Score!B568>0,VLOOKUP(C569,Entrants!$A$2:$E$5000,3,FALSE),\"\")","v":""},{"$f":"IF(Score!B568>0,VLOOKUP(C569,Entrants!$A$2:$E$5000,2,FALSE),\"\")","v":""},{"$f":"IF(Score!B568>0,VLOOKUP(C569,Entrants!$A$2:$E$5000,4,FALSE),\"\")","v":""},{"$f":"IF(Score!C568>0,Score!C568,\"\")","v":""}]
[{"$f":"IF(Score!B569>0,Score!A569,\"\")","v":""},{"$f":"IF(Score!B569>0,IF(COUNTIF($E$3:E570,E570)>7,\"\",MAX($B$3:B569)+1),\"\")","v":""},{"$f":"IF(Score!B569>0,Score!B569,\"\")","v":""},{"$f":"IF(Score!B569>0,VLOOKUP(C570,Entrants!$A$2:$E$5000,3,FALSE),\"\")","v":""},{"$f":"IF(Score!B569>0,VLOOKUP(C570,Entrants!$A$2:$E$5000,2,FALSE),\"\")","v":""},{"$f":"IF(Score!B569>0,VLOOKUP(C570,Entrants!$A$2:$E$5000,4,FALSE),\"\")","v":""},{"$f":"IF(Score!C569>0,Score!C569,\"\")","v":""}]
[{"$f":"IF(Score!B570>0,Score!A570,\"\")","v":""},{"$f":"IF(Score!B570>0,IF(COUNTIF($E$3:E571,E571)>7,\"\",MAX($B$3:B570)+1),\"\")","v":""},{"$f":"IF(Score!B570>0,Score!B570,\"\")","v":""},{"$f":"IF(Score!B570>0,VLOOKUP(C571,Entrants!$A$2:$E$5000,3,FALSE),\"\")","v":""},{"$f":"IF(Score!B570>0,VLOOKUP(C571,Entrants!$A$2:$E$5000,2,FALSE),\"\")","v":""},{"$f":"IF(Score!B570>0,VLOOKUP(C571,Entrants!$A$2:$E$5000,4,FALSE),\"\")","v":""},{"$f":"IF(Score!C570>0,Score!C570,\"\")","v":""}]
[{"$f":"IF(Score!B571>0,Score!A571,\"\")","v":""},{"$f":"IF(Score!B571>0,IF(COUNTIF($E$3:E572,E572)>7,\"\",MAX($B$3:B571)+1),\"\")","v":""},{"$f":"IF(Score!B571>0,Score!B571,\"\")","v":""},{"$f":"IF(Score!B571>0,VLOOKUP(C572,Entrants!$A$2:$E$5000,3,FALSE),\"\")","v":""},{"$f":"IF(Score!B571>0,VLOOKUP(C572,Entrants!$A$2:$E$5000,2,FALSE),\"\")","v":""},{"$f":"IF(Score!B571>0,VLOOKUP(C572,Entrants!$A$2:$E$5000,4,FALSE),\"\")","v":""},{"$f":"IF(Score!C571>0,Score!C571,\"\")","v":""}]
[{"$f":"IF(Score!B572>0,Score!A572,\"\")","v":""},{"$f":"IF(Score!B572>0,IF(COUNTIF($E$3:E573,E573)>7,\"\",MAX($B$3:B572)+1),\"\")","v":""},{"$f":"IF(Score!B572>0,Score!B572,\"\")","v":""},{"$f":"IF(Score!B572>0,VLOOKUP(C573,Entrants!$A$2:$E$5000,3,FALSE),\"\")","v":""},{"$f":"IF(Score!B572>0,VLOOKUP(C573,Entrants!$A$2:$E$5000,2,FALSE),\"\")","v":""},{"$f":"IF(Score!B572>0,VLOOKUP(C573,Entrants!$A$2:$E$5000,4,FALSE),\"\")","v":""},{"$f":"IF(Score!C572>0,Score!C572,\"\")","v":""}]
[{"$f":"IF(Score!B573>0,Score!A573,\"\")","v":""},{"$f":"IF(Score!B573>0,IF(COUNTIF($E$3:E574,E574)>7,\"\",MAX($B$3:B573)+1),\"\")","v":""},{"$f":"IF(Score!B573>0,Score!B573,\"\")","v":""},{"$f":"IF(Score!B573>0,VLOOKUP(C574,Entrants!$A$2:$E$5000,3,FALSE),\"\")","v":""},{"$f":"IF(Score!B573>0,VLOOKUP(C574,Entrants!$A$2:$E$5000,2,FALSE),\"\")","v":""},{"$f":"IF(Score!B573>0,VLOOKUP(C574,Entrants!$A$2:$E$5000,4,FALSE),\"\")","v":""},{"$f":"IF(Score!C573>0,Score!C573,\"\")","v":""}]
[{"$f":"IF(Score!B574>0,Score!A574,\"\")","v":""},{"$f":"IF(Score!B574>0,IF(COUNTIF($E$3:E575,E575)>7,\"\",MAX($B$3:B574)+1),\"\")","v":""},{"$f":"IF(Score!B574>0,Score!B574,\"\")","v":""},{"$f":"IF(Score!B574>0,VLOOKUP(C575,Entrants!$A$2:$E$5000,3,FALSE),\"\")","v":""},{"$f":"IF(Score!B574>0,VLOOKUP(C575,Entrants!$A$2:$E$5000,2,FALSE),\"\")","v":""},{"$f":"IF(Score!B574>0,VLOOKUP(C575,Entrants!$A$2:$E$5000,4,FALSE),\"\")","v":""},{"$f":"IF(Score!C574>0,Score!C574,\"\")","v":""}]
[{"$f":"IF(Score!B575>0,Score!A575,\"\")","v":""},{"$f":"IF(Score!B575>0,IF(COUNTIF($E$3:E576,E576)>7,\"\",MAX($B$3:B575)+1),\"\")","v":""},{"$f":"IF(Score!B575>0,Score!B575,\"\")","v":""},{"$f":"IF(Score!B575>0,VLOOKUP(C576,Entrants!$A$2:$E$5000,3,FALSE),\"\")","v":""},{"$f":"IF(Score!B575>0,VLOOKUP(C576,Entrants!$A$2:$E$5000,2,FALSE),\"\")","v":""},{"$f":"IF(Score!B575>0,VLOOKUP(C576,Entrants!$A$2:$E$5000,4,FALSE),\"\")","v":""},{"$f":"IF(Score!C575>0,Score!C575,\"\")","v":""}]
[{"$f":"IF(Score!B576>0,Score!A576,\"\")","v":""},{"$f":"IF(Score!B576>0,IF(COUNTIF($E$3:E577,E577)>7,\"\",MAX($B$3:B576)+1),\"\")","v":""},{"$f":"IF(Score!B576>0,Score!B576,\"\")","v":""},{"$f":"IF(Score!B576>0,VLOOKUP(C577,Entrants!$A$2:$E$5000,3,FALSE),\"\")","v":""},{"$f":"IF(Score!B576>0,VLOOKUP(C577,Entrants!$A$2:$E$5000,2,FALSE),\"\")","v":""},{"$f":"IF(Score!B576>0,VLOOKUP(C577,Entrants!$A$2:$E$5000,4,FALSE),\"\")","v":""},{"$f":"IF(Score!C576>0,Score!C576,\"\")","v":""}]
[{"$f":"IF(Score!B577>0,Score!A577,\"\")","v":""},{"$f":"IF(Score!B577>0,IF(COUNTIF($E$3:E578,E578)>7,\"\",MAX($B$3:B577)+1),\"\")","v":""},{"$f":"IF(Score!B577>0,Score!B577,\"\")","v":""},{"$f":"IF(Score!B577>0,VLOOKUP(C578,Entrants!$A$2:$E$5000,3,FALSE),\"\")","v":""},{"$f":"IF(Score!B577>0,VLOOKUP(C578,Entrants!$A$2:$E$5000,2,FALSE),\"\")","v":""},{"$f":"IF(Score!B577>0,VLOOKUP(C578,Entrants!$A$2:$E$5000,4,FALSE),\"\")","v":""},{"$f":"IF(Score!C577>0,Score!C577,\"\")","v":""}]
[{"$f":"IF(Score!B578>0,Score!A578,\"\")","v":""},{"$f":"IF(Score!B578>0,IF(COUNTIF($E$3:E579,E579)>7,\"\",MAX($B$3:B578)+1),\"\")","v":""},{"$f":"IF(Score!B578>0,Score!B578,\"\")","v":""},{"$f":"IF(Score!B578>0,VLOOKUP(C579,Entrants!$A$2:$E$5000,3,FALSE),\"\")","v":""},{"$f":"IF(Score!B578>0,VLOOKUP(C579,Entrants!$A$2:$E$5000,2,FALSE),\"\")","v":""},{"$f":"IF(Score!B578>0,VLOOKUP(C579,Entrants!$A$2:$E$5000,4,FALSE),\"\")","v":""},{"$f":"IF(Score!C578>0,Score!C578,\"\")","v":""}]
[{"$f":"IF(Score!B579>0,Score!A579,\"\")","v":""},{"$f":"IF(Score!B579>0,IF(COUNTIF($E$3:E580,E580)>7,\"\",MAX($B$3:B579)+1),\"\")","v":""},{"$f":"IF(Score!B579>0,Score!B579,\"\")","v":""},{"$f":"IF(Score!B579>0,VLOOKUP(C580,Entrants!$A$2:$E$5000,3,FALSE),\"\")","v":""},{"$f":"IF(Score!B579>0,VLOOKUP(C580,Entrants!$A$2:$E$5000,2,FALSE),\"\")","v":""},{"$f":"IF(Score!B579>0,VLOOKUP(C580,Entrants!$A$2:$E$5000,4,FALSE),\"\")","v":""},{"$f":"IF(Score!C579>0,Score!C579,\"\")","v":""}]
[{"$f":"IF(Score!B580>0,Score!A580,\"\")","v":""},{"$f":"IF(Score!B580>0,IF(COUNTIF($E$3:E581,E581)>7,\"\",MAX($B$3:B580)+1),\"\")","v":""},{"$f":"IF(Score!B580>0,Score!B580,\"\")","v":""},{"$f":"IF(Score!B580>0,VLOOKUP(C581,Entrants!$A$2:$E$5000,3,FALSE),\"\")","v":""},{"$f":"IF(Score!B580>0,VLOOKUP(C581,Entrants!$A$2:$E$5000,2,FALSE),\"\")","v":""},{"$f":"IF(Score!B580>0,VLOOKUP(C581,Entrants!$A$2:$E$5000,4,FALSE),\"\")","v":""},{"$f":"IF(Score!C580>0,Score!C580,\"\")","v":""}]
[{"$f":"IF(Score!B581>0,Score!A581,\"\")","v":""},{"$f":"IF(Score!B581>0,IF(COUNTIF($E$3:E582,E582)>7,\"\",MAX($B$3:B581)+1),\"\")","v":""},{"$f":"IF(Score!B581>0,Score!B581,\"\")","v":""},{"$f":"IF(Score!B581>0,VLOOKUP(C582,Entrants!$A$2:$E$5000,3,FALSE),\"\")","v":""},{"$f":"IF(Score!B581>0,VLOOKUP(C582,Entrants!$A$2:$E$5000,2,FALSE),\"\")","v":""},{"$f":"IF(Score!B581>0,VLOOKUP(C582,Entrants!$A$2:$E$5000,4,FALSE),\"\")","v":""},{"$f":"IF(Score!C581>0,Score!C581,\"\")","v":""}]
[{"$f":"IF(Score!B582>0,Score!A582,\"\")","v":""},{"$f":"IF(Score!B582>0,IF(COUNTIF($E$3:E583,E583)>7,\"\",MAX($B$3:B582)+1),\"\")","v":""},{"$f":"IF(Score!B582>0,Score!B582,\"\")","v":""},{"$f":"IF(Score!B582>0,VLOOKUP(C583,Entrants!$A$2:$E$5000,3,FALSE),\"\")","v":""},{"$f":"IF(Score!B582>0,VLOOKUP(C583,Entrants!$A$2:$E$5000,2,FALSE),\"\")","v":""},{"$f":"IF(Score!B582>0,VLOOKUP(C583,Entrants!$A$2:$E$5000,4,FALSE),\"\")","v":""},{"$f":"IF(Score!C582>0,Score!C582,\"\")","v":""}]
[{"$f":"IF(Score!B583>0,Score!A583,\"\")","v":""},{"$f":"IF(Score!B583>0,IF(COUNTIF($E$3:E584,E584)>7,\"\",MAX($B$3:B583)+1),\"\")","v":""},{"$f":"IF(Score!B583>0,Score!B583,\"\")","v":""},{"$f":"IF(Score!B583>0,VLOOKUP(C584,Entrants!$A$2:$E$5000,3,FALSE),\"\")","v":""},{"$f":"IF(Score!B583>0,VLOOKUP(C584,Entrants!$A$2:$E$5000,2,FALSE),\"\")","v":""},{"$f":"IF(Score!B583>0,VLOOKUP(C584,Entrants!$A$2:$E$5000,4,FALSE),\"\")","v":""},{"$f":"IF(Score!C583>0,Score!C583,\"\")","v":""}]
[{"$f":"IF(Score!B584>0,Score!A584,\"\")","v":""},{"$f":"IF(Score!B584>0,IF(COUNTIF($E$3:E585,E585)>7,\"\",MAX($B$3:B584)+1),\"\")","v":""},{"$f":"IF(Score!B584>0,Score!B584,\"\")","v":""},{"$f":"IF(Score!B584>0,VLOOKUP(C585,Entrants!$A$2:$E$5000,3,FALSE),\"\")","v":""},{"$f":"IF(Score!B584>0,VLOOKUP(C585,Entrants!$A$2:$E$5000,2,FALSE),\"\")","v":""},{"$f":"IF(Score!B584>0,VLOOKUP(C585,Entrants!$A$2:$E$5000,4,FALSE),\"\")","v":""},{"$f":"IF(Score!C584>0,Score!C584,\"\")","v":""}]
[{"$f":"IF(Score!B585>0,Score!A585,\"\")","v":""},{"$f":"IF(Score!B585>0,IF(COUNTIF($E$3:E586,E586)>7,\"\",MAX($B$3:B585)+1),\"\")","v":""},{"$f":"IF(Score!B585>0,Score!B585,\"\")","v":""},{"$f":"IF(Score!B585>0,VLOOKUP(C586,Entrants!$A$2:$E$5000,3,FALSE),\"\")","v":""},{"$f":"IF(Score!B585>0,VLOOKUP(C586,Entrants!$A$2:$E$5000,2,FALSE),\"\")","v":""},{"$f":"IF(Score!B585>0,VLOOKUP(C586,Entrants!$A$2:$E$5000,4,FALSE),\"\")","v":""},{"$f":"IF(Score!C585>0,Score!C585,\"\")","v":""}]
[{"$f":"IF(Score!B586>0,Score!A586,\"\")","v":""},{"$f":"IF(Score!B586>0,IF(COUNTIF($E$3:E587,E587)>7,\"\",MAX($B$3:B586)+1),\"\")","v":""},{"$f":"IF(Score!B586>0,Score!B586,\"\")","v":""},{"$f":"IF(Score!B586>0,VLOOKUP(C587,Entrants!$A$2:$E$5000,3,FALSE),\"\")","v":""},{"$f":"IF(Score!B586>0,VLOOKUP(C587,Entrants!$A$2:$E$5000,2,FALSE),\"\")","v":""},{"$f":"IF(Score!B586>0,VLOOKUP(C587,Entrants!$A$2:$E$5000,4,FALSE),\"\")","v":""},{"$f":"IF(Score!C586>0,Score!C586,\"\")","v":""}]
[{"$f":"IF(Score!B587>0,Score!A587,\"\")","v":""},{"$f":"IF(Score!B587>0,IF(COUNTIF($E$3:E588,E588)>7,\"\",MAX($B$3:B587)+1),\"\")","v":""},{"$f":"IF(Score!B587>0,Score!B587,\"\")","v":""},{"$f":"IF(Score!B587>0,VLOOKUP(C588,Entrants!$A$2:$E$5000,3,FALSE),\"\")","v":""},{"$f":"IF(Score!B587>0,VLOOKUP(C588,Entrants!$A$2:$E$5000,2,FALSE),\"\")","v":""},{"$f":"IF(Score!B587>0,VLOOKUP(C588,Entrants!$A$2:$E$5000,4,FALSE),\"\")","v":""},{"$f":"IF(Score!C587>0,Score!C587,\"\")","v":""}]
[{"$f":"IF(Score!B588>0,Score!A588,\"\")","v":""},{"$f":"IF(Score!B588>0,IF(COUNTIF($E$3:E589,E589)>7,\"\",MAX($B$3:B588)+1),\"\")","v":""},{"$f":"IF(Score!B588>0,Score!B588,\"\")","v":""},{"$f":"IF(Score!B588>0,VLOOKUP(C589,Entrants!$A$2:$E$5000,3,FALSE),\"\")","v":""},{"$f":"IF(Score!B588>0,VLOOKUP(C589,Entrants!$A$2:$E$5000,2,FALSE),\"\")","v":""},{"$f":"IF(Score!B588>0,VLOOKUP(C589,Entrants!$A$2:$E$5000,4,FALSE),\"\")","v":""},{"$f":"IF(Score!C588>0,Score!C588,\"\")","v":""}]
[{"$f":"IF(Score!B589>0,Score!A589,\"\")","v":""},{"$f":"IF(Score!B589>0,IF(COUNTIF($E$3:E590,E590)>7,\"\",MAX($B$3:B589)+1),\"\")","v":""},{"$f":"IF(Score!B589>0,Score!B589,\"\")","v":""},{"$f":"IF(Score!B589>0,VLOOKUP(C590,Entrants!$A$2:$E$5000,3,FALSE),\"\")","v":""},{"$f":"IF(Score!B589>0,VLOOKUP(C590,Entrants!$A$2:$E$5000,2,FALSE),\"\")","v":""},{"$f":"IF(Score!B589>0,VLOOKUP(C590,Entrants!$A$2:$E$5000,4,FALSE),\"\")","v":""},{"$f":"IF(Score!C589>0,Score!C589,\"\")","v":""}]
[{"$f":"IF(Score!B590>0,Score!A590,\"\")","v":""},{"$f":"IF(Score!B590>0,IF(COUNTIF($E$3:E591,E591)>7,\"\",MAX($B$3:B590)+1),\"\")","v":""},{"$f":"IF(Score!B590>0,Score!B590,\"\")","v":""},{"$f":"IF(Score!B590>0,VLOOKUP(C591,Entrants!$A$2:$E$5000,3,FALSE),\"\")","v":""},{"$f":"IF(Score!B590>0,VLOOKUP(C591,Entrants!$A$2:$E$5000,2,FALSE),\"\")","v":""},{"$f":"IF(Score!B590>0,VLOOKUP(C591,Entrants!$A$2:$E$5000,4,FALSE),\"\")","v":""},{"$f":"IF(Score!C590>0,Score!C590,\"\")","v":""}]
[{"$f":"IF(Score!B591>0,Score!A591,\"\")","v":""},{"$f":"IF(Score!B591>0,IF(COUNTIF($E$3:E592,E592)>7,\"\",MAX($B$3:B591)+1),\"\")","v":""},{"$f":"IF(Score!B591>0,Score!B591,\"\")","v":""},{"$f":"IF(Score!B591>0,VLOOKUP(C592,Entrants!$A$2:$E$5000,3,FALSE),\"\")","v":""},{"$f":"IF(Score!B591>0,VLOOKUP(C592,Entrants!$A$2:$E$5000,2,FALSE),\"\")","v":""},{"$f":"IF(Score!B591>0,VLOOKUP(C592,Entrants!$A$2:$E$5000,4,FALSE),\"\")","v":""},{"$f":"IF(Score!C591>0,Score!C591,\"\")","v":""}]
[{"$f":"IF(Score!B592>0,Score!A592,\"\")","v":""},{"$f":"IF(Score!B592>0,IF(COUNTIF($E$3:E593,E593)>7,\"\",MAX($B$3:B592)+1),\"\")","v":""},{"$f":"IF(Score!B592>0,Score!B592,\"\")","v":""},{"$f":"IF(Score!B592>0,VLOOKUP(C593,Entrants!$A$2:$E$5000,3,FALSE),\"\")","v":""},{"$f":"IF(Score!B592>0,VLOOKUP(C593,Entrants!$A$2:$E$5000,2,FALSE),\"\")","v":""},{"$f":"IF(Score!B592>0,VLOOKUP(C593,Entrants!$A$2:$E$5000,4,FALSE),\"\")","v":""},{"$f":"IF(Score!C592>0,Score!C592,\"\")","v":""}]
[{"$f":"IF(Score!B593>0,Score!A593,\"\")","v":""},{"$f":"IF(Score!B593>0,IF(COUNTIF($E$3:E594,E594)>7,\"\",MAX($B$3:B593)+1),\"\")","v":""},{"$f":"IF(Score!B593>0,Score!B593,\"\")","v":""},{"$f":"IF(Score!B593>0,VLOOKUP(C594,Entrants!$A$2:$E$5000,3,FALSE),\"\")","v":""},{"$f":"IF(Score!B593>0,VLOOKUP(C594,Entrants!$A$2:$E$5000,2,FALSE),\"\")","v":""},{"$f":"IF(Score!B593>0,VLOOKUP(C594,Entrants!$A$2:$E$5000,4,FALSE),\"\")","v":""},{"$f":"IF(Score!C593>0,Score!C593,\"\")","v":""}]
[{"$f":"IF(Score!B594>0,Score!A594,\"\")","v":""},{"$f":"IF(Score!B594>0,IF(COUNTIF($E$3:E595,E595)>7,\"\",MAX($B$3:B594)+1),\"\")","v":""},{"$f":"IF(Score!B594>0,Score!B594,\"\")","v":""},{"$f":"IF(Score!B594>0,VLOOKUP(C595,Entrants!$A$2:$E$5000,3,FALSE),\"\")","v":""},{"$f":"IF(Score!B594>0,VLOOKUP(C595,Entrants!$A$2:$E$5000,2,FALSE),\"\")","v":""},{"$f":"IF(Score!B594>0,VLOOKUP(C595,Entrants!$A$2:$E$5000,4,FALSE),\"\")","v":""},{"$f":"IF(Score!C594>0,Score!C594,\"\")","v":""}]
[{"$f":"IF(Score!B595>0,Score!A595,\"\")","v":""},{"$f":"IF(Score!B595>0,IF(COUNTIF($E$3:E596,E596)>7,\"\",MAX($B$3:B595)+1),\"\")","v":""},{"$f":"IF(Score!B595>0,Score!B595,\"\")","v":""},{"$f":"IF(Score!B595>0,VLOOKUP(C596,Entrants!$A$2:$E$5000,3,FALSE),\"\")","v":""},{"$f":"IF(Score!B595>0,VLOOKUP(C596,Entrants!$A$2:$E$5000,2,FALSE),\"\")","v":""},{"$f":"IF(Score!B595>0,VLOOKUP(C596,Entrants!$A$2:$E$5000,4,FALSE),\"\")","v":""},{"$f":"IF(Score!C595>0,Score!C595,\"\")","v":""}]
[{"$f":"IF(Score!B596>0,Score!A596,\"\")","v":""},{"$f":"IF(Score!B596>0,IF(COUNTIF($E$3:E597,E597)>7,\"\",MAX($B$3:B596)+1),\"\")","v":""},{"$f":"IF(Score!B596>0,Score!B596,\"\")","v":""},{"$f":"IF(Score!B596>0,VLOOKUP(C597,Entrants!$A$2:$E$5000,3,FALSE),\"\")","v":""},{"$f":"IF(Score!B596>0,VLOOKUP(C597,Entrants!$A$2:$E$5000,2,FALSE),\"\")","v":""},{"$f":"IF(Score!B596>0,VLOOKUP(C597,Entrants!$A$2:$E$5000,4,FALSE),\"\")","v":""},{"$f":"IF(Score!C596>0,Score!C596,\"\")","v":""}]
[{"$f":"IF(Score!B597>0,Score!A597,\"\")","v":""},{"$f":"IF(Score!B597>0,IF(COUNTIF($E$3:E598,E598)>7,\"\",MAX($B$3:B597)+1),\"\")","v":""},{"$f":"IF(Score!B597>0,Score!B597,\"\")","v":""},{"$f":"IF(Score!B597>0,VLOOKUP(C598,Entrants!$A$2:$E$5000,3,FALSE),\"\")","v":""},{"$f":"IF(Score!B597>0,VLOOKUP(C598,Entrants!$A$2:$E$5000,2,FALSE),\"\")","v":""},{"$f":"IF(Score!B597>0,VLOOKUP(C598,Entrants!$A$2:$E$5000,4,FALSE),\"\")","v":""},{"$f":"IF(Score!C597>0,Score!C597,\"\")","v":""}]
[{"$f":"IF(Score!B598>0,Score!A598,\"\")","v":""},{"$f":"IF(Score!B598>0,IF(COUNTIF($E$3:E599,E599)>7,\"\",MAX($B$3:B598)+1),\"\")","v":""},{"$f":"IF(Score!B598>0,Score!B598,\"\")","v":""},{"$f":"IF(Score!B598>0,VLOOKUP(C599,Entrants!$A$2:$E$5000,3,FALSE),\"\")","v":""},{"$f":"IF(Score!B598>0,VLOOKUP(C599,Entrants!$A$2:$E$5000,2,FALSE),\"\")","v":""},{"$f":"IF(Score!B598>0,VLOOKUP(C599,Entrants!$A$2:$E$5000,4,FALSE),\"\")","v":""},{"$f":"IF(Score!C598>0,Score!C598,\"\")","v":""}]
[{"$f":"IF(Score!B599>0,Score!A599,\"\")","v":""},{"$f":"IF(Score!B599>0,IF(COUNTIF($E$3:E600,E600)>7,\"\",MAX($B$3:B599)+1),\"\")","v":""},{"$f":"IF(Score!B599>0,Score!B599,\"\")","v":""},{"$f":"IF(Score!B599>0,VLOOKUP(C600,Entrants!$A$2:$E$5000,3,FALSE),\"\")","v":""},{"$f":"IF(Score!B599>0,VLOOKUP(C600,Entrants!$A$2:$E$5000,2,FALSE),\"\")","v":""},{"$f":"IF(Score!B599>0,VLOOKUP(C600,Entrants!$A$2:$E$5000,4,FALSE),\"\")","v":""},{"$f":"IF(Score!C599>0,Score!C599,\"\")","v":""}]
[{"$f":"IF(Score!B600>0,Score!A600,\"\")","v":""},{"$f":"IF(Score!B600>0,IF(COUNTIF($E$3:E601,E601)>7,\"\",MAX($B$3:B600)+1),\"\")","v":""},{"$f":"IF(Score!B600>0,Score!B600,\"\")","v":""},{"$f":"IF(Score!B600>0,VLOOKUP(C601,Entrants!$A$2:$E$5000,3,FALSE),\"\")","v":""},{"$f":"IF(Score!B600>0,VLOOKUP(C601,Entrants!$A$2:$E$5000,2,FALSE),\"\")","v":""},{"$f":"IF(Score!B600>0,VLOOKUP(C601,Entrants!$A$2:$E$5000,4,FALSE),\"\")","v":""},{"$f":"IF(Score!C600>0,Score!C600,\"\")","v":""}]
[{"$f":"IF(Score!B601>0,Score!A601,\"\")","v":""},{"$f":"IF(Score!B601>0,IF(COUNTIF($E$3:E602,E602)>7,\"\",MAX($B$3:B601)+1),\"\")","v":""},{"$f":"IF(Score!B601>0,Score!B601,\"\")","v":""},{"$f":"IF(Score!B601>0,VLOOKUP(C602,Entrants!$A$2:$E$5000,3,FALSE),\"\")","v":""},{"$f":"IF(Score!B601>0,VLOOKUP(C602,Entrants!$A$2:$E$5000,2,FALSE),\"\")","v":""},{"$f":"IF(Score!B601>0,VLOOKUP(C602,Entrants!$A$2:$E$5000,4,FALSE),\"\")","v":""},{"$f":"IF(Score!C601>0,Score!C601,\"\")","v":""}]
[{"$f":"IF(Score!B602>0,Score!A602,\"\")","v":""},{"$f":"IF(Score!B602>0,IF(COUNTIF($E$3:E603,E603)>7,\"\",MAX($B$3:B602)+1),\"\")","v":""},{"$f":"IF(Score!B602>0,Score!B602,\"\")","v":""},{"$f":"IF(Score!B602>0,VLOOKUP(C603,Entrants!$A$2:$E$5000,3,FALSE),\"\")","v":""},{"$f":"IF(Score!B602>0,VLOOKUP(C603,Entrants!$A$2:$E$5000,2,FALSE),\"\")","v":""},{"$f":"IF(Score!B602>0,VLOOKUP(C603,Entrants!$A$2:$E$5000,4,FALSE),\"\")","v":""},{"$f":"IF(Score!C602>0,Score!C602,\"\")","v":""}]
[{"$f":"IF(Score!B603>0,Score!A603,\"\")","v":""},{"$f":"IF(Score!B603>0,IF(COUNTIF($E$3:E604,E604)>7,\"\",MAX($B$3:B603)+1),\"\")","v":""},{"$f":"IF(Score!B603>0,Score!B603,\"\")","v":""},{"$f":"IF(Score!B603>0,VLOOKUP(C604,Entrants!$A$2:$E$5000,3,FALSE),\"\")","v":""},{"$f":"IF(Score!B603>0,VLOOKUP(C604,Entrants!$A$2:$E$5000,2,FALSE),\"\")","v":""},{"$f":"IF(Score!B603>0,VLOOKUP(C604,Entrants!$A$2:$E$5000,4,FALSE),\"\")","v":""},{"$f":"IF(Score!C603>0,Score!C603,\"\")","v":""}]
[{"$f":"IF(Score!B604>0,Score!A604,\"\")","v":""},{"$f":"IF(Score!B604>0,IF(COUNTIF($E$3:E605,E605)>7,\"\",MAX($B$3:B604)+1),\"\")","v":""},{"$f":"IF(Score!B604>0,Score!B604,\"\")","v":""},{"$f":"IF(Score!B604>0,VLOOKUP(C605,Entrants!$A$2:$E$5000,3,FALSE),\"\")","v":""},{"$f":"IF(Score!B604>0,VLOOKUP(C605,Entrants!$A$2:$E$5000,2,FALSE),\"\")","v":""},{"$f":"IF(Score!B604>0,VLOOKUP(C605,Entrants!$A$2:$E$5000,4,FALSE),\"\")","v":""},{"$f":"IF(Score!C604>0,Score!C604,\"\")","v":""}]
[{"$f":"IF(Score!B605>0,Score!A605,\"\")","v":""},{"$f":"IF(Score!B605>0,IF(COUNTIF($E$3:E606,E606)>7,\"\",MAX($B$3:B605)+1),\"\")","v":""},{"$f":"IF(Score!B605>0,Score!B605,\"\")","v":""},{"$f":"IF(Score!B605>0,VLOOKUP(C606,Entrants!$A$2:$E$5000,3,FALSE),\"\")","v":""},{"$f":"IF(Score!B605>0,VLOOKUP(C606,Entrants!$A$2:$E$5000,2,FALSE),\"\")","v":""},{"$f":"IF(Score!B605>0,VLOOKUP(C606,Entrants!$A$2:$E$5000,4,FALSE),\"\")","v":""},{"$f":"IF(Score!C605>0,Score!C605,\"\")","v":""}]
[{"$f":"IF(Score!B606>0,Score!A606,\"\")","v":""},{"$f":"IF(Score!B606>0,IF(COUNTIF($E$3:E607,E607)>7,\"\",MAX($B$3:B606)+1),\"\")","v":""},{"$f":"IF(Score!B606>0,Score!B606,\"\")","v":""},{"$f":"IF(Score!B606>0,VLOOKUP(C607,Entrants!$A$2:$E$5000,3,FALSE),\"\")","v":""},{"$f":"IF(Score!B606>0,VLOOKUP(C607,Entrants!$A$2:$E$5000,2,FALSE),\"\")","v":""},{"$f":"IF(Score!B606>0,VLOOKUP(C607,Entrants!$A$2:$E$5000,4,FALSE),\"\")","v":""},{"$f":"IF(Score!C606>0,Score!C606,\"\")","v":""}]
[{"$f":"IF(Score!B607>0,Score!A607,\"\")","v":""},{"$f":"IF(Score!B607>0,IF(COUNTIF($E$3:E608,E608)>7,\"\",MAX($B$3:B607)+1),\"\")","v":""},{"$f":"IF(Score!B607>0,Score!B607,\"\")","v":""},{"$f":"IF(Score!B607>0,VLOOKUP(C608,Entrants!$A$2:$E$5000,3,FALSE),\"\")","v":""},{"$f":"IF(Score!B607>0,VLOOKUP(C608,Entrants!$A$2:$E$5000,2,FALSE),\"\")","v":""},{"$f":"IF(Score!B607>0,VLOOKUP(C608,Entrants!$A$2:$E$5000,4,FALSE),\"\")","v":""},{"$f":"IF(Score!C607>0,Score!C607,\"\")","v":""}]
[{"$f":"IF(Score!B608>0,Score!A608,\"\")","v":""},{"$f":"IF(Score!B608>0,IF(COUNTIF($E$3:E609,E609)>7,\"\",MAX($B$3:B608)+1),\"\")","v":""},{"$f":"IF(Score!B608>0,Score!B608,\"\")","v":""},{"$f":"IF(Score!B608>0,VLOOKUP(C609,Entrants!$A$2:$E$5000,3,FALSE),\"\")","v":""},{"$f":"IF(Score!B608>0,VLOOKUP(C609,Entrants!$A$2:$E$5000,2,FALSE),\"\")","v":""},{"$f":"IF(Score!B608>0,VLOOKUP(C609,Entrants!$A$2:$E$5000,4,FALSE),\"\")","v":""},{"$f":"IF(Score!C608>0,Score!C608,\"\")","v":""}]
[{"$f":"IF(Score!B609>0,Score!A609,\"\")","v":""},{"$f":"IF(Score!B609>0,IF(COUNTIF($E$3:E610,E610)>7,\"\",MAX($B$3:B609)+1),\"\")","v":""},{"$f":"IF(Score!B609>0,Score!B609,\"\")","v":""},{"$f":"IF(Score!B609>0,VLOOKUP(C610,Entrants!$A$2:$E$5000,3,FALSE),\"\")","v":""},{"$f":"IF(Score!B609>0,VLOOKUP(C610,Entrants!$A$2:$E$5000,2,FALSE),\"\")","v":""},{"$f":"IF(Score!B609>0,VLOOKUP(C610,Entrants!$A$2:$E$5000,4,FALSE),\"\")","v":""},{"$f":"IF(Score!C609>0,Score!C609,\"\")","v":""}]
[{"$f":"IF(Score!B610>0,Score!A610,\"\")","v":""},{"$f":"IF(Score!B610>0,IF(COUNTIF($E$3:E611,E611)>7,\"\",MAX($B$3:B610)+1),\"\")","v":""},{"$f":"IF(Score!B610>0,Score!B610,\"\")","v":""},{"$f":"IF(Score!B610>0,VLOOKUP(C611,Entrants!$A$2:$E$5000,3,FALSE),\"\")","v":""},{"$f":"IF(Score!B610>0,VLOOKUP(C611,Entrants!$A$2:$E$5000,2,FALSE),\"\")","v":""},{"$f":"IF(Score!B610>0,VLOOKUP(C611,Entrants!$A$2:$E$5000,4,FALSE),\"\")","v":""},{"$f":"IF(Score!C610>0,Score!C610,\"\")","v":""}]
[{"$f":"IF(Score!B611>0,Score!A611,\"\")","v":""},{"$f":"IF(Score!B611>0,IF(COUNTIF($E$3:E612,E612)>7,\"\",MAX($B$3:B611)+1),\"\")","v":""},{"$f":"IF(Score!B611>0,Score!B611,\"\")","v":""},{"$f":"IF(Score!B611>0,VLOOKUP(C612,Entrants!$A$2:$E$5000,3,FALSE),\"\")","v":""},{"$f":"IF(Score!B611>0,VLOOKUP(C612,Entrants!$A$2:$E$5000,2,FALSE),\"\")","v":""},{"$f":"IF(Score!B611>0,VLOOKUP(C612,Entrants!$A$2:$E$5000,4,FALSE),\"\")","v":""},{"$f":"IF(Score!C611>0,Score!C611,\"\")","v":""}]
[{"$f":"IF(Score!B612>0,Score!A612,\"\")","v":""},{"$f":"IF(Score!B612>0,IF(COUNTIF($E$3:E613,E613)>7,\"\",MAX($B$3:B612)+1),\"\")","v":""},{"$f":"IF(Score!B612>0,Score!B612,\"\")","v":""},{"$f":"IF(Score!B612>0,VLOOKUP(C613,Entrants!$A$2:$E$5000,3,FALSE),\"\")","v":""},{"$f":"IF(Score!B612>0,VLOOKUP(C613,Entrants!$A$2:$E$5000,2,FALSE),\"\")","v":""},{"$f":"IF(Score!B612>0,VLOOKUP(C613,Entrants!$A$2:$E$5000,4,FALSE),\"\")","v":""},{"$f":"IF(Score!C612>0,Score!C612,\"\")","v":""}]
[{"$f":"IF(Score!B613>0,Score!A613,\"\")","v":""},{"$f":"IF(Score!B613>0,IF(COUNTIF($E$3:E614,E614)>7,\"\",MAX($B$3:B613)+1),\"\")","v":""},{"$f":"IF(Score!B613>0,Score!B613,\"\")","v":""},{"$f":"IF(Score!B613>0,VLOOKUP(C614,Entrants!$A$2:$E$5000,3,FALSE),\"\")","v":""},{"$f":"IF(Score!B613>0,VLOOKUP(C614,Entrants!$A$2:$E$5000,2,FALSE),\"\")","v":""},{"$f":"IF(Score!B613>0,VLOOKUP(C614,Entrants!$A$2:$E$5000,4,FALSE),\"\")","v":""},{"$f":"IF(Score!C613>0,Score!C613,\"\")","v":""}]
[{"$f":"IF(Score!B614>0,Score!A614,\"\")","v":""},{"$f":"IF(Score!B614>0,IF(COUNTIF($E$3:E615,E615)>7,\"\",MAX($B$3:B614)+1),\"\")","v":""},{"$f":"IF(Score!B614>0,Score!B614,\"\")","v":""},{"$f":"IF(Score!B614>0,VLOOKUP(C615,Entrants!$A$2:$E$5000,3,FALSE),\"\")","v":""},{"$f":"IF(Score!B614>0,VLOOKUP(C615,Entrants!$A$2:$E$5000,2,FALSE),\"\")","v":""},{"$f":"IF(Score!B614>0,VLOOKUP(C615,Entrants!$A$2:$E$5000,4,FALSE),\"\")","v":""},{"$f":"IF(Score!C614>0,Score!C614,\"\")","v":""}]
[{"$f":"IF(Score!B615>0,Score!A615,\"\")","v":""},{"$f":"IF(Score!B615>0,IF(COUNTIF($E$3:E616,E616)>7,\"\",MAX($B$3:B615)+1),\"\")","v":""},{"$f":"IF(Score!B615>0,Score!B615,\"\")","v":""},{"$f":"IF(Score!B615>0,VLOOKUP(C616,Entrants!$A$2:$E$5000,3,FALSE),\"\")","v":""},{"$f":"IF(Score!B615>0,VLOOKUP(C616,Entrants!$A$2:$E$5000,2,FALSE),\"\")","v":""},{"$f":"IF(Score!B615>0,VLOOKUP(C616,Entrants!$A$2:$E$5000,4,FALSE),\"\")","v":""},{"$f":"IF(Score!C615>0,Score!C615,\"\")","v":""}]
[{"$f":"IF(Score!B616>0,Score!A616,\"\")","v":""},{"$f":"IF(Score!B616>0,IF(COUNTIF($E$3:E617,E617)>7,\"\",MAX($B$3:B616)+1),\"\")","v":""},{"$f":"IF(Score!B616>0,Score!B616,\"\")","v":""},{"$f":"IF(Score!B616>0,VLOOKUP(C617,Entrants!$A$2:$E$5000,3,FALSE),\"\")","v":""},{"$f":"IF(Score!B616>0,VLOOKUP(C617,Entrants!$A$2:$E$5000,2,FALSE),\"\")","v":""},{"$f":"IF(Score!B616>0,VLOOKUP(C617,Entrants!$A$2:$E$5000,4,FALSE),\"\")","v":""},{"$f":"IF(Score!C616>0,Score!C616,\"\")","v":""}]
[{"$f":"IF(Score!B617>0,Score!A617,\"\")","v":""},{"$f":"IF(Score!B617>0,IF(COUNTIF($E$3:E618,E618)>7,\"\",MAX($B$3:B617)+1),\"\")","v":""},{"$f":"IF(Score!B617>0,Score!B617,\"\")","v":""},{"$f":"IF(Score!B617>0,VLOOKUP(C618,Entrants!$A$2:$E$5000,3,FALSE),\"\")","v":""},{"$f":"IF(Score!B617>0,VLOOKUP(C618,Entrants!$A$2:$E$5000,2,FALSE),\"\")","v":""},{"$f":"IF(Score!B617>0,VLOOKUP(C618,Entrants!$A$2:$E$5000,4,FALSE),\"\")","v":""},{"$f":"IF(Score!C617>0,Score!C617,\"\")","v":""}]
[{"$f":"IF(Score!B618>0,Score!A618,\"\")","v":""},{"$f":"IF(Score!B618>0,IF(COUNTIF($E$3:E619,E619)>7,\"\",MAX($B$3:B618)+1),\"\")","v":""},{"$f":"IF(Score!B618>0,Score!B618,\"\")","v":""},{"$f":"IF(Score!B618>0,VLOOKUP(C619,Entrants!$A$2:$E$5000,3,FALSE),\"\")","v":""},{"$f":"IF(Score!B618>0,VLOOKUP(C619,Entrants!$A$2:$E$5000,2,FALSE),\"\")","v":""},{"$f":"IF(Score!B618>0,VLOOKUP(C619,Entrants!$A$2:$E$5000,4,FALSE),\"\")","v":""},{"$f":"IF(Score!C618>0,Score!C618,\"\")","v":""}]
[{"$f":"IF(Score!B619>0,Score!A619,\"\")","v":""},{"$f":"IF(Score!B619>0,IF(COUNTIF($E$3:E620,E620)>7,\"\",MAX($B$3:B619)+1),\"\")","v":""},{"$f":"IF(Score!B619>0,Score!B619,\"\")","v":""},{"$f":"IF(Score!B619>0,VLOOKUP(C620,Entrants!$A$2:$E$5000,3,FALSE),\"\")","v":""},{"$f":"IF(Score!B619>0,VLOOKUP(C620,Entrants!$A$2:$E$5000,2,FALSE),\"\")","v":""},{"$f":"IF(Score!B619>0,VLOOKUP(C620,Entrants!$A$2:$E$5000,4,FALSE),\"\")","v":""},{"$f":"IF(Score!C619>0,Score!C619,\"\")","v":""}]
[{"$f":"IF(Score!B620>0,Score!A620,\"\")","v":""},{"$f":"IF(Score!B620>0,IF(COUNTIF($E$3:E621,E621)>7,\"\",MAX($B$3:B620)+1),\"\")","v":""},{"$f":"IF(Score!B620>0,Score!B620,\"\")","v":""},{"$f":"IF(Score!B620>0,VLOOKUP(C621,Entrants!$A$2:$E$5000,3,FALSE),\"\")","v":""},{"$f":"IF(Score!B620>0,VLOOKUP(C621,Entrants!$A$2:$E$5000,2,FALSE),\"\")","v":""},{"$f":"IF(Score!B620>0,VLOOKUP(C621,Entrants!$A$2:$E$5000,4,FALSE),\"\")","v":""},{"$f":"IF(Score!C620>0,Score!C620,\"\")","v":""}]
[{"$f":"IF(Score!B621>0,Score!A621,\"\")","v":""},{"$f":"IF(Score!B621>0,IF(COUNTIF($E$3:E622,E622)>7,\"\",MAX($B$3:B621)+1),\"\")","v":""},{"$f":"IF(Score!B621>0,Score!B621,\"\")","v":""},{"$f":"IF(Score!B621>0,VLOOKUP(C622,Entrants!$A$2:$E$5000,3,FALSE),\"\")","v":""},{"$f":"IF(Score!B621>0,VLOOKUP(C622,Entrants!$A$2:$E$5000,2,FALSE),\"\")","v":""},{"$f":"IF(Score!B621>0,VLOOKUP(C622,Entrants!$A$2:$E$5000,4,FALSE),\"\")","v":""},{"$f":"IF(Score!C621>0,Score!C621,\"\")","v":""}]
[{"$f":"IF(Score!B622>0,Score!A622,\"\")","v":""},{"$f":"IF(Score!B622>0,IF(COUNTIF($E$3:E623,E623)>7,\"\",MAX($B$3:B622)+1),\"\")","v":""},{"$f":"IF(Score!B622>0,Score!B622,\"\")","v":""},{"$f":"IF(Score!B622>0,VLOOKUP(C623,Entrants!$A$2:$E$5000,3,FALSE),\"\")","v":""},{"$f":"IF(Score!B622>0,VLOOKUP(C623,Entrants!$A$2:$E$5000,2,FALSE),\"\")","v":""},{"$f":"IF(Score!B622>0,VLOOKUP(C623,Entrants!$A$2:$E$5000,4,FALSE),\"\")","v":""},{"$f":"IF(Score!C622>0,Score!C622,\"\")","v":""}]
[{"$f":"IF(Score!B623>0,Score!A623,\"\")","v":""},{"$f":"IF(Score!B623>0,IF(COUNTIF($E$3:E624,E624)>7,\"\",MAX($B$3:B623)+1),\"\")","v":""},{"$f":"IF(Score!B623>0,Score!B623,\"\")","v":""},{"$f":"IF(Score!B623>0,VLOOKUP(C624,Entrants!$A$2:$E$5000,3,FALSE),\"\")","v":""},{"$f":"IF(Score!B623>0,VLOOKUP(C624,Entrants!$A$2:$E$5000,2,FALSE),\"\")","v":""},{"$f":"IF(Score!B623>0,VLOOKUP(C624,Entrants!$A$2:$E$5000,4,FALSE),\"\")","v":""},{"$f":"IF(Score!C623>0,Score!C623,\"\")","v":""}]
[{"$f":"IF(Score!B624>0,Score!A624,\"\")","v":""},{"$f":"IF(Score!B624>0,IF(COUNTIF($E$3:E625,E625)>7,\"\",MAX($B$3:B624)+1),\"\")","v":""},{"$f":"IF(Score!B624>0,Score!B624,\"\")","v":""},{"$f":"IF(Score!B624>0,VLOOKUP(C625,Entrants!$A$2:$E$5000,3,FALSE),\"\")","v":""},{"$f":"IF(Score!B624>0,VLOOKUP(C625,Entrants!$A$2:$E$5000,2,FALSE),\"\")","v":""},{"$f":"IF(Score!B624>0,VLOOKUP(C625,Entrants!$A$2:$E$5000,4,FALSE),\"\")","v":""},{"$f":"IF(Score!C624>0,Score!C624,\"\")","v":""}]
[{"$f":"IF(Score!B625>0,Score!A625,\"\")","v":""},{"$f":"IF(Score!B625>0,IF(COUNTIF($E$3:E626,E626)>7,\"\",MAX($B$3:B625)+1),\"\")","v":""},{"$f":"IF(Score!B625>0,Score!B625,\"\")","v":""},{"$f":"IF(Score!B625>0,VLOOKUP(C626,Entrants!$A$2:$E$5000,3,FALSE),\"\")","v":""},{"$f":"IF(Score!B625>0,VLOOKUP(C626,Entrants!$A$2:$E$5000,2,FALSE),\"\")","v":""},{"$f":"IF(Score!B625>0,VLOOKUP(C626,Entrants!$A$2:$E$5000,4,FALSE),\"\")","v":""},{"$f":"IF(Score!C625>0,Score!C625,\"\")","v":""}]
[{"$f":"IF(Score!B626>0,Score!A626,\"\")","v":""},{"$f":"IF(Score!B626>0,IF(COUNTIF($E$3:E627,E627)>7,\"\",MAX($B$3:B626)+1),\"\")","v":""},{"$f":"IF(Score!B626>0,Score!B626,\"\")","v":""},{"$f":"IF(Score!B626>0,VLOOKUP(C627,Entrants!$A$2:$E$5000,3,FALSE),\"\")","v":""},{"$f":"IF(Score!B626>0,VLOOKUP(C627,Entrants!$A$2:$E$5000,2,FALSE),\"\")","v":""},{"$f":"IF(Score!B626>0,VLOOKUP(C627,Entrants!$A$2:$E$5000,4,FALSE),\"\")","v":""},{"$f":"IF(Score!C626>0,Score!C626,\"\")","v":""}]
[{"$f":"IF(Score!B627>0,Score!A627,\"\")","v":""},{"$f":"IF(Score!B627>0,IF(COUNTIF($E$3:E628,E628)>7,\"\",MAX($B$3:B627)+1),\"\")","v":""},{"$f":"IF(Score!B627>0,Score!B627,\"\")","v":""},{"$f":"IF(Score!B627>0,VLOOKUP(C628,Entrants!$A$2:$E$5000,3,FALSE),\"\")","v":""},{"$f":"IF(Score!B627>0,VLOOKUP(C628,Entrants!$A$2:$E$5000,2,FALSE),\"\")","v":""},{"$f":"IF(Score!B627>0,VLOOKUP(C628,Entrants!$A$2:$E$5000,4,FALSE),\"\")","v":""},{"$f":"IF(Score!C627>0,Score!C627,\"\")","v":""}]
[{"$f":"IF(Score!B628>0,Score!A628,\"\")","v":""},{"$f":"IF(Score!B628>0,IF(COUNTIF($E$3:E629,E629)>7,\"\",MAX($B$3:B628)+1),\"\")","v":""},{"$f":"IF(Score!B628>0,Score!B628,\"\")","v":""},{"$f":"IF(Score!B628>0,VLOOKUP(C629,Entrants!$A$2:$E$5000,3,FALSE),\"\")","v":""},{"$f":"IF(Score!B628>0,VLOOKUP(C629,Entrants!$A$2:$E$5000,2,FALSE),\"\")","v":""},{"$f":"IF(Score!B628>0,VLOOKUP(C629,Entrants!$A$2:$E$5000,4,FALSE),\"\")","v":""},{"$f":"IF(Score!C628>0,Score!C628,\"\")","v":""}]
[{"$f":"IF(Score!B629>0,Score!A629,\"\")","v":""},{"$f":"IF(Score!B629>0,IF(COUNTIF($E$3:E630,E630)>7,\"\",MAX($B$3:B629)+1),\"\")","v":""},{"$f":"IF(Score!B629>0,Score!B629,\"\")","v":""},{"$f":"IF(Score!B629>0,VLOOKUP(C630,Entrants!$A$2:$E$5000,3,FALSE),\"\")","v":""},{"$f":"IF(Score!B629>0,VLOOKUP(C630,Entrants!$A$2:$E$5000,2,FALSE),\"\")","v":""},{"$f":"IF(Score!B629>0,VLOOKUP(C630,Entrants!$A$2:$E$5000,4,FALSE),\"\")","v":""},{"$f":"IF(Score!C629>0,Score!C629,\"\")","v":""}]
[{"$f":"IF(Score!B630>0,Score!A630,\"\")","v":""},{"$f":"IF(Score!B630>0,IF(COUNTIF($E$3:E631,E631)>7,\"\",MAX($B$3:B630)+1),\"\")","v":""},{"$f":"IF(Score!B630>0,Score!B630,\"\")","v":""},{"$f":"IF(Score!B630>0,VLOOKUP(C631,Entrants!$A$2:$E$5000,3,FALSE),\"\")","v":""},{"$f":"IF(Score!B630>0,VLOOKUP(C631,Entrants!$A$2:$E$5000,2,FALSE),\"\")","v":""},{"$f":"IF(Score!B630>0,VLOOKUP(C631,Entrants!$A$2:$E$5000,4,FALSE),\"\")","v":""},{"$f":"IF(Score!C630>0,Score!C630,\"\")","v":""}]
[{"$f":"IF(Score!B631>0,Score!A631,\"\")","v":""},{"$f":"IF(Score!B631>0,IF(COUNTIF($E$3:E632,E632)>7,\"\",MAX($B$3:B631)+1),\"\")","v":""},{"$f":"IF(Score!B631>0,Score!B631,\"\")","v":""},{"$f":"IF(Score!B631>0,VLOOKUP(C632,Entrants!$A$2:$E$5000,3,FALSE),\"\")","v":""},{"$f":"IF(Score!B631>0,VLOOKUP(C632,Entrants!$A$2:$E$5000,2,FALSE),\"\")","v":""},{"$f":"IF(Score!B631>0,VLOOKUP(C632,Entrants!$A$2:$E$5000,4,FALSE),\"\")","v":""},{"$f":"IF(Score!C631>0,Score!C631,\"\")","v":""}]
[{"$f":"IF(Score!B632>0,Score!A632,\"\")","v":""},{"$f":"IF(Score!B632>0,IF(COUNTIF($E$3:E633,E633)>7,\"\",MAX($B$3:B632)+1),\"\")","v":""},{"$f":"IF(Score!B632>0,Score!B632,\"\")","v":""},{"$f":"IF(Score!B632>0,VLOOKUP(C633,Entrants!$A$2:$E$5000,3,FALSE),\"\")","v":""},{"$f":"IF(Score!B632>0,VLOOKUP(C633,Entrants!$A$2:$E$5000,2,FALSE),\"\")","v":""},{"$f":"IF(Score!B632>0,VLOOKUP(C633,Entrants!$A$2:$E$5000,4,FALSE),\"\")","v":""},{"$f":"IF(Score!C632>0,Score!C632,\"\")","v":""}]
[{"$f":"IF(Score!B633>0,Score!A633,\"\")","v":""},{"$f":"IF(Score!B633>0,IF(COUNTIF($E$3:E634,E634)>7,\"\",MAX($B$3:B633)+1),\"\")","v":""},{"$f":"IF(Score!B633>0,Score!B633,\"\")","v":""},{"$f":"IF(Score!B633>0,VLOOKUP(C634,Entrants!$A$2:$E$5000,3,FALSE),\"\")","v":""},{"$f":"IF(Score!B633>0,VLOOKUP(C634,Entrants!$A$2:$E$5000,2,FALSE),\"\")","v":""},{"$f":"IF(Score!B633>0,VLOOKUP(C634,Entrants!$A$2:$E$5000,4,FALSE),\"\")","v":""},{"$f":"IF(Score!C633>0,Score!C633,\"\")","v":""}]
[{"$f":"IF(Score!B634>0,Score!A634,\"\")","v":""},{"$f":"IF(Score!B634>0,IF(COUNTIF($E$3:E635,E635)>7,\"\",MAX($B$3:B634)+1),\"\")","v":""},{"$f":"IF(Score!B634>0,Score!B634,\"\")","v":""},{"$f":"IF(Score!B634>0,VLOOKUP(C635,Entrants!$A$2:$E$5000,3,FALSE),\"\")","v":""},{"$f":"IF(Score!B634>0,VLOOKUP(C635,Entrants!$A$2:$E$5000,2,FALSE),\"\")","v":""},{"$f":"IF(Score!B634>0,VLOOKUP(C635,Entrants!$A$2:$E$5000,4,FALSE),\"\")","v":""},{"$f":"IF(Score!C634>0,Score!C634,\"\")","v":""}]
[{"$f":"IF(Score!B635>0,Score!A635,\"\")","v":""},{"$f":"IF(Score!B635>0,IF(COUNTIF($E$3:E636,E636)>7,\"\",MAX($B$3:B635)+1),\"\")","v":""},{"$f":"IF(Score!B635>0,Score!B635,\"\")","v":""},{"$f":"IF(Score!B635>0,VLOOKUP(C636,Entrants!$A$2:$E$5000,3,FALSE),\"\")","v":""},{"$f":"IF(Score!B635>0,VLOOKUP(C636,Entrants!$A$2:$E$5000,2,FALSE),\"\")","v":""},{"$f":"IF(Score!B635>0,VLOOKUP(C636,Entrants!$A$2:$E$5000,4,FALSE),\"\")","v":""},{"$f":"IF(Score!C635>0,Score!C635,\"\")","v":""}]
[{"$f":"IF(Score!B636>0,Score!A636,\"\")","v":""},{"$f":"IF(Score!B636>0,IF(COUNTIF($E$3:E637,E637)>7,\"\",MAX($B$3:B636)+1),\"\")","v":""},{"$f":"IF(Score!B636>0,Score!B636,\"\")","v":""},{"$f":"IF(Score!B636>0,VLOOKUP(C637,Entrants!$A$2:$E$5000,3,FALSE),\"\")","v":""},{"$f":"IF(Score!B636>0,VLOOKUP(C637,Entrants!$A$2:$E$5000,2,FALSE),\"\")","v":""},{"$f":"IF(Score!B636>0,VLOOKUP(C637,Entrants!$A$2:$E$5000,4,FALSE),\"\")","v":""},{"$f":"IF(Score!C636>0,Score!C636,\"\")","v":""}]
[{"$f":"IF(Score!B637>0,Score!A637,\"\")","v":""},{"$f":"IF(Score!B637>0,IF(COUNTIF($E$3:E638,E638)>7,\"\",MAX($B$3:B637)+1),\"\")","v":""},{"$f":"IF(Score!B637>0,Score!B637,\"\")","v":""},{"$f":"IF(Score!B637>0,VLOOKUP(C638,Entrants!$A$2:$E$5000,3,FALSE),\"\")","v":""},{"$f":"IF(Score!B637>0,VLOOKUP(C638,Entrants!$A$2:$E$5000,2,FALSE),\"\")","v":""},{"$f":"IF(Score!B637>0,VLOOKUP(C638,Entrants!$A$2:$E$5000,4,FALSE),\"\")","v":""},{"$f":"IF(Score!C637>0,Score!C637,\"\")","v":""}]
[{"$f":"IF(Score!B638>0,Score!A638,\"\")","v":""},{"$f":"IF(Score!B638>0,IF(COUNTIF($E$3:E639,E639)>7,\"\",MAX($B$3:B638)+1),\"\")","v":""},{"$f":"IF(Score!B638>0,Score!B638,\"\")","v":""},{"$f":"IF(Score!B638>0,VLOOKUP(C639,Entrants!$A$2:$E$5000,3,FALSE),\"\")","v":""},{"$f":"IF(Score!B638>0,VLOOKUP(C639,Entrants!$A$2:$E$5000,2,FALSE),\"\")","v":""},{"$f":"IF(Score!B638>0,VLOOKUP(C639,Entrants!$A$2:$E$5000,4,FALSE),\"\")","v":""},{"$f":"IF(Score!C638>0,Score!C638,\"\")","v":""}]
[{"$f":"IF(Score!B639>0,Score!A639,\"\")","v":""},{"$f":"IF(Score!B639>0,IF(COUNTIF($E$3:E640,E640)>7,\"\",MAX($B$3:B639)+1),\"\")","v":""},{"$f":"IF(Score!B639>0,Score!B639,\"\")","v":""},{"$f":"IF(Score!B639>0,VLOOKUP(C640,Entrants!$A$2:$E$5000,3,FALSE),\"\")","v":""},{"$f":"IF(Score!B639>0,VLOOKUP(C640,Entrants!$A$2:$E$5000,2,FALSE),\"\")","v":""},{"$f":"IF(Score!B639>0,VLOOKUP(C640,Entrants!$A$2:$E$5000,4,FALSE),\"\")","v":""},{"$f":"IF(Score!C639>0,Score!C639,\"\")","v":""}]
[{"$f":"IF(Score!B640>0,Score!A640,\"\")","v":""},{"$f":"IF(Score!B640>0,IF(COUNTIF($E$3:E641,E641)>7,\"\",MAX($B$3:B640)+1),\"\")","v":""},{"$f":"IF(Score!B640>0,Score!B640,\"\")","v":""},{"$f":"IF(Score!B640>0,VLOOKUP(C641,Entrants!$A$2:$E$5000,3,FALSE),\"\")","v":""},{"$f":"IF(Score!B640>0,VLOOKUP(C641,Entrants!$A$2:$E$5000,2,FALSE),\"\")","v":""},{"$f":"IF(Score!B640>0,VLOOKUP(C641,Entrants!$A$2:$E$5000,4,FALSE),\"\")","v":""},{"$f":"IF(Score!C640>0,Score!C640,\"\")","v":""}]
[{"$f":"IF(Score!B641>0,Score!A641,\"\")","v":""},{"$f":"IF(Score!B641>0,IF(COUNTIF($E$3:E642,E642)>7,\"\",MAX($B$3:B641)+1),\"\")","v":""},{"$f":"IF(Score!B641>0,Score!B641,\"\")","v":""},{"$f":"IF(Score!B641>0,VLOOKUP(C642,Entrants!$A$2:$E$5000,3,FALSE),\"\")","v":""},{"$f":"IF(Score!B641>0,VLOOKUP(C642,Entrants!$A$2:$E$5000,2,FALSE),\"\")","v":""},{"$f":"IF(Score!B641>0,VLOOKUP(C642,Entrants!$A$2:$E$5000,4,FALSE),\"\")","v":""},{"$f":"IF(Score!C641>0,Score!C641,\"\")","v":""}]
[{"$f":"IF(Score!B642>0,Score!A642,\"\")","v":""},{"$f":"IF(Score!B642>0,IF(COUNTIF($E$3:E643,E643)>7,\"\",MAX($B$3:B642)+1),\"\")","v":""},{"$f":"IF(Score!B642>0,Score!B642,\"\")","v":""},{"$f":"IF(Score!B642>0,VLOOKUP(C643,Entrants!$A$2:$E$5000,3,FALSE),\"\")","v":""},{"$f":"IF(Score!B642>0,VLOOKUP(C643,Entrants!$A$2:$E$5000,2,FALSE),\"\")","v":""},{"$f":"IF(Score!B642>0,VLOOKUP(C643,Entrants!$A$2:$E$5000,4,FALSE),\"\")","v":""},{"$f":"IF(Score!C642>0,Score!C642,\"\")","v":""}]
[{"$f":"IF(Score!B643>0,Score!A643,\"\")","v":""},{"$f":"IF(Score!B643>0,IF(COUNTIF($E$3:E644,E644)>7,\"\",MAX($B$3:B643)+1),\"\")","v":""},{"$f":"IF(Score!B643>0,Score!B643,\"\")","v":""},{"$f":"IF(Score!B643>0,VLOOKUP(C644,Entrants!$A$2:$E$5000,3,FALSE),\"\")","v":""},{"$f":"IF(Score!B643>0,VLOOKUP(C644,Entrants!$A$2:$E$5000,2,FALSE),\"\")","v":""},{"$f":"IF(Score!B643>0,VLOOKUP(C644,Entrants!$A$2:$E$5000,4,FALSE),\"\")","v":""},{"$f":"IF(Score!C643>0,Score!C643,\"\")","v":""}]
[{"$f":"IF(Score!B644>0,Score!A644,\"\")","v":""},{"$f":"IF(Score!B644>0,IF(COUNTIF($E$3:E645,E645)>7,\"\",MAX($B$3:B644)+1),\"\")","v":""},{"$f":"IF(Score!B644>0,Score!B644,\"\")","v":""},{"$f":"IF(Score!B644>0,VLOOKUP(C645,Entrants!$A$2:$E$5000,3,FALSE),\"\")","v":""},{"$f":"IF(Score!B644>0,VLOOKUP(C645,Entrants!$A$2:$E$5000,2,FALSE),\"\")","v":""},{"$f":"IF(Score!B644>0,VLOOKUP(C645,Entrants!$A$2:$E$5000,4,FALSE),\"\")","v":""},{"$f":"IF(Score!C644>0,Score!C644,\"\")","v":""}]
[{"$f":"IF(Score!B645>0,Score!A645,\"\")","v":""},{"$f":"IF(Score!B645>0,IF(COUNTIF($E$3:E646,E646)>7,\"\",MAX($B$3:B645)+1),\"\")","v":""},{"$f":"IF(Score!B645>0,Score!B645,\"\")","v":""},{"$f":"IF(Score!B645>0,VLOOKUP(C646,Entrants!$A$2:$E$5000,3,FALSE),\"\")","v":""},{"$f":"IF(Score!B645>0,VLOOKUP(C646,Entrants!$A$2:$E$5000,2,FALSE),\"\")","v":""},{"$f":"IF(Score!B645>0,VLOOKUP(C646,Entrants!$A$2:$E$5000,4,FALSE),\"\")","v":""},{"$f":"IF(Score!C645>0,Score!C645,\"\")","v":""}]
[{"$f":"IF(Score!B646>0,Score!A646,\"\")","v":""},{"$f":"IF(Score!B646>0,IF(COUNTIF($E$3:E647,E647)>7,\"\",MAX($B$3:B646)+1),\"\")","v":""},{"$f":"IF(Score!B646>0,Score!B646,\"\")","v":""},{"$f":"IF(Score!B646>0,VLOOKUP(C647,Entrants!$A$2:$E$5000,3,FALSE),\"\")","v":""},{"$f":"IF(Score!B646>0,VLOOKUP(C647,Entrants!$A$2:$E$5000,2,FALSE),\"\")","v":""},{"$f":"IF(Score!B646>0,VLOOKUP(C647,Entrants!$A$2:$E$5000,4,FALSE),\"\")","v":""},{"$f":"IF(Score!C646>0,Score!C646,\"\")","v":""}]
[{"$f":"IF(Score!B647>0,Score!A647,\"\")","v":""},{"$f":"IF(Score!B647>0,IF(COUNTIF($E$3:E648,E648)>7,\"\",MAX($B$3:B647)+1),\"\")","v":""},{"$f":"IF(Score!B647>0,Score!B647,\"\")","v":""},{"$f":"IF(Score!B647>0,VLOOKUP(C648,Entrants!$A$2:$E$5000,3,FALSE),\"\")","v":""},{"$f":"IF(Score!B647>0,VLOOKUP(C648,Entrants!$A$2:$E$5000,2,FALSE),\"\")","v":""},{"$f":"IF(Score!B647>0,VLOOKUP(C648,Entrants!$A$2:$E$5000,4,FALSE),\"\")","v":""},{"$f":"IF(Score!C647>0,Score!C647,\"\")","v":""}]
[{"$f":"IF(Score!B648>0,Score!A648,\"\")","v":""},{"$f":"IF(Score!B648>0,IF(COUNTIF($E$3:E649,E649)>7,\"\",MAX($B$3:B648)+1),\"\")","v":""},{"$f":"IF(Score!B648>0,Score!B648,\"\")","v":""},{"$f":"IF(Score!B648>0,VLOOKUP(C649,Entrants!$A$2:$E$5000,3,FALSE),\"\")","v":""},{"$f":"IF(Score!B648>0,VLOOKUP(C649,Entrants!$A$2:$E$5000,2,FALSE),\"\")","v":""},{"$f":"IF(Score!B648>0,VLOOKUP(C649,Entrants!$A$2:$E$5000,4,FALSE),\"\")","v":""},{"$f":"IF(Score!C648>0,Score!C648,\"\")","v":""}]
[{"$f":"IF(Score!B649>0,Score!A649,\"\")","v":""},{"$f":"IF(Score!B649>0,IF(COUNTIF($E$3:E650,E650)>7,\"\",MAX($B$3:B649)+1),\"\")","v":""},{"$f":"IF(Score!B649>0,Score!B649,\"\")","v":""},{"$f":"IF(Score!B649>0,VLOOKUP(C650,Entrants!$A$2:$E$5000,3,FALSE),\"\")","v":""},{"$f":"IF(Score!B649>0,VLOOKUP(C650,Entrants!$A$2:$E$5000,2,FALSE),\"\")","v":""},{"$f":"IF(Score!B649>0,VLOOKUP(C650,Entrants!$A$2:$E$5000,4,FALSE),\"\")","v":""},{"$f":"IF(Score!C649>0,Score!C649,\"\")","v":""}]
[{"$f":"IF(Score!B650>0,Score!A650,\"\")","v":""},{"$f":"IF(Score!B650>0,IF(COUNTIF($E$3:E651,E651)>7,\"\",MAX($B$3:B650)+1),\"\")","v":""},{"$f":"IF(Score!B650>0,Score!B650,\"\")","v":""},{"$f":"IF(Score!B650>0,VLOOKUP(C651,Entrants!$A$2:$E$5000,3,FALSE),\"\")","v":""},{"$f":"IF(Score!B650>0,VLOOKUP(C651,Entrants!$A$2:$E$5000,2,FALSE),\"\")","v":""},{"$f":"IF(Score!B650>0,VLOOKUP(C651,Entrants!$A$2:$E$5000,4,FALSE),\"\")","v":""},{"$f":"IF(Score!C650>0,Score!C650,\"\")","v":""}]
[{"$f":"IF(Score!B651>0,Score!A651,\"\")","v":""},{"$f":"IF(Score!B651>0,IF(COUNTIF($E$3:E652,E652)>7,\"\",MAX($B$3:B651)+1),\"\")","v":""},{"$f":"IF(Score!B651>0,Score!B651,\"\")","v":""},{"$f":"IF(Score!B651>0,VLOOKUP(C652,Entrants!$A$2:$E$5000,3,FALSE),\"\")","v":""},{"$f":"IF(Score!B651>0,VLOOKUP(C652,Entrants!$A$2:$E$5000,2,FALSE),\"\")","v":""},{"$f":"IF(Score!B651>0,VLOOKUP(C652,Entrants!$A$2:$E$5000,4,FALSE),\"\")","v":""},{"$f":"IF(Score!C651>0,Score!C651,\"\")","v":""}]
[{"$f":"IF(Score!B652>0,Score!A652,\"\")","v":""},{"$f":"IF(Score!B652>0,IF(COUNTIF($E$3:E653,E653)>7,\"\",MAX($B$3:B652)+1),\"\")","v":""},{"$f":"IF(Score!B652>0,Score!B652,\"\")","v":""},{"$f":"IF(Score!B652>0,VLOOKUP(C653,Entrants!$A$2:$E$5000,3,FALSE),\"\")","v":""},{"$f":"IF(Score!B652>0,VLOOKUP(C653,Entrants!$A$2:$E$5000,2,FALSE),\"\")","v":""},{"$f":"IF(Score!B652>0,VLOOKUP(C653,Entrants!$A$2:$E$5000,4,FALSE),\"\")","v":""},{"$f":"IF(Score!C652>0,Score!C652,\"\")","v":""}]
[{"$f":"IF(Score!B653>0,Score!A653,\"\")","v":""},{"$f":"IF(Score!B653>0,IF(COUNTIF($E$3:E654,E654)>7,\"\",MAX($B$3:B653)+1),\"\")","v":""},{"$f":"IF(Score!B653>0,Score!B653,\"\")","v":""},{"$f":"IF(Score!B653>0,VLOOKUP(C654,Entrants!$A$2:$E$5000,3,FALSE),\"\")","v":""},{"$f":"IF(Score!B653>0,VLOOKUP(C654,Entrants!$A$2:$E$5000,2,FALSE),\"\")","v":""},{"$f":"IF(Score!B653>0,VLOOKUP(C654,Entrants!$A$2:$E$5000,4,FALSE),\"\")","v":""},{"$f":"IF(Score!C653>0,Score!C653,\"\")","v":""}]
[{"$f":"IF(Score!B654>0,Score!A654,\"\")","v":""},{"$f":"IF(Score!B654>0,IF(COUNTIF($E$3:E655,E655)>7,\"\",MAX($B$3:B654)+1),\"\")","v":""},{"$f":"IF(Score!B654>0,Score!B654,\"\")","v":""},{"$f":"IF(Score!B654>0,VLOOKUP(C655,Entrants!$A$2:$E$5000,3,FALSE),\"\")","v":""},{"$f":"IF(Score!B654>0,VLOOKUP(C655,Entrants!$A$2:$E$5000,2,FALSE),\"\")","v":""},{"$f":"IF(Score!B654>0,VLOOKUP(C655,Entrants!$A$2:$E$5000,4,FALSE),\"\")","v":""},{"$f":"IF(Score!C654>0,Score!C654,\"\")","v":""}]
[{"$f":"IF(Score!B655>0,Score!A655,\"\")","v":""},{"$f":"IF(Score!B655>0,IF(COUNTIF($E$3:E656,E656)>7,\"\",MAX($B$3:B655)+1),\"\")","v":""},{"$f":"IF(Score!B655>0,Score!B655,\"\")","v":""},{"$f":"IF(Score!B655>0,VLOOKUP(C656,Entrants!$A$2:$E$5000,3,FALSE),\"\")","v":""},{"$f":"IF(Score!B655>0,VLOOKUP(C656,Entrants!$A$2:$E$5000,2,FALSE),\"\")","v":""},{"$f":"IF(Score!B655>0,VLOOKUP(C656,Entrants!$A$2:$E$5000,4,FALSE),\"\")","v":""},{"$f":"IF(Score!C655>0,Score!C655,\"\")","v":""}]
[{"$f":"IF(Score!B656>0,Score!A656,\"\")","v":""},{"$f":"IF(Score!B656>0,IF(COUNTIF($E$3:E657,E657)>7,\"\",MAX($B$3:B656)+1),\"\")","v":""},{"$f":"IF(Score!B656>0,Score!B656,\"\")","v":""},{"$f":"IF(Score!B656>0,VLOOKUP(C657,Entrants!$A$2:$E$5000,3,FALSE),\"\")","v":""},{"$f":"IF(Score!B656>0,VLOOKUP(C657,Entrants!$A$2:$E$5000,2,FALSE),\"\")","v":""},{"$f":"IF(Score!B656>0,VLOOKUP(C657,Entrants!$A$2:$E$5000,4,FALSE),\"\")","v":""},{"$f":"IF(Score!C656>0,Score!C656,\"\")","v":""}]
[{"$f":"IF(Score!B657>0,Score!A657,\"\")","v":""},{"$f":"IF(Score!B657>0,IF(COUNTIF($E$3:E658,E658)>7,\"\",MAX($B$3:B657)+1),\"\")","v":""},{"$f":"IF(Score!B657>0,Score!B657,\"\")","v":""},{"$f":"IF(Score!B657>0,VLOOKUP(C658,Entrants!$A$2:$E$5000,3,FALSE),\"\")","v":""},{"$f":"IF(Score!B657>0,VLOOKUP(C658,Entrants!$A$2:$E$5000,2,FALSE),\"\")","v":""},{"$f":"IF(Score!B657>0,VLOOKUP(C658,Entrants!$A$2:$E$5000,4,FALSE),\"\")","v":""},{"$f":"IF(Score!C657>0,Score!C657,\"\")","v":""}]
[{"$f":"IF(Score!B658>0,Score!A658,\"\")","v":""},{"$f":"IF(Score!B658>0,IF(COUNTIF($E$3:E659,E659)>7,\"\",MAX($B$3:B658)+1),\"\")","v":""},{"$f":"IF(Score!B658>0,Score!B658,\"\")","v":""},{"$f":"IF(Score!B658>0,VLOOKUP(C659,Entrants!$A$2:$E$5000,3,FALSE),\"\")","v":""},{"$f":"IF(Score!B658>0,VLOOKUP(C659,Entrants!$A$2:$E$5000,2,FALSE),\"\")","v":""},{"$f":"IF(Score!B658>0,VLOOKUP(C659,Entrants!$A$2:$E$5000,4,FALSE),\"\")","v":""},{"$f":"IF(Score!C658>0,Score!C658,\"\")","v":""}]
[{"$f":"IF(Score!B659>0,Score!A659,\"\")","v":""},{"$f":"IF(Score!B659>0,IF(COUNTIF($E$3:E660,E660)>7,\"\",MAX($B$3:B659)+1),\"\")","v":""},{"$f":"IF(Score!B659>0,Score!B659,\"\")","v":""},{"$f":"IF(Score!B659>0,VLOOKUP(C660,Entrants!$A$2:$E$5000,3,FALSE),\"\")","v":""},{"$f":"IF(Score!B659>0,VLOOKUP(C660,Entrants!$A$2:$E$5000,2,FALSE),\"\")","v":""},{"$f":"IF(Score!B659>0,VLOOKUP(C660,Entrants!$A$2:$E$5000,4,FALSE),\"\")","v":""},{"$f":"IF(Score!C659>0,Score!C659,\"\")","v":""}]
[{"$f":"IF(Score!B660>0,Score!A660,\"\")","v":""},{"$f":"IF(Score!B660>0,IF(COUNTIF($E$3:E661,E661)>7,\"\",MAX($B$3:B660)+1),\"\")","v":""},{"$f":"IF(Score!B660>0,Score!B660,\"\")","v":""},{"$f":"IF(Score!B660>0,VLOOKUP(C661,Entrants!$A$2:$E$5000,3,FALSE),\"\")","v":""},{"$f":"IF(Score!B660>0,VLOOKUP(C661,Entrants!$A$2:$E$5000,2,FALSE),\"\")","v":""},{"$f":"IF(Score!B660>0,VLOOKUP(C661,Entrants!$A$2:$E$5000,4,FALSE),\"\")","v":""},{"$f":"IF(Score!C660>0,Score!C660,\"\")","v":""}]
[{"$f":"IF(Score!B661>0,Score!A661,\"\")","v":""},{"$f":"IF(Score!B661>0,IF(COUNTIF($E$3:E662,E662)>7,\"\",MAX($B$3:B661)+1),\"\")","v":""},{"$f":"IF(Score!B661>0,Score!B661,\"\")","v":""},{"$f":"IF(Score!B661>0,VLOOKUP(C662,Entrants!$A$2:$E$5000,3,FALSE),\"\")","v":""},{"$f":"IF(Score!B661>0,VLOOKUP(C662,Entrants!$A$2:$E$5000,2,FALSE),\"\")","v":""},{"$f":"IF(Score!B661>0,VLOOKUP(C662,Entrants!$A$2:$E$5000,4,FALSE),\"\")","v":""},{"$f":"IF(Score!C661>0,Score!C661,\"\")","v":""}]
[{"$f":"IF(Score!B662>0,Score!A662,\"\")","v":""},{"$f":"IF(Score!B662>0,IF(COUNTIF($E$3:E663,E663)>7,\"\",MAX($B$3:B662)+1),\"\")","v":""},{"$f":"IF(Score!B662>0,Score!B662,\"\")","v":""},{"$f":"IF(Score!B662>0,VLOOKUP(C663,Entrants!$A$2:$E$5000,3,FALSE),\"\")","v":""},{"$f":"IF(Score!B662>0,VLOOKUP(C663,Entrants!$A$2:$E$5000,2,FALSE),\"\")","v":""},{"$f":"IF(Score!B662>0,VLOOKUP(C663,Entrants!$A$2:$E$5000,4,FALSE),\"\")","v":""},{"$f":"IF(Score!C662>0,Score!C662,\"\")","v":""}]
[{"$f":"IF(Score!B663>0,Score!A663,\"\")","v":""},{"$f":"IF(Score!B663>0,IF(COUNTIF($E$3:E664,E664)>7,\"\",MAX($B$3:B663)+1),\"\")","v":""},{"$f":"IF(Score!B663>0,Score!B663,\"\")","v":""},{"$f":"IF(Score!B663>0,VLOOKUP(C664,Entrants!$A$2:$E$5000,3,FALSE),\"\")","v":""},{"$f":"IF(Score!B663>0,VLOOKUP(C664,Entrants!$A$2:$E$5000,2,FALSE),\"\")","v":""},{"$f":"IF(Score!B663>0,VLOOKUP(C664,Entrants!$A$2:$E$5000,4,FALSE),\"\")","v":""},{"$f":"IF(Score!C663>0,Score!C663,\"\")","v":""}]
[{"$f":"IF(Score!B664>0,Score!A664,\"\")","v":""},{"$f":"IF(Score!B664>0,IF(COUNTIF($E$3:E665,E665)>7,\"\",MAX($B$3:B664)+1),\"\")","v":""},{"$f":"IF(Score!B664>0,Score!B664,\"\")","v":""},{"$f":"IF(Score!B664>0,VLOOKUP(C665,Entrants!$A$2:$E$5000,3,FALSE),\"\")","v":""},{"$f":"IF(Score!B664>0,VLOOKUP(C665,Entrants!$A$2:$E$5000,2,FALSE),\"\")","v":""},{"$f":"IF(Score!B664>0,VLOOKUP(C665,Entrants!$A$2:$E$5000,4,FALSE),\"\")","v":""},{"$f":"IF(Score!C664>0,Score!C664,\"\")","v":""}]
[{"$f":"IF(Score!B665>0,Score!A665,\"\")","v":""},{"$f":"IF(Score!B665>0,IF(COUNTIF($E$3:E666,E666)>7,\"\",MAX($B$3:B665)+1),\"\")","v":""},{"$f":"IF(Score!B665>0,Score!B665,\"\")","v":""},{"$f":"IF(Score!B665>0,VLOOKUP(C666,Entrants!$A$2:$E$5000,3,FALSE),\"\")","v":""},{"$f":"IF(Score!B665>0,VLOOKUP(C666,Entrants!$A$2:$E$5000,2,FALSE),\"\")","v":""},{"$f":"IF(Score!B665>0,VLOOKUP(C666,Entrants!$A$2:$E$5000,4,FALSE),\"\")","v":""},{"$f":"IF(Score!C665>0,Score!C665,\"\")","v":""}]
[{"$f":"IF(Score!B666>0,Score!A666,\"\")","v":""},{"$f":"IF(Score!B666>0,IF(COUNTIF($E$3:E667,E667)>7,\"\",MAX($B$3:B666)+1),\"\")","v":""},{"$f":"IF(Score!B666>0,Score!B666,\"\")","v":""},{"$f":"IF(Score!B666>0,VLOOKUP(C667,Entrants!$A$2:$E$5000,3,FALSE),\"\")","v":""},{"$f":"IF(Score!B666>0,VLOOKUP(C667,Entrants!$A$2:$E$5000,2,FALSE),\"\")","v":""},{"$f":"IF(Score!B666>0,VLOOKUP(C667,Entrants!$A$2:$E$5000,4,FALSE),\"\")","v":""},{"$f":"IF(Score!C666>0,Score!C666,\"\")","v":""}]
[{"$f":"IF(Score!B667>0,Score!A667,\"\")","v":""},{"$f":"IF(Score!B667>0,IF(COUNTIF($E$3:E668,E668)>7,\"\",MAX($B$3:B667)+1),\"\")","v":""},{"$f":"IF(Score!B667>0,Score!B667,\"\")","v":""},{"$f":"IF(Score!B667>0,VLOOKUP(C668,Entrants!$A$2:$E$5000,3,FALSE),\"\")","v":""},{"$f":"IF(Score!B667>0,VLOOKUP(C668,Entrants!$A$2:$E$5000,2,FALSE),\"\")","v":""},{"$f":"IF(Score!B667>0,VLOOKUP(C668,Entrants!$A$2:$E$5000,4,FALSE),\"\")","v":""},{"$f":"IF(Score!C667>0,Score!C667,\"\")","v":""}]
[{"$f":"IF(Score!B668>0,Score!A668,\"\")","v":""},{"$f":"IF(Score!B668>0,IF(COUNTIF($E$3:E669,E669)>7,\"\",MAX($B$3:B668)+1),\"\")","v":""},{"$f":"IF(Score!B668>0,Score!B668,\"\")","v":""},{"$f":"IF(Score!B668>0,VLOOKUP(C669,Entrants!$A$2:$E$5000,3,FALSE),\"\")","v":""},{"$f":"IF(Score!B668>0,VLOOKUP(C669,Entrants!$A$2:$E$5000,2,FALSE),\"\")","v":""},{"$f":"IF(Score!B668>0,VLOOKUP(C669,Entrants!$A$2:$E$5000,4,FALSE),\"\")","v":""},{"$f":"IF(Score!C668>0,Score!C668,\"\")","v":""}]
[{"$f":"IF(Score!B669>0,Score!A669,\"\")","v":""},{"$f":"IF(Score!B669>0,IF(COUNTIF($E$3:E670,E670)>7,\"\",MAX($B$3:B669)+1),\"\")","v":""},{"$f":"IF(Score!B669>0,Score!B669,\"\")","v":""},{"$f":"IF(Score!B669>0,VLOOKUP(C670,Entrants!$A$2:$E$5000,3,FALSE),\"\")","v":""},{"$f":"IF(Score!B669>0,VLOOKUP(C670,Entrants!$A$2:$E$5000,2,FALSE),\"\")","v":""},{"$f":"IF(Score!B669>0,VLOOKUP(C670,Entrants!$A$2:$E$5000,4,FALSE),\"\")","v":""},{"$f":"IF(Score!C669>0,Score!C669,\"\")","v":""}]
[{"$f":"IF(Score!B670>0,Score!A670,\"\")","v":""},{"$f":"IF(Score!B670>0,IF(COUNTIF($E$3:E671,E671)>7,\"\",MAX($B$3:B670)+1),\"\")","v":""},{"$f":"IF(Score!B670>0,Score!B670,\"\")","v":""},{"$f":"IF(Score!B670>0,VLOOKUP(C671,Entrants!$A$2:$E$5000,3,FALSE),\"\")","v":""},{"$f":"IF(Score!B670>0,VLOOKUP(C671,Entrants!$A$2:$E$5000,2,FALSE),\"\")","v":""},{"$f":"IF(Score!B670>0,VLOOKUP(C671,Entrants!$A$2:$E$5000,4,FALSE),\"\")","v":""},{"$f":"IF(Score!C670>0,Score!C670,\"\")","v":""}]
[{"$f":"IF(Score!B671>0,Score!A671,\"\")","v":""},{"$f":"IF(Score!B671>0,IF(COUNTIF($E$3:E672,E672)>7,\"\",MAX($B$3:B671)+1),\"\")","v":""},{"$f":"IF(Score!B671>0,Score!B671,\"\")","v":""},{"$f":"IF(Score!B671>0,VLOOKUP(C672,Entrants!$A$2:$E$5000,3,FALSE),\"\")","v":""},{"$f":"IF(Score!B671>0,VLOOKUP(C672,Entrants!$A$2:$E$5000,2,FALSE),\"\")","v":""},{"$f":"IF(Score!B671>0,VLOOKUP(C672,Entrants!$A$2:$E$5000,4,FALSE),\"\")","v":""},{"$f":"IF(Score!C671>0,Score!C671,\"\")","v":""}]
[{"$f":"IF(Score!B672>0,Score!A672,\"\")","v":""},{"$f":"IF(Score!B672>0,IF(COUNTIF($E$3:E673,E673)>7,\"\",MAX($B$3:B672)+1),\"\")","v":""},{"$f":"IF(Score!B672>0,Score!B672,\"\")","v":""},{"$f":"IF(Score!B672>0,VLOOKUP(C673,Entrants!$A$2:$E$5000,3,FALSE),\"\")","v":""},{"$f":"IF(Score!B672>0,VLOOKUP(C673,Entrants!$A$2:$E$5000,2,FALSE),\"\")","v":""},{"$f":"IF(Score!B672>0,VLOOKUP(C673,Entrants!$A$2:$E$5000,4,FALSE),\"\")","v":""},{"$f":"IF(Score!C672>0,Score!C672,\"\")","v":""}]
[{"$f":"IF(Score!B673>0,Score!A673,\"\")","v":""},{"$f":"IF(Score!B673>0,IF(COUNTIF($E$3:E674,E674)>7,\"\",MAX($B$3:B673)+1),\"\")","v":""},{"$f":"IF(Score!B673>0,Score!B673,\"\")","v":""},{"$f":"IF(Score!B673>0,VLOOKUP(C674,Entrants!$A$2:$E$5000,3,FALSE),\"\")","v":""},{"$f":"IF(Score!B673>0,VLOOKUP(C674,Entrants!$A$2:$E$5000,2,FALSE),\"\")","v":""},{"$f":"IF(Score!B673>0,VLOOKUP(C674,Entrants!$A$2:$E$5000,4,FALSE),\"\")","v":""},{"$f":"IF(Score!C673>0,Score!C673,\"\")","v":""}]
[{"$f":"IF(Score!B674>0,Score!A674,\"\")","v":""},{"$f":"IF(Score!B674>0,IF(COUNTIF($E$3:E675,E675)>7,\"\",MAX($B$3:B674)+1),\"\")","v":""},{"$f":"IF(Score!B674>0,Score!B674,\"\")","v":""},{"$f":"IF(Score!B674>0,VLOOKUP(C675,Entrants!$A$2:$E$5000,3,FALSE),\"\")","v":""},{"$f":"IF(Score!B674>0,VLOOKUP(C675,Entrants!$A$2:$E$5000,2,FALSE),\"\")","v":""},{"$f":"IF(Score!B674>0,VLOOKUP(C675,Entrants!$A$2:$E$5000,4,FALSE),\"\")","v":""},{"$f":"IF(Score!C674>0,Score!C674,\"\")","v":""}]
[{"$f":"IF(Score!B675>0,Score!A675,\"\")","v":""},{"$f":"IF(Score!B675>0,IF(COUNTIF($E$3:E676,E676)>7,\"\",MAX($B$3:B675)+1),\"\")","v":""},{"$f":"IF(Score!B675>0,Score!B675,\"\")","v":""},{"$f":"IF(Score!B675>0,VLOOKUP(C676,Entrants!$A$2:$E$5000,3,FALSE),\"\")","v":""},{"$f":"IF(Score!B675>0,VLOOKUP(C676,Entrants!$A$2:$E$5000,2,FALSE),\"\")","v":""},{"$f":"IF(Score!B675>0,VLOOKUP(C676,Entrants!$A$2:$E$5000,4,FALSE),\"\")","v":""},{"$f":"IF(Score!C675>0,Score!C675,\"\")","v":""}]
[{"$f":"IF(Score!B676>0,Score!A676,\"\")","v":""},{"$f":"IF(Score!B676>0,IF(COUNTIF($E$3:E677,E677)>7,\"\",MAX($B$3:B676)+1),\"\")","v":""},{"$f":"IF(Score!B676>0,Score!B676,\"\")","v":""},{"$f":"IF(Score!B676>0,VLOOKUP(C677,Entrants!$A$2:$E$5000,3,FALSE),\"\")","v":""},{"$f":"IF(Score!B676>0,VLOOKUP(C677,Entrants!$A$2:$E$5000,2,FALSE),\"\")","v":""},{"$f":"IF(Score!B676>0,VLOOKUP(C677,Entrants!$A$2:$E$5000,4,FALSE),\"\")","v":""},{"$f":"IF(Score!C676>0,Score!C676,\"\")","v":""}]
[{"$f":"IF(Score!B677>0,Score!A677,\"\")","v":""},{"$f":"IF(Score!B677>0,IF(COUNTIF($E$3:E678,E678)>7,\"\",MAX($B$3:B677)+1),\"\")","v":""},{"$f":"IF(Score!B677>0,Score!B677,\"\")","v":""},{"$f":"IF(Score!B677>0,VLOOKUP(C678,Entrants!$A$2:$E$5000,3,FALSE),\"\")","v":""},{"$f":"IF(Score!B677>0,VLOOKUP(C678,Entrants!$A$2:$E$5000,2,FALSE),\"\")","v":""},{"$f":"IF(Score!B677>0,VLOOKUP(C678,Entrants!$A$2:$E$5000,4,FALSE),\"\")","v":""},{"$f":"IF(Score!C677>0,Score!C677,\"\")","v":""}]
[{"$f":"IF(Score!B678>0,Score!A678,\"\")","v":""},{"$f":"IF(Score!B678>0,IF(COUNTIF($E$3:E679,E679)>7,\"\",MAX($B$3:B678)+1),\"\")","v":""},{"$f":"IF(Score!B678>0,Score!B678,\"\")","v":""},{"$f":"IF(Score!B678>0,VLOOKUP(C679,Entrants!$A$2:$E$5000,3,FALSE),\"\")","v":""},{"$f":"IF(Score!B678>0,VLOOKUP(C679,Entrants!$A$2:$E$5000,2,FALSE),\"\")","v":""},{"$f":"IF(Score!B678>0,VLOOKUP(C679,Entrants!$A$2:$E$5000,4,FALSE),\"\")","v":""},{"$f":"IF(Score!C678>0,Score!C678,\"\")","v":""}]
[{"$f":"IF(Score!B679>0,Score!A679,\"\")","v":""},{"$f":"IF(Score!B679>0,IF(COUNTIF($E$3:E680,E680)>7,\"\",MAX($B$3:B679)+1),\"\")","v":""},{"$f":"IF(Score!B679>0,Score!B679,\"\")","v":""},{"$f":"IF(Score!B679>0,VLOOKUP(C680,Entrants!$A$2:$E$5000,3,FALSE),\"\")","v":""},{"$f":"IF(Score!B679>0,VLOOKUP(C680,Entrants!$A$2:$E$5000,2,FALSE),\"\")","v":""},{"$f":"IF(Score!B679>0,VLOOKUP(C680,Entrants!$A$2:$E$5000,4,FALSE),\"\")","v":""},{"$f":"IF(Score!C679>0,Score!C679,\"\")","v":""}]
[{"$f":"IF(Score!B680>0,Score!A680,\"\")","v":""},{"$f":"IF(Score!B680>0,IF(COUNTIF($E$3:E681,E681)>7,\"\",MAX($B$3:B680)+1),\"\")","v":""},{"$f":"IF(Score!B680>0,Score!B680,\"\")","v":""},{"$f":"IF(Score!B680>0,VLOOKUP(C681,Entrants!$A$2:$E$5000,3,FALSE),\"\")","v":""},{"$f":"IF(Score!B680>0,VLOOKUP(C681,Entrants!$A$2:$E$5000,2,FALSE),\"\")","v":""},{"$f":"IF(Score!B680>0,VLOOKUP(C681,Entrants!$A$2:$E$5000,4,FALSE),\"\")","v":""},{"$f":"IF(Score!C680>0,Score!C680,\"\")","v":""}]
[{"$f":"IF(Score!B681>0,Score!A681,\"\")","v":""},{"$f":"IF(Score!B681>0,IF(COUNTIF($E$3:E682,E682)>7,\"\",MAX($B$3:B681)+1),\"\")","v":""},{"$f":"IF(Score!B681>0,Score!B681,\"\")","v":""},{"$f":"IF(Score!B681>0,VLOOKUP(C682,Entrants!$A$2:$E$5000,3,FALSE),\"\")","v":""},{"$f":"IF(Score!B681>0,VLOOKUP(C682,Entrants!$A$2:$E$5000,2,FALSE),\"\")","v":""},{"$f":"IF(Score!B681>0,VLOOKUP(C682,Entrants!$A$2:$E$5000,4,FALSE),\"\")","v":""},{"$f":"IF(Score!C681>0,Score!C681,\"\")","v":""}]
[{"$f":"IF(Score!B682>0,Score!A682,\"\")","v":""},{"$f":"IF(Score!B682>0,IF(COUNTIF($E$3:E683,E683)>7,\"\",MAX($B$3:B682)+1),\"\")","v":""},{"$f":"IF(Score!B682>0,Score!B682,\"\")","v":""},{"$f":"IF(Score!B682>0,VLOOKUP(C683,Entrants!$A$2:$E$5000,3,FALSE),\"\")","v":""},{"$f":"IF(Score!B682>0,VLOOKUP(C683,Entrants!$A$2:$E$5000,2,FALSE),\"\")","v":""},{"$f":"IF(Score!B682>0,VLOOKUP(C683,Entrants!$A$2:$E$5000,4,FALSE),\"\")","v":""},{"$f":"IF(Score!C682>0,Score!C682,\"\")","v":""}]
[{"$f":"IF(Score!B683>0,Score!A683,\"\")","v":""},{"$f":"IF(Score!B683>0,IF(COUNTIF($E$3:E684,E684)>7,\"\",MAX($B$3:B683)+1),\"\")","v":""},{"$f":"IF(Score!B683>0,Score!B683,\"\")","v":""},{"$f":"IF(Score!B683>0,VLOOKUP(C684,Entrants!$A$2:$E$5000,3,FALSE),\"\")","v":""},{"$f":"IF(Score!B683>0,VLOOKUP(C684,Entrants!$A$2:$E$5000,2,FALSE),\"\")","v":""},{"$f":"IF(Score!B683>0,VLOOKUP(C684,Entrants!$A$2:$E$5000,4,FALSE),\"\")","v":""},{"$f":"IF(Score!C683>0,Score!C683,\"\")","v":""}]
[{"$f":"IF(Score!B684>0,Score!A684,\"\")","v":""},{"$f":"IF(Score!B684>0,IF(COUNTIF($E$3:E685,E685)>7,\"\",MAX($B$3:B684)+1),\"\")","v":""},{"$f":"IF(Score!B684>0,Score!B684,\"\")","v":""},{"$f":"IF(Score!B684>0,VLOOKUP(C685,Entrants!$A$2:$E$5000,3,FALSE),\"\")","v":""},{"$f":"IF(Score!B684>0,VLOOKUP(C685,Entrants!$A$2:$E$5000,2,FALSE),\"\")","v":""},{"$f":"IF(Score!B684>0,VLOOKUP(C685,Entrants!$A$2:$E$5000,4,FALSE),\"\")","v":""},{"$f":"IF(Score!C684>0,Score!C684,\"\")","v":""}]
[{"$f":"IF(Score!B685>0,Score!A685,\"\")","v":""},{"$f":"IF(Score!B685>0,IF(COUNTIF($E$3:E686,E686)>7,\"\",MAX($B$3:B685)+1),\"\")","v":""},{"$f":"IF(Score!B685>0,Score!B685,\"\")","v":""},{"$f":"IF(Score!B685>0,VLOOKUP(C686,Entrants!$A$2:$E$5000,3,FALSE),\"\")","v":""},{"$f":"IF(Score!B685>0,VLOOKUP(C686,Entrants!$A$2:$E$5000,2,FALSE),\"\")","v":""},{"$f":"IF(Score!B685>0,VLOOKUP(C686,Entrants!$A$2:$E$5000,4,FALSE),\"\")","v":""},{"$f":"IF(Score!C685>0,Score!C685,\"\")","v":""}]
[{"$f":"IF(Score!B686>0,Score!A686,\"\")","v":""},{"$f":"IF(Score!B686>0,IF(COUNTIF($E$3:E687,E687)>7,\"\",MAX($B$3:B686)+1),\"\")","v":""},{"$f":"IF(Score!B686>0,Score!B686,\"\")","v":""},{"$f":"IF(Score!B686>0,VLOOKUP(C687,Entrants!$A$2:$E$5000,3,FALSE),\"\")","v":""},{"$f":"IF(Score!B686>0,VLOOKUP(C687,Entrants!$A$2:$E$5000,2,FALSE),\"\")","v":""},{"$f":"IF(Score!B686>0,VLOOKUP(C687,Entrants!$A$2:$E$5000,4,FALSE),\"\")","v":""},{"$f":"IF(Score!C686>0,Score!C686,\"\")","v":""}]
[{"$f":"IF(Score!B687>0,Score!A687,\"\")","v":""},{"$f":"IF(Score!B687>0,IF(COUNTIF($E$3:E688,E688)>7,\"\",MAX($B$3:B687)+1),\"\")","v":""},{"$f":"IF(Score!B687>0,Score!B687,\"\")","v":""},{"$f":"IF(Score!B687>0,VLOOKUP(C688,Entrants!$A$2:$E$5000,3,FALSE),\"\")","v":""},{"$f":"IF(Score!B687>0,VLOOKUP(C688,Entrants!$A$2:$E$5000,2,FALSE),\"\")","v":""},{"$f":"IF(Score!B687>0,VLOOKUP(C688,Entrants!$A$2:$E$5000,4,FALSE),\"\")","v":""},{"$f":"IF(Score!C687>0,Score!C687,\"\")","v":""}]
[{"$f":"IF(Score!B688>0,Score!A688,\"\")","v":""},{"$f":"IF(Score!B688>0,IF(COUNTIF($E$3:E689,E689)>7,\"\",MAX($B$3:B688)+1),\"\")","v":""},{"$f":"IF(Score!B688>0,Score!B688,\"\")","v":""},{"$f":"IF(Score!B688>0,VLOOKUP(C689,Entrants!$A$2:$E$5000,3,FALSE),\"\")","v":""},{"$f":"IF(Score!B688>0,VLOOKUP(C689,Entrants!$A$2:$E$5000,2,FALSE),\"\")","v":""},{"$f":"IF(Score!B688>0,VLOOKUP(C689,Entrants!$A$2:$E$5000,4,FALSE),\"\")","v":""},{"$f":"IF(Score!C688>0,Score!C688,\"\")","v":""}]
[{"$f":"IF(Score!B689>0,Score!A689,\"\")","v":""},{"$f":"IF(Score!B689>0,IF(COUNTIF($E$3:E690,E690)>7,\"\",MAX($B$3:B689)+1),\"\")","v":""},{"$f":"IF(Score!B689>0,Score!B689,\"\")","v":""},{"$f":"IF(Score!B689>0,VLOOKUP(C690,Entrants!$A$2:$E$5000,3,FALSE),\"\")","v":""},{"$f":"IF(Score!B689>0,VLOOKUP(C690,Entrants!$A$2:$E$5000,2,FALSE),\"\")","v":""},{"$f":"IF(Score!B689>0,VLOOKUP(C690,Entrants!$A$2:$E$5000,4,FALSE),\"\")","v":""},{"$f":"IF(Score!C689>0,Score!C689,\"\")","v":""}]
[{"$f":"IF(Score!B690>0,Score!A690,\"\")","v":""},{"$f":"IF(Score!B690>0,IF(COUNTIF($E$3:E691,E691)>7,\"\",MAX($B$3:B690)+1),\"\")","v":""},{"$f":"IF(Score!B690>0,Score!B690,\"\")","v":""},{"$f":"IF(Score!B690>0,VLOOKUP(C691,Entrants!$A$2:$E$5000,3,FALSE),\"\")","v":""},{"$f":"IF(Score!B690>0,VLOOKUP(C691,Entrants!$A$2:$E$5000,2,FALSE),\"\")","v":""},{"$f":"IF(Score!B690>0,VLOOKUP(C691,Entrants!$A$2:$E$5000,4,FALSE),\"\")","v":""},{"$f":"IF(Score!C690>0,Score!C690,\"\")","v":""}]
[{"$f":"IF(Score!B691>0,Score!A691,\"\")","v":""},{"$f":"IF(Score!B691>0,IF(COUNTIF($E$3:E692,E692)>7,\"\",MAX($B$3:B691)+1),\"\")","v":""},{"$f":"IF(Score!B691>0,Score!B691,\"\")","v":""},{"$f":"IF(Score!B691>0,VLOOKUP(C692,Entrants!$A$2:$E$5000,3,FALSE),\"\")","v":""},{"$f":"IF(Score!B691>0,VLOOKUP(C692,Entrants!$A$2:$E$5000,2,FALSE),\"\")","v":""},{"$f":"IF(Score!B691>0,VLOOKUP(C692,Entrants!$A$2:$E$5000,4,FALSE),\"\")","v":""},{"$f":"IF(Score!C691>0,Score!C691,\"\")","v":""}]
[{"$f":"IF(Score!B692>0,Score!A692,\"\")","v":""},{"$f":"IF(Score!B692>0,IF(COUNTIF($E$3:E693,E693)>7,\"\",MAX($B$3:B692)+1),\"\")","v":""},{"$f":"IF(Score!B692>0,Score!B692,\"\")","v":""},{"$f":"IF(Score!B692>0,VLOOKUP(C693,Entrants!$A$2:$E$5000,3,FALSE),\"\")","v":""},{"$f":"IF(Score!B692>0,VLOOKUP(C693,Entrants!$A$2:$E$5000,2,FALSE),\"\")","v":""},{"$f":"IF(Score!B692>0,VLOOKUP(C693,Entrants!$A$2:$E$5000,4,FALSE),\"\")","v":""},{"$f":"IF(Score!C692>0,Score!C692,\"\")","v":""}]
[{"$f":"IF(Score!B693>0,Score!A693,\"\")","v":""},{"$f":"IF(Score!B693>0,IF(COUNTIF($E$3:E694,E694)>7,\"\",MAX($B$3:B693)+1),\"\")","v":""},{"$f":"IF(Score!B693>0,Score!B693,\"\")","v":""},{"$f":"IF(Score!B693>0,VLOOKUP(C694,Entrants!$A$2:$E$5000,3,FALSE),\"\")","v":""},{"$f":"IF(Score!B693>0,VLOOKUP(C694,Entrants!$A$2:$E$5000,2,FALSE),\"\")","v":""},{"$f":"IF(Score!B693>0,VLOOKUP(C694,Entrants!$A$2:$E$5000,4,FALSE),\"\")","v":""},{"$f":"IF(Score!C693>0,Score!C693,\"\")","v":""}]
[{"$f":"IF(Score!B694>0,Score!A694,\"\")","v":""},{"$f":"IF(Score!B694>0,IF(COUNTIF($E$3:E695,E695)>7,\"\",MAX($B$3:B694)+1),\"\")","v":""},{"$f":"IF(Score!B694>0,Score!B694,\"\")","v":""},{"$f":"IF(Score!B694>0,VLOOKUP(C695,Entrants!$A$2:$E$5000,3,FALSE),\"\")","v":""},{"$f":"IF(Score!B694>0,VLOOKUP(C695,Entrants!$A$2:$E$5000,2,FALSE),\"\")","v":""},{"$f":"IF(Score!B694>0,VLOOKUP(C695,Entrants!$A$2:$E$5000,4,FALSE),\"\")","v":""},{"$f":"IF(Score!C694>0,Score!C694,\"\")","v":""}]
[{"$f":"IF(Score!B695>0,Score!A695,\"\")","v":""},{"$f":"IF(Score!B695>0,IF(COUNTIF($E$3:E696,E696)>7,\"\",MAX($B$3:B695)+1),\"\")","v":""},{"$f":"IF(Score!B695>0,Score!B695,\"\")","v":""},{"$f":"IF(Score!B695>0,VLOOKUP(C696,Entrants!$A$2:$E$5000,3,FALSE),\"\")","v":""},{"$f":"IF(Score!B695>0,VLOOKUP(C696,Entrants!$A$2:$E$5000,2,FALSE),\"\")","v":""},{"$f":"IF(Score!B695>0,VLOOKUP(C696,Entrants!$A$2:$E$5000,4,FALSE),\"\")","v":""},{"$f":"IF(Score!C695>0,Score!C695,\"\")","v":""}]
[{"$f":"IF(Score!B696>0,Score!A696,\"\")","v":""},{"$f":"IF(Score!B696>0,IF(COUNTIF($E$3:E697,E697)>7,\"\",MAX($B$3:B696)+1),\"\")","v":""},{"$f":"IF(Score!B696>0,Score!B696,\"\")","v":""},{"$f":"IF(Score!B696>0,VLOOKUP(C697,Entrants!$A$2:$E$5000,3,FALSE),\"\")","v":""},{"$f":"IF(Score!B696>0,VLOOKUP(C697,Entrants!$A$2:$E$5000,2,FALSE),\"\")","v":""},{"$f":"IF(Score!B696>0,VLOOKUP(C697,Entrants!$A$2:$E$5000,4,FALSE),\"\")","v":""},{"$f":"IF(Score!C696>0,Score!C696,\"\")","v":""}]
[{"$f":"IF(Score!B697>0,Score!A697,\"\")","v":""},{"$f":"IF(Score!B697>0,IF(COUNTIF($E$3:E698,E698)>7,\"\",MAX($B$3:B697)+1),\"\")","v":""},{"$f":"IF(Score!B697>0,Score!B697,\"\")","v":""},{"$f":"IF(Score!B697>0,VLOOKUP(C698,Entrants!$A$2:$E$5000,3,FALSE),\"\")","v":""},{"$f":"IF(Score!B697>0,VLOOKUP(C698,Entrants!$A$2:$E$5000,2,FALSE),\"\")","v":""},{"$f":"IF(Score!B697>0,VLOOKUP(C698,Entrants!$A$2:$E$5000,4,FALSE),\"\")","v":""},{"$f":"IF(Score!C697>0,Score!C697,\"\")","v":""}]
[{"$f":"IF(Score!B698>0,Score!A698,\"\")","v":""},{"$f":"IF(Score!B698>0,IF(COUNTIF($E$3:E699,E699)>7,\"\",MAX($B$3:B698)+1),\"\")","v":""},{"$f":"IF(Score!B698>0,Score!B698,\"\")","v":""},{"$f":"IF(Score!B698>0,VLOOKUP(C699,Entrants!$A$2:$E$5000,3,FALSE),\"\")","v":""},{"$f":"IF(Score!B698>0,VLOOKUP(C699,Entrants!$A$2:$E$5000,2,FALSE),\"\")","v":""},{"$f":"IF(Score!B698>0,VLOOKUP(C699,Entrants!$A$2:$E$5000,4,FALSE),\"\")","v":""},{"$f":"IF(Score!C698>0,Score!C698,\"\")","v":""}]
[{"$f":"IF(Score!B699>0,Score!A699,\"\")","v":""},{"$f":"IF(Score!B699>0,IF(COUNTIF($E$3:E700,E700)>7,\"\",MAX($B$3:B699)+1),\"\")","v":""},{"$f":"IF(Score!B699>0,Score!B699,\"\")","v":""},{"$f":"IF(Score!B699>0,VLOOKUP(C700,Entrants!$A$2:$E$5000,3,FALSE),\"\")","v":""},{"$f":"IF(Score!B699>0,VLOOKUP(C700,Entrants!$A$2:$E$5000,2,FALSE),\"\")","v":""},{"$f":"IF(Score!B699>0,VLOOKUP(C700,Entrants!$A$2:$E$5000,4,FALSE),\"\")","v":""},{"$f":"IF(Score!C699>0,Score!C699,\"\")","v":""}]
[{"$f":"IF(Score!B700>0,Score!A700,\"\")","v":""},{"$f":"IF(Score!B700>0,IF(COUNTIF($E$3:E701,E701)>7,\"\",MAX($B$3:B700)+1),\"\")","v":""},{"$f":"IF(Score!B700>0,Score!B700,\"\")","v":""},{"$f":"IF(Score!B700>0,VLOOKUP(C701,Entrants!$A$2:$E$5000,3,FALSE),\"\")","v":""},{"$f":"IF(Score!B700>0,VLOOKUP(C701,Entrants!$A$2:$E$5000,2,FALSE),\"\")","v":""},{"$f":"IF(Score!B700>0,VLOOKUP(C701,Entrants!$A$2:$E$5000,4,FALSE),\"\")","v":""},{"$f":"IF(Score!C700>0,Score!C700,\"\")","v":""}]
[{"$f":"IF(Score!B701>0,Score!A701,\"\")","v":""},{"$f":"IF(Score!B701>0,IF(COUNTIF($E$3:E702,E702)>7,\"\",MAX($B$3:B701)+1),\"\")","v":""},{"$f":"IF(Score!B701>0,Score!B701,\"\")","v":""},{"$f":"IF(Score!B701>0,VLOOKUP(C702,Entrants!$A$2:$E$5000,3,FALSE),\"\")","v":""},{"$f":"IF(Score!B701>0,VLOOKUP(C702,Entrants!$A$2:$E$5000,2,FALSE),\"\")","v":""},{"$f":"IF(Score!B701>0,VLOOKUP(C702,Entrants!$A$2:$E$5000,4,FALSE),\"\")","v":""},{"$f":"IF(Score!C701>0,Score!C701,\"\")","v":""}]
[{"$f":"IF(Score!B702>0,Score!A702,\"\")","v":""},{"$f":"IF(Score!B702>0,IF(COUNTIF($E$3:E703,E703)>7,\"\",MAX($B$3:B702)+1),\"\")","v":""},{"$f":"IF(Score!B702>0,Score!B702,\"\")","v":""},{"$f":"IF(Score!B702>0,VLOOKUP(C703,Entrants!$A$2:$E$5000,3,FALSE),\"\")","v":""},{"$f":"IF(Score!B702>0,VLOOKUP(C703,Entrants!$A$2:$E$5000,2,FALSE),\"\")","v":""},{"$f":"IF(Score!B702>0,VLOOKUP(C703,Entrants!$A$2:$E$5000,4,FALSE),\"\")","v":""},{"$f":"IF(Score!C702>0,Score!C702,\"\")","v":""}]
[{"$f":"IF(Score!B703>0,Score!A703,\"\")","v":""},{"$f":"IF(Score!B703>0,IF(COUNTIF($E$3:E704,E704)>7,\"\",MAX($B$3:B703)+1),\"\")","v":""},{"$f":"IF(Score!B703>0,Score!B703,\"\")","v":""},{"$f":"IF(Score!B703>0,VLOOKUP(C704,Entrants!$A$2:$E$5000,3,FALSE),\"\")","v":""},{"$f":"IF(Score!B703>0,VLOOKUP(C704,Entrants!$A$2:$E$5000,2,FALSE),\"\")","v":""},{"$f":"IF(Score!B703>0,VLOOKUP(C704,Entrants!$A$2:$E$5000,4,FALSE),\"\")","v":""},{"$f":"IF(Score!C703>0,Score!C703,\"\")","v":""}]
[{"$f":"IF(Score!B704>0,Score!A704,\"\")","v":""},{"$f":"IF(Score!B704>0,IF(COUNTIF($E$3:E705,E705)>7,\"\",MAX($B$3:B704)+1),\"\")","v":""},{"$f":"IF(Score!B704>0,Score!B704,\"\")","v":""},{"$f":"IF(Score!B704>0,VLOOKUP(C705,Entrants!$A$2:$E$5000,3,FALSE),\"\")","v":""},{"$f":"IF(Score!B704>0,VLOOKUP(C705,Entrants!$A$2:$E$5000,2,FALSE),\"\")","v":""},{"$f":"IF(Score!B704>0,VLOOKUP(C705,Entrants!$A$2:$E$5000,4,FALSE),\"\")","v":""},{"$f":"IF(Score!C704>0,Score!C704,\"\")","v":""}]
[{"$f":"IF(Score!B705>0,Score!A705,\"\")","v":""},{"$f":"IF(Score!B705>0,IF(COUNTIF($E$3:E706,E706)>7,\"\",MAX($B$3:B705)+1),\"\")","v":""},{"$f":"IF(Score!B705>0,Score!B705,\"\")","v":""},{"$f":"IF(Score!B705>0,VLOOKUP(C706,Entrants!$A$2:$E$5000,3,FALSE),\"\")","v":""},{"$f":"IF(Score!B705>0,VLOOKUP(C706,Entrants!$A$2:$E$5000,2,FALSE),\"\")","v":""},{"$f":"IF(Score!B705>0,VLOOKUP(C706,Entrants!$A$2:$E$5000,4,FALSE),\"\")","v":""},{"$f":"IF(Score!C705>0,Score!C705,\"\")","v":""}]
[{"$f":"IF(Score!B706>0,Score!A706,\"\")","v":""},{"$f":"IF(Score!B706>0,IF(COUNTIF($E$3:E707,E707)>7,\"\",MAX($B$3:B706)+1),\"\")","v":""},{"$f":"IF(Score!B706>0,Score!B706,\"\")","v":""},{"$f":"IF(Score!B706>0,VLOOKUP(C707,Entrants!$A$2:$E$5000,3,FALSE),\"\")","v":""},{"$f":"IF(Score!B706>0,VLOOKUP(C707,Entrants!$A$2:$E$5000,2,FALSE),\"\")","v":""},{"$f":"IF(Score!B706>0,VLOOKUP(C707,Entrants!$A$2:$E$5000,4,FALSE),\"\")","v":""},{"$f":"IF(Score!C706>0,Score!C706,\"\")","v":""}]
[{"$f":"IF(Score!B707>0,Score!A707,\"\")","v":""},{"$f":"IF(Score!B707>0,IF(COUNTIF($E$3:E708,E708)>7,\"\",MAX($B$3:B707)+1),\"\")","v":""},{"$f":"IF(Score!B707>0,Score!B707,\"\")","v":""},{"$f":"IF(Score!B707>0,VLOOKUP(C708,Entrants!$A$2:$E$5000,3,FALSE),\"\")","v":""},{"$f":"IF(Score!B707>0,VLOOKUP(C708,Entrants!$A$2:$E$5000,2,FALSE),\"\")","v":""},{"$f":"IF(Score!B707>0,VLOOKUP(C708,Entrants!$A$2:$E$5000,4,FALSE),\"\")","v":""},{"$f":"IF(Score!C707>0,Score!C707,\"\")","v":""}]
[{"$f":"IF(Score!B708>0,Score!A708,\"\")","v":""},{"$f":"IF(Score!B708>0,IF(COUNTIF($E$3:E709,E709)>7,\"\",MAX($B$3:B708)+1),\"\")","v":""},{"$f":"IF(Score!B708>0,Score!B708,\"\")","v":""},{"$f":"IF(Score!B708>0,VLOOKUP(C709,Entrants!$A$2:$E$5000,3,FALSE),\"\")","v":""},{"$f":"IF(Score!B708>0,VLOOKUP(C709,Entrants!$A$2:$E$5000,2,FALSE),\"\")","v":""},{"$f":"IF(Score!B708>0,VLOOKUP(C709,Entrants!$A$2:$E$5000,4,FALSE),\"\")","v":""},{"$f":"IF(Score!C708>0,Score!C708,\"\")","v":""}]
[{"$f":"IF(Score!B709>0,Score!A709,\"\")","v":""},{"$f":"IF(Score!B709>0,IF(COUNTIF($E$3:E710,E710)>7,\"\",MAX($B$3:B709)+1),\"\")","v":""},{"$f":"IF(Score!B709>0,Score!B709,\"\")","v":""},{"$f":"IF(Score!B709>0,VLOOKUP(C710,Entrants!$A$2:$E$5000,3,FALSE),\"\")","v":""},{"$f":"IF(Score!B709>0,VLOOKUP(C710,Entrants!$A$2:$E$5000,2,FALSE),\"\")","v":""},{"$f":"IF(Score!B709>0,VLOOKUP(C710,Entrants!$A$2:$E$5000,4,FALSE),\"\")","v":""},{"$f":"IF(Score!C709>0,Score!C709,\"\")","v":""}]
[{"$f":"IF(Score!B710>0,Score!A710,\"\")","v":""},{"$f":"IF(Score!B710>0,IF(COUNTIF($E$3:E711,E711)>7,\"\",MAX($B$3:B710)+1),\"\")","v":""},{"$f":"IF(Score!B710>0,Score!B710,\"\")","v":""},{"$f":"IF(Score!B710>0,VLOOKUP(C711,Entrants!$A$2:$E$5000,3,FALSE),\"\")","v":""},{"$f":"IF(Score!B710>0,VLOOKUP(C711,Entrants!$A$2:$E$5000,2,FALSE),\"\")","v":""},{"$f":"IF(Score!B710>0,VLOOKUP(C711,Entrants!$A$2:$E$5000,4,FALSE),\"\")","v":""},{"$f":"IF(Score!C710>0,Score!C710,\"\")","v":""}]
[{"$f":"IF(Score!B711>0,Score!A711,\"\")","v":""},{"$f":"IF(Score!B711>0,IF(COUNTIF($E$3:E712,E712)>7,\"\",MAX($B$3:B711)+1),\"\")","v":""},{"$f":"IF(Score!B711>0,Score!B711,\"\")","v":""},{"$f":"IF(Score!B711>0,VLOOKUP(C712,Entrants!$A$2:$E$5000,3,FALSE),\"\")","v":""},{"$f":"IF(Score!B711>0,VLOOKUP(C712,Entrants!$A$2:$E$5000,2,FALSE),\"\")","v":""},{"$f":"IF(Score!B711>0,VLOOKUP(C712,Entrants!$A$2:$E$5000,4,FALSE),\"\")","v":""},{"$f":"IF(Score!C711>0,Score!C711,\"\")","v":""}]
[{"$f":"IF(Score!B712>0,Score!A712,\"\")","v":""},{"$f":"IF(Score!B712>0,IF(COUNTIF($E$3:E713,E713)>7,\"\",MAX($B$3:B712)+1),\"\")","v":""},{"$f":"IF(Score!B712>0,Score!B712,\"\")","v":""},{"$f":"IF(Score!B712>0,VLOOKUP(C713,Entrants!$A$2:$E$5000,3,FALSE),\"\")","v":""},{"$f":"IF(Score!B712>0,VLOOKUP(C713,Entrants!$A$2:$E$5000,2,FALSE),\"\")","v":""},{"$f":"IF(Score!B712>0,VLOOKUP(C713,Entrants!$A$2:$E$5000,4,FALSE),\"\")","v":""},{"$f":"IF(Score!C712>0,Score!C712,\"\")","v":""}]
[{"$f":"IF(Score!B713>0,Score!A713,\"\")","v":""},{"$f":"IF(Score!B713>0,IF(COUNTIF($E$3:E714,E714)>7,\"\",MAX($B$3:B713)+1),\"\")","v":""},{"$f":"IF(Score!B713>0,Score!B713,\"\")","v":""},{"$f":"IF(Score!B713>0,VLOOKUP(C714,Entrants!$A$2:$E$5000,3,FALSE),\"\")","v":""},{"$f":"IF(Score!B713>0,VLOOKUP(C714,Entrants!$A$2:$E$5000,2,FALSE),\"\")","v":""},{"$f":"IF(Score!B713>0,VLOOKUP(C714,Entrants!$A$2:$E$5000,4,FALSE),\"\")","v":""},{"$f":"IF(Score!C713>0,Score!C713,\"\")","v":""}]
[{"$f":"IF(Score!B714>0,Score!A714,\"\")","v":""},{"$f":"IF(Score!B714>0,IF(COUNTIF($E$3:E715,E715)>7,\"\",MAX($B$3:B714)+1),\"\")","v":""},{"$f":"IF(Score!B714>0,Score!B714,\"\")","v":""},{"$f":"IF(Score!B714>0,VLOOKUP(C715,Entrants!$A$2:$E$5000,3,FALSE),\"\")","v":""},{"$f":"IF(Score!B714>0,VLOOKUP(C715,Entrants!$A$2:$E$5000,2,FALSE),\"\")","v":""},{"$f":"IF(Score!B714>0,VLOOKUP(C715,Entrants!$A$2:$E$5000,4,FALSE),\"\")","v":""},{"$f":"IF(Score!C714>0,Score!C714,\"\")","v":""}]
[{"$f":"IF(Score!B715>0,Score!A715,\"\")","v":""},{"$f":"IF(Score!B715>0,IF(COUNTIF($E$3:E716,E716)>7,\"\",MAX($B$3:B715)+1),\"\")","v":""},{"$f":"IF(Score!B715>0,Score!B715,\"\")","v":""},{"$f":"IF(Score!B715>0,VLOOKUP(C716,Entrants!$A$2:$E$5000,3,FALSE),\"\")","v":""},{"$f":"IF(Score!B715>0,VLOOKUP(C716,Entrants!$A$2:$E$5000,2,FALSE),\"\")","v":""},{"$f":"IF(Score!B715>0,VLOOKUP(C716,Entrants!$A$2:$E$5000,4,FALSE),\"\")","v":""},{"$f":"IF(Score!C715>0,Score!C715,\"\")","v":""}]
[{"$f":"IF(Score!B716>0,Score!A716,\"\")","v":""},{"$f":"IF(Score!B716>0,IF(COUNTIF($E$3:E717,E717)>7,\"\",MAX($B$3:B716)+1),\"\")","v":""},{"$f":"IF(Score!B716>0,Score!B716,\"\")","v":""},{"$f":"IF(Score!B716>0,VLOOKUP(C717,Entrants!$A$2:$E$5000,3,FALSE),\"\")","v":""},{"$f":"IF(Score!B716>0,VLOOKUP(C717,Entrants!$A$2:$E$5000,2,FALSE),\"\")","v":""},{"$f":"IF(Score!B716>0,VLOOKUP(C717,Entrants!$A$2:$E$5000,4,FALSE),\"\")","v":""},{"$f":"IF(Score!C716>0,Score!C716,\"\")","v":""}]
[{"$f":"IF(Score!B717>0,Score!A717,\"\")","v":""},{"$f":"IF(Score!B717>0,IF(COUNTIF($E$3:E718,E718)>7,\"\",MAX($B$3:B717)+1),\"\")","v":""},{"$f":"IF(Score!B717>0,Score!B717,\"\")","v":""},{"$f":"IF(Score!B717>0,VLOOKUP(C718,Entrants!$A$2:$E$5000,3,FALSE),\"\")","v":""},{"$f":"IF(Score!B717>0,VLOOKUP(C718,Entrants!$A$2:$E$5000,2,FALSE),\"\")","v":""},{"$f":"IF(Score!B717>0,VLOOKUP(C718,Entrants!$A$2:$E$5000,4,FALSE),\"\")","v":""},{"$f":"IF(Score!C717>0,Score!C717,\"\")","v":""}]
[{"$f":"IF(Score!B718>0,Score!A718,\"\")","v":""},{"$f":"IF(Score!B718>0,IF(COUNTIF($E$3:E719,E719)>7,\"\",MAX($B$3:B718)+1),\"\")","v":""},{"$f":"IF(Score!B718>0,Score!B718,\"\")","v":""},{"$f":"IF(Score!B718>0,VLOOKUP(C719,Entrants!$A$2:$E$5000,3,FALSE),\"\")","v":""},{"$f":"IF(Score!B718>0,VLOOKUP(C719,Entrants!$A$2:$E$5000,2,FALSE),\"\")","v":""},{"$f":"IF(Score!B718>0,VLOOKUP(C719,Entrants!$A$2:$E$5000,4,FALSE),\"\")","v":""},{"$f":"IF(Score!C718>0,Score!C718,\"\")","v":""}]
[{"$f":"IF(Score!B719>0,Score!A719,\"\")","v":""},{"$f":"IF(Score!B719>0,IF(COUNTIF($E$3:E720,E720)>7,\"\",MAX($B$3:B719)+1),\"\")","v":""},{"$f":"IF(Score!B719>0,Score!B719,\"\")","v":""},{"$f":"IF(Score!B719>0,VLOOKUP(C720,Entrants!$A$2:$E$5000,3,FALSE),\"\")","v":""},{"$f":"IF(Score!B719>0,VLOOKUP(C720,Entrants!$A$2:$E$5000,2,FALSE),\"\")","v":""},{"$f":"IF(Score!B719>0,VLOOKUP(C720,Entrants!$A$2:$E$5000,4,FALSE),\"\")","v":""},{"$f":"IF(Score!C719>0,Score!C719,\"\")","v":""}]
[{"$f":"IF(Score!B720>0,Score!A720,\"\")","v":""},{"$f":"IF(Score!B720>0,IF(COUNTIF($E$3:E721,E721)>7,\"\",MAX($B$3:B720)+1),\"\")","v":""},{"$f":"IF(Score!B720>0,Score!B720,\"\")","v":""},{"$f":"IF(Score!B720>0,VLOOKUP(C721,Entrants!$A$2:$E$5000,3,FALSE),\"\")","v":""},{"$f":"IF(Score!B720>0,VLOOKUP(C721,Entrants!$A$2:$E$5000,2,FALSE),\"\")","v":""},{"$f":"IF(Score!B720>0,VLOOKUP(C721,Entrants!$A$2:$E$5000,4,FALSE),\"\")","v":""},{"$f":"IF(Score!C720>0,Score!C720,\"\")","v":""}]
[{"$f":"IF(Score!B721>0,Score!A721,\"\")","v":""},{"$f":"IF(Score!B721>0,IF(COUNTIF($E$3:E722,E722)>7,\"\",MAX($B$3:B721)+1),\"\")","v":""},{"$f":"IF(Score!B721>0,Score!B721,\"\")","v":""},{"$f":"IF(Score!B721>0,VLOOKUP(C722,Entrants!$A$2:$E$5000,3,FALSE),\"\")","v":""},{"$f":"IF(Score!B721>0,VLOOKUP(C722,Entrants!$A$2:$E$5000,2,FALSE),\"\")","v":""},{"$f":"IF(Score!B721>0,VLOOKUP(C722,Entrants!$A$2:$E$5000,4,FALSE),\"\")","v":""},{"$f":"IF(Score!C721>0,Score!C721,\"\")","v":""}]
[{"$f":"IF(Score!B722>0,Score!A722,\"\")","v":""},{"$f":"IF(Score!B722>0,IF(COUNTIF($E$3:E723,E723)>7,\"\",MAX($B$3:B722)+1),\"\")","v":""},{"$f":"IF(Score!B722>0,Score!B722,\"\")","v":""},{"$f":"IF(Score!B722>0,VLOOKUP(C723,Entrants!$A$2:$E$5000,3,FALSE),\"\")","v":""},{"$f":"IF(Score!B722>0,VLOOKUP(C723,Entrants!$A$2:$E$5000,2,FALSE),\"\")","v":""},{"$f":"IF(Score!B722>0,VLOOKUP(C723,Entrants!$A$2:$E$5000,4,FALSE),\"\")","v":""},{"$f":"IF(Score!C722>0,Score!C722,\"\")","v":""}]
[{"$f":"IF(Score!B723>0,Score!A723,\"\")","v":""},{"$f":"IF(Score!B723>0,IF(COUNTIF($E$3:E724,E724)>7,\"\",MAX($B$3:B723)+1),\"\")","v":""},{"$f":"IF(Score!B723>0,Score!B723,\"\")","v":""},{"$f":"IF(Score!B723>0,VLOOKUP(C724,Entrants!$A$2:$E$5000,3,FALSE),\"\")","v":""},{"$f":"IF(Score!B723>0,VLOOKUP(C724,Entrants!$A$2:$E$5000,2,FALSE),\"\")","v":""},{"$f":"IF(Score!B723>0,VLOOKUP(C724,Entrants!$A$2:$E$5000,4,FALSE),\"\")","v":""},{"$f":"IF(Score!C723>0,Score!C723,\"\")","v":""}]
[{"$f":"IF(Score!B724>0,Score!A724,\"\")","v":""},{"$f":"IF(Score!B724>0,IF(COUNTIF($E$3:E725,E725)>7,\"\",MAX($B$3:B724)+1),\"\")","v":""},{"$f":"IF(Score!B724>0,Score!B724,\"\")","v":""},{"$f":"IF(Score!B724>0,VLOOKUP(C725,Entrants!$A$2:$E$5000,3,FALSE),\"\")","v":""},{"$f":"IF(Score!B724>0,VLOOKUP(C725,Entrants!$A$2:$E$5000,2,FALSE),\"\")","v":""},{"$f":"IF(Score!B724>0,VLOOKUP(C725,Entrants!$A$2:$E$5000,4,FALSE),\"\")","v":""},{"$f":"IF(Score!C724>0,Score!C724,\"\")","v":""}]
[{"$f":"IF(Score!B725>0,Score!A725,\"\")","v":""},{"$f":"IF(Score!B725>0,IF(COUNTIF($E$3:E726,E726)>7,\"\",MAX($B$3:B725)+1),\"\")","v":""},{"$f":"IF(Score!B725>0,Score!B725,\"\")","v":""},{"$f":"IF(Score!B725>0,VLOOKUP(C726,Entrants!$A$2:$E$5000,3,FALSE),\"\")","v":""},{"$f":"IF(Score!B725>0,VLOOKUP(C726,Entrants!$A$2:$E$5000,2,FALSE),\"\")","v":""},{"$f":"IF(Score!B725>0,VLOOKUP(C726,Entrants!$A$2:$E$5000,4,FALSE),\"\")","v":""},{"$f":"IF(Score!C725>0,Score!C725,\"\")","v":""}]
[{"$f":"IF(Score!B726>0,Score!A726,\"\")","v":""},{"$f":"IF(Score!B726>0,IF(COUNTIF($E$3:E727,E727)>7,\"\",MAX($B$3:B726)+1),\"\")","v":""},{"$f":"IF(Score!B726>0,Score!B726,\"\")","v":""},{"$f":"IF(Score!B726>0,VLOOKUP(C727,Entrants!$A$2:$E$5000,3,FALSE),\"\")","v":""},{"$f":"IF(Score!B726>0,VLOOKUP(C727,Entrants!$A$2:$E$5000,2,FALSE),\"\")","v":""},{"$f":"IF(Score!B726>0,VLOOKUP(C727,Entrants!$A$2:$E$5000,4,FALSE),\"\")","v":""},{"$f":"IF(Score!C726>0,Score!C726,\"\")","v":""}]
[{"$f":"IF(Score!B727>0,Score!A727,\"\")","v":""},{"$f":"IF(Score!B727>0,IF(COUNTIF($E$3:E728,E728)>7,\"\",MAX($B$3:B727)+1),\"\")","v":""},{"$f":"IF(Score!B727>0,Score!B727,\"\")","v":""},{"$f":"IF(Score!B727>0,VLOOKUP(C728,Entrants!$A$2:$E$5000,3,FALSE),\"\")","v":""},{"$f":"IF(Score!B727>0,VLOOKUP(C728,Entrants!$A$2:$E$5000,2,FALSE),\"\")","v":""},{"$f":"IF(Score!B727>0,VLOOKUP(C728,Entrants!$A$2:$E$5000,4,FALSE),\"\")","v":""},{"$f":"IF(Score!C727>0,Score!C727,\"\")","v":""}]
[{"$f":"IF(Score!B728>0,Score!A728,\"\")","v":""},{"$f":"IF(Score!B728>0,IF(COUNTIF($E$3:E729,E729)>7,\"\",MAX($B$3:B728)+1),\"\")","v":""},{"$f":"IF(Score!B728>0,Score!B728,\"\")","v":""},{"$f":"IF(Score!B728>0,VLOOKUP(C729,Entrants!$A$2:$E$5000,3,FALSE),\"\")","v":""},{"$f":"IF(Score!B728>0,VLOOKUP(C729,Entrants!$A$2:$E$5000,2,FALSE),\"\")","v":""},{"$f":"IF(Score!B728>0,VLOOKUP(C729,Entrants!$A$2:$E$5000,4,FALSE),\"\")","v":""},{"$f":"IF(Score!C728>0,Score!C728,\"\")","v":""}]
[{"$f":"IF(Score!B729>0,Score!A729,\"\")","v":""},{"$f":"IF(Score!B729>0,IF(COUNTIF($E$3:E730,E730)>7,\"\",MAX($B$3:B729)+1),\"\")","v":""},{"$f":"IF(Score!B729>0,Score!B729,\"\")","v":""},{"$f":"IF(Score!B729>0,VLOOKUP(C730,Entrants!$A$2:$E$5000,3,FALSE),\"\")","v":""},{"$f":"IF(Score!B729>0,VLOOKUP(C730,Entrants!$A$2:$E$5000,2,FALSE),\"\")","v":""},{"$f":"IF(Score!B729>0,VLOOKUP(C730,Entrants!$A$2:$E$5000,4,FALSE),\"\")","v":""},{"$f":"IF(Score!C729>0,Score!C729,\"\")","v":""}]
[{"$f":"IF(Score!B730>0,Score!A730,\"\")","v":""},{"$f":"IF(Score!B730>0,IF(COUNTIF($E$3:E731,E731)>7,\"\",MAX($B$3:B730)+1),\"\")","v":""},{"$f":"IF(Score!B730>0,Score!B730,\"\")","v":""},{"$f":"IF(Score!B730>0,VLOOKUP(C731,Entrants!$A$2:$E$5000,3,FALSE),\"\")","v":""},{"$f":"IF(Score!B730>0,VLOOKUP(C731,Entrants!$A$2:$E$5000,2,FALSE),\"\")","v":""},{"$f":"IF(Score!B730>0,VLOOKUP(C731,Entrants!$A$2:$E$5000,4,FALSE),\"\")","v":""},{"$f":"IF(Score!C730>0,Score!C730,\"\")","v":""}]
[{"$f":"IF(Score!B731>0,Score!A731,\"\")","v":""},{"$f":"IF(Score!B731>0,IF(COUNTIF($E$3:E732,E732)>7,\"\",MAX($B$3:B731)+1),\"\")","v":""},{"$f":"IF(Score!B731>0,Score!B731,\"\")","v":""},{"$f":"IF(Score!B731>0,VLOOKUP(C732,Entrants!$A$2:$E$5000,3,FALSE),\"\")","v":""},{"$f":"IF(Score!B731>0,VLOOKUP(C732,Entrants!$A$2:$E$5000,2,FALSE),\"\")","v":""},{"$f":"IF(Score!B731>0,VLOOKUP(C732,Entrants!$A$2:$E$5000,4,FALSE),\"\")","v":""},{"$f":"IF(Score!C731>0,Score!C731,\"\")","v":""}]
[{"$f":"IF(Score!B732>0,Score!A732,\"\")","v":""},{"$f":"IF(Score!B732>0,IF(COUNTIF($E$3:E733,E733)>7,\"\",MAX($B$3:B732)+1),\"\")","v":""},{"$f":"IF(Score!B732>0,Score!B732,\"\")","v":""},{"$f":"IF(Score!B732>0,VLOOKUP(C733,Entrants!$A$2:$E$5000,3,FALSE),\"\")","v":""},{"$f":"IF(Score!B732>0,VLOOKUP(C733,Entrants!$A$2:$E$5000,2,FALSE),\"\")","v":""},{"$f":"IF(Score!B732>0,VLOOKUP(C733,Entrants!$A$2:$E$5000,4,FALSE),\"\")","v":""},{"$f":"IF(Score!C732>0,Score!C732,\"\")","v":""}]
[{"$f":"IF(Score!B733>0,Score!A733,\"\")","v":""},{"$f":"IF(Score!B733>0,IF(COUNTIF($E$3:E734,E734)>7,\"\",MAX($B$3:B733)+1),\"\")","v":""},{"$f":"IF(Score!B733>0,Score!B733,\"\")","v":""},{"$f":"IF(Score!B733>0,VLOOKUP(C734,Entrants!$A$2:$E$5000,3,FALSE),\"\")","v":""},{"$f":"IF(Score!B733>0,VLOOKUP(C734,Entrants!$A$2:$E$5000,2,FALSE),\"\")","v":""},{"$f":"IF(Score!B733>0,VLOOKUP(C734,Entrants!$A$2:$E$5000,4,FALSE),\"\")","v":""},{"$f":"IF(Score!C733>0,Score!C733,\"\")","v":""}]
[{"$f":"IF(Score!B734>0,Score!A734,\"\")","v":""},{"$f":"IF(Score!B734>0,IF(COUNTIF($E$3:E735,E735)>7,\"\",MAX($B$3:B734)+1),\"\")","v":""},{"$f":"IF(Score!B734>0,Score!B734,\"\")","v":""},{"$f":"IF(Score!B734>0,VLOOKUP(C735,Entrants!$A$2:$E$5000,3,FALSE),\"\")","v":""},{"$f":"IF(Score!B734>0,VLOOKUP(C735,Entrants!$A$2:$E$5000,2,FALSE),\"\")","v":""},{"$f":"IF(Score!B734>0,VLOOKUP(C735,Entrants!$A$2:$E$5000,4,FALSE),\"\")","v":""},{"$f":"IF(Score!C734>0,Score!C734,\"\")","v":""}]
[{"$f":"IF(Score!B735>0,Score!A735,\"\")","v":""},{"$f":"IF(Score!B735>0,IF(COUNTIF($E$3:E736,E736)>7,\"\",MAX($B$3:B735)+1),\"\")","v":""},{"$f":"IF(Score!B735>0,Score!B735,\"\")","v":""},{"$f":"IF(Score!B735>0,VLOOKUP(C736,Entrants!$A$2:$E$5000,3,FALSE),\"\")","v":""},{"$f":"IF(Score!B735>0,VLOOKUP(C736,Entrants!$A$2:$E$5000,2,FALSE),\"\")","v":""},{"$f":"IF(Score!B735>0,VLOOKUP(C736,Entrants!$A$2:$E$5000,4,FALSE),\"\")","v":""},{"$f":"IF(Score!C735>0,Score!C735,\"\")","v":""}]
[{"$f":"IF(Score!B736>0,Score!A736,\"\")","v":""},{"$f":"IF(Score!B736>0,IF(COUNTIF($E$3:E737,E737)>7,\"\",MAX($B$3:B736)+1),\"\")","v":""},{"$f":"IF(Score!B736>0,Score!B736,\"\")","v":""},{"$f":"IF(Score!B736>0,VLOOKUP(C737,Entrants!$A$2:$E$5000,3,FALSE),\"\")","v":""},{"$f":"IF(Score!B736>0,VLOOKUP(C737,Entrants!$A$2:$E$5000,2,FALSE),\"\")","v":""},{"$f":"IF(Score!B736>0,VLOOKUP(C737,Entrants!$A$2:$E$5000,4,FALSE),\"\")","v":""},{"$f":"IF(Score!C736>0,Score!C736,\"\")","v":""}]
[{"$f":"IF(Score!B737>0,Score!A737,\"\")","v":""},{"$f":"IF(Score!B737>0,IF(COUNTIF($E$3:E738,E738)>7,\"\",MAX($B$3:B737)+1),\"\")","v":""},{"$f":"IF(Score!B737>0,Score!B737,\"\")","v":""},{"$f":"IF(Score!B737>0,VLOOKUP(C738,Entrants!$A$2:$E$5000,3,FALSE),\"\")","v":""},{"$f":"IF(Score!B737>0,VLOOKUP(C738,Entrants!$A$2:$E$5000,2,FALSE),\"\")","v":""},{"$f":"IF(Score!B737>0,VLOOKUP(C738,Entrants!$A$2:$E$5000,4,FALSE),\"\")","v":""},{"$f":"IF(Score!C737>0,Score!C737,\"\")","v":""}]
[{"$f":"IF(Score!B738>0,Score!A738,\"\")","v":""},{"$f":"IF(Score!B738>0,IF(COUNTIF($E$3:E739,E739)>7,\"\",MAX($B$3:B738)+1),\"\")","v":""},{"$f":"IF(Score!B738>0,Score!B738,\"\")","v":""},{"$f":"IF(Score!B738>0,VLOOKUP(C739,Entrants!$A$2:$E$5000,3,FALSE),\"\")","v":""},{"$f":"IF(Score!B738>0,VLOOKUP(C739,Entrants!$A$2:$E$5000,2,FALSE),\"\")","v":""},{"$f":"IF(Score!B738>0,VLOOKUP(C739,Entrants!$A$2:$E$5000,4,FALSE),\"\")","v":""},{"$f":"IF(Score!C738>0,Score!C738,\"\")","v":""}]
[{"$f":"IF(Score!B739>0,Score!A739,\"\")","v":""},{"$f":"IF(Score!B739>0,IF(COUNTIF($E$3:E740,E740)>7,\"\",MAX($B$3:B739)+1),\"\")","v":""},{"$f":"IF(Score!B739>0,Score!B739,\"\")","v":""},{"$f":"IF(Score!B739>0,VLOOKUP(C740,Entrants!$A$2:$E$5000,3,FALSE),\"\")","v":""},{"$f":"IF(Score!B739>0,VLOOKUP(C740,Entrants!$A$2:$E$5000,2,FALSE),\"\")","v":""},{"$f":"IF(Score!B739>0,VLOOKUP(C740,Entrants!$A$2:$E$5000,4,FALSE),\"\")","v":""},{"$f":"IF(Score!C739>0,Score!C739,\"\")","v":""}]
[{"$f":"IF(Score!B740>0,Score!A740,\"\")","v":""},{"$f":"IF(Score!B740>0,IF(COUNTIF($E$3:E741,E741)>7,\"\",MAX($B$3:B740)+1),\"\")","v":""},{"$f":"IF(Score!B740>0,Score!B740,\"\")","v":""},{"$f":"IF(Score!B740>0,VLOOKUP(C741,Entrants!$A$2:$E$5000,3,FALSE),\"\")","v":""},{"$f":"IF(Score!B740>0,VLOOKUP(C741,Entrants!$A$2:$E$5000,2,FALSE),\"\")","v":""},{"$f":"IF(Score!B740>0,VLOOKUP(C741,Entrants!$A$2:$E$5000,4,FALSE),\"\")","v":""},{"$f":"IF(Score!C740>0,Score!C740,\"\")","v":""}]
[{"$f":"IF(Score!B741>0,Score!A741,\"\")","v":""},{"$f":"IF(Score!B741>0,IF(COUNTIF($E$3:E742,E742)>7,\"\",MAX($B$3:B741)+1),\"\")","v":""},{"$f":"IF(Score!B741>0,Score!B741,\"\")","v":""},{"$f":"IF(Score!B741>0,VLOOKUP(C742,Entrants!$A$2:$E$5000,3,FALSE),\"\")","v":""},{"$f":"IF(Score!B741>0,VLOOKUP(C742,Entrants!$A$2:$E$5000,2,FALSE),\"\")","v":""},{"$f":"IF(Score!B741>0,VLOOKUP(C742,Entrants!$A$2:$E$5000,4,FALSE),\"\")","v":""},{"$f":"IF(Score!C741>0,Score!C741,\"\")","v":""}]
[{"$f":"IF(Score!B742>0,Score!A742,\"\")","v":""},{"$f":"IF(Score!B742>0,IF(COUNTIF($E$3:E743,E743)>7,\"\",MAX($B$3:B742)+1),\"\")","v":""},{"$f":"IF(Score!B742>0,Score!B742,\"\")","v":""},{"$f":"IF(Score!B742>0,VLOOKUP(C743,Entrants!$A$2:$E$5000,3,FALSE),\"\")","v":""},{"$f":"IF(Score!B742>0,VLOOKUP(C743,Entrants!$A$2:$E$5000,2,FALSE),\"\")","v":""},{"$f":"IF(Score!B742>0,VLOOKUP(C743,Entrants!$A$2:$E$5000,4,FALSE),\"\")","v":""},{"$f":"IF(Score!C742>0,Score!C742,\"\")","v":""}]
[{"$f":"IF(Score!B743>0,Score!A743,\"\")","v":""},{"$f":"IF(Score!B743>0,IF(COUNTIF($E$3:E744,E744)>7,\"\",MAX($B$3:B743)+1),\"\")","v":""},{"$f":"IF(Score!B743>0,Score!B743,\"\")","v":""},{"$f":"IF(Score!B743>0,VLOOKUP(C744,Entrants!$A$2:$E$5000,3,FALSE),\"\")","v":""},{"$f":"IF(Score!B743>0,VLOOKUP(C744,Entrants!$A$2:$E$5000,2,FALSE),\"\")","v":""},{"$f":"IF(Score!B743>0,VLOOKUP(C744,Entrants!$A$2:$E$5000,4,FALSE),\"\")","v":""},{"$f":"IF(Score!C743>0,Score!C743,\"\")","v":""}]
[{"$f":"IF(Score!B744>0,Score!A744,\"\")","v":""},{"$f":"IF(Score!B744>0,IF(COUNTIF($E$3:E745,E745)>7,\"\",MAX($B$3:B744)+1),\"\")","v":""},{"$f":"IF(Score!B744>0,Score!B744,\"\")","v":""},{"$f":"IF(Score!B744>0,VLOOKUP(C745,Entrants!$A$2:$E$5000,3,FALSE),\"\")","v":""},{"$f":"IF(Score!B744>0,VLOOKUP(C745,Entrants!$A$2:$E$5000,2,FALSE),\"\")","v":""},{"$f":"IF(Score!B744>0,VLOOKUP(C745,Entrants!$A$2:$E$5000,4,FALSE),\"\")","v":""},{"$f":"IF(Score!C744>0,Score!C744,\"\")","v":""}]
[{"$f":"IF(Score!B745>0,Score!A745,\"\")","v":""},{"$f":"IF(Score!B745>0,IF(COUNTIF($E$3:E746,E746)>7,\"\",MAX($B$3:B745)+1),\"\")","v":""},{"$f":"IF(Score!B745>0,Score!B745,\"\")","v":""},{"$f":"IF(Score!B745>0,VLOOKUP(C746,Entrants!$A$2:$E$5000,3,FALSE),\"\")","v":""},{"$f":"IF(Score!B745>0,VLOOKUP(C746,Entrants!$A$2:$E$5000,2,FALSE),\"\")","v":""},{"$f":"IF(Score!B745>0,VLOOKUP(C746,Entrants!$A$2:$E$5000,4,FALSE),\"\")","v":""},{"$f":"IF(Score!C745>0,Score!C745,\"\")","v":""}]
[{"$f":"IF(Score!B746>0,Score!A746,\"\")","v":""},{"$f":"IF(Score!B746>0,IF(COUNTIF($E$3:E747,E747)>7,\"\",MAX($B$3:B746)+1),\"\")","v":""},{"$f":"IF(Score!B746>0,Score!B746,\"\")","v":""},{"$f":"IF(Score!B746>0,VLOOKUP(C747,Entrants!$A$2:$E$5000,3,FALSE),\"\")","v":""},{"$f":"IF(Score!B746>0,VLOOKUP(C747,Entrants!$A$2:$E$5000,2,FALSE),\"\")","v":""},{"$f":"IF(Score!B746>0,VLOOKUP(C747,Entrants!$A$2:$E$5000,4,FALSE),\"\")","v":""},{"$f":"IF(Score!C746>0,Score!C746,\"\")","v":""}]
[{"$f":"IF(Score!B747>0,Score!A747,\"\")","v":""},{"$f":"IF(Score!B747>0,IF(COUNTIF($E$3:E748,E748)>7,\"\",MAX($B$3:B747)+1),\"\")","v":""},{"$f":"IF(Score!B747>0,Score!B747,\"\")","v":""},{"$f":"IF(Score!B747>0,VLOOKUP(C748,Entrants!$A$2:$E$5000,3,FALSE),\"\")","v":""},{"$f":"IF(Score!B747>0,VLOOKUP(C748,Entrants!$A$2:$E$5000,2,FALSE),\"\")","v":""},{"$f":"IF(Score!B747>0,VLOOKUP(C748,Entrants!$A$2:$E$5000,4,FALSE),\"\")","v":""},{"$f":"IF(Score!C747>0,Score!C747,\"\")","v":""}]
[{"$f":"IF(Score!B748>0,Score!A748,\"\")","v":""},{"$f":"IF(Score!B748>0,IF(COUNTIF($E$3:E749,E749)>7,\"\",MAX($B$3:B748)+1),\"\")","v":""},{"$f":"IF(Score!B748>0,Score!B748,\"\")","v":""},{"$f":"IF(Score!B748>0,VLOOKUP(C749,Entrants!$A$2:$E$5000,3,FALSE),\"\")","v":""},{"$f":"IF(Score!B748>0,VLOOKUP(C749,Entrants!$A$2:$E$5000,2,FALSE),\"\")","v":""},{"$f":"IF(Score!B748>0,VLOOKUP(C749,Entrants!$A$2:$E$5000,4,FALSE),\"\")","v":""},{"$f":"IF(Score!C748>0,Score!C748,\"\")","v":""}]
[{"$f":"IF(Score!B749>0,Score!A749,\"\")","v":""},{"$f":"IF(Score!B749>0,IF(COUNTIF($E$3:E750,E750)>7,\"\",MAX($B$3:B749)+1),\"\")","v":""},{"$f":"IF(Score!B749>0,Score!B749,\"\")","v":""},{"$f":"IF(Score!B749>0,VLOOKUP(C750,Entrants!$A$2:$E$5000,3,FALSE),\"\")","v":""},{"$f":"IF(Score!B749>0,VLOOKUP(C750,Entrants!$A$2:$E$5000,2,FALSE),\"\")","v":""},{"$f":"IF(Score!B749>0,VLOOKUP(C750,Entrants!$A$2:$E$5000,4,FALSE),\"\")","v":""},{"$f":"IF(Score!C749>0,Score!C749,\"\")","v":""}]
[{"$f":"IF(Score!B750>0,Score!A750,\"\")","v":""},{"$f":"IF(Score!B750>0,IF(COUNTIF($E$3:E751,E751)>7,\"\",MAX($B$3:B750)+1),\"\")","v":""},{"$f":"IF(Score!B750>0,Score!B750,\"\")","v":""},{"$f":"IF(Score!B750>0,VLOOKUP(C751,Entrants!$A$2:$E$5000,3,FALSE),\"\")","v":""},{"$f":"IF(Score!B750>0,VLOOKUP(C751,Entrants!$A$2:$E$5000,2,FALSE),\"\")","v":""},{"$f":"IF(Score!B750>0,VLOOKUP(C751,Entrants!$A$2:$E$5000,4,FALSE),\"\")","v":""},{"$f":"IF(Score!C750>0,Score!C750,\"\")","v":""}]
[{"$f":"IF(Score!B751>0,Score!A751,\"\")","v":""},{"$f":"IF(Score!B751>0,IF(COUNTIF($E$3:E752,E752)>7,\"\",MAX($B$3:B751)+1),\"\")","v":""},{"$f":"IF(Score!B751>0,Score!B751,\"\")","v":""},{"$f":"IF(Score!B751>0,VLOOKUP(C752,Entrants!$A$2:$E$5000,3,FALSE),\"\")","v":""},{"$f":"IF(Score!B751>0,VLOOKUP(C752,Entrants!$A$2:$E$5000,2,FALSE),\"\")","v":""},{"$f":"IF(Score!B751>0,VLOOKUP(C752,Entrants!$A$2:$E$5000,4,FALSE),\"\")","v":""},{"$f":"IF(Score!C751>0,Score!C751,\"\")","v":""}]
[{"$f":"IF(Score!B752>0,Score!A752,\"\")","v":""},{"$f":"IF(Score!B752>0,IF(COUNTIF($E$3:E753,E753)>7,\"\",MAX($B$3:B752)+1),\"\")","v":""},{"$f":"IF(Score!B752>0,Score!B752,\"\")","v":""},{"$f":"IF(Score!B752>0,VLOOKUP(C753,Entrants!$A$2:$E$5000,3,FALSE),\"\")","v":""},{"$f":"IF(Score!B752>0,VLOOKUP(C753,Entrants!$A$2:$E$5000,2,FALSE),\"\")","v":""},{"$f":"IF(Score!B752>0,VLOOKUP(C753,Entrants!$A$2:$E$5000,4,FALSE),\"\")","v":""},{"$f":"IF(Score!C752>0,Score!C752,\"\")","v":""}]
[{"$f":"IF(Score!B753>0,Score!A753,\"\")","v":""},{"$f":"IF(Score!B753>0,IF(COUNTIF($E$3:E754,E754)>7,\"\",MAX($B$3:B753)+1),\"\")","v":""},{"$f":"IF(Score!B753>0,Score!B753,\"\")","v":""},{"$f":"IF(Score!B753>0,VLOOKUP(C754,Entrants!$A$2:$E$5000,3,FALSE),\"\")","v":""},{"$f":"IF(Score!B753>0,VLOOKUP(C754,Entrants!$A$2:$E$5000,2,FALSE),\"\")","v":""},{"$f":"IF(Score!B753>0,VLOOKUP(C754,Entrants!$A$2:$E$5000,4,FALSE),\"\")","v":""},{"$f":"IF(Score!C753>0,Score!C753,\"\")","v":""}]
[{"$f":"IF(Score!B754>0,Score!A754,\"\")","v":""},{"$f":"IF(Score!B754>0,IF(COUNTIF($E$3:E755,E755)>7,\"\",MAX($B$3:B754)+1),\"\")","v":""},{"$f":"IF(Score!B754>0,Score!B754,\"\")","v":""},{"$f":"IF(Score!B754>0,VLOOKUP(C755,Entrants!$A$2:$E$5000,3,FALSE),\"\")","v":""},{"$f":"IF(Score!B754>0,VLOOKUP(C755,Entrants!$A$2:$E$5000,2,FALSE),\"\")","v":""},{"$f":"IF(Score!B754>0,VLOOKUP(C755,Entrants!$A$2:$E$5000,4,FALSE),\"\")","v":""},{"$f":"IF(Score!C754>0,Score!C754,\"\")","v":""}]
[{"$f":"IF(Score!B755>0,Score!A755,\"\")","v":""},{"$f":"IF(Score!B755>0,IF(COUNTIF($E$3:E756,E756)>7,\"\",MAX($B$3:B755)+1),\"\")","v":""},{"$f":"IF(Score!B755>0,Score!B755,\"\")","v":""},{"$f":"IF(Score!B755>0,VLOOKUP(C756,Entrants!$A$2:$E$5000,3,FALSE),\"\")","v":""},{"$f":"IF(Score!B755>0,VLOOKUP(C756,Entrants!$A$2:$E$5000,2,FALSE),\"\")","v":""},{"$f":"IF(Score!B755>0,VLOOKUP(C756,Entrants!$A$2:$E$5000,4,FALSE),\"\")","v":""},{"$f":"IF(Score!C755>0,Score!C755,\"\")","v":""}]
[{"$f":"IF(Score!B756>0,Score!A756,\"\")","v":""},{"$f":"IF(Score!B756>0,IF(COUNTIF($E$3:E757,E757)>7,\"\",MAX($B$3:B756)+1),\"\")","v":""},{"$f":"IF(Score!B756>0,Score!B756,\"\")","v":""},{"$f":"IF(Score!B756>0,VLOOKUP(C757,Entrants!$A$2:$E$5000,3,FALSE),\"\")","v":""},{"$f":"IF(Score!B756>0,VLOOKUP(C757,Entrants!$A$2:$E$5000,2,FALSE),\"\")","v":""},{"$f":"IF(Score!B756>0,VLOOKUP(C757,Entrants!$A$2:$E$5000,4,FALSE),\"\")","v":""},{"$f":"IF(Score!C756>0,Score!C756,\"\")","v":""}]
[{"$f":"IF(Score!B757>0,Score!A757,\"\")","v":""},{"$f":"IF(Score!B757>0,IF(COUNTIF($E$3:E758,E758)>7,\"\",MAX($B$3:B757)+1),\"\")","v":""},{"$f":"IF(Score!B757>0,Score!B757,\"\")","v":""},{"$f":"IF(Score!B757>0,VLOOKUP(C758,Entrants!$A$2:$E$5000,3,FALSE),\"\")","v":""},{"$f":"IF(Score!B757>0,VLOOKUP(C758,Entrants!$A$2:$E$5000,2,FALSE),\"\")","v":""},{"$f":"IF(Score!B757>0,VLOOKUP(C758,Entrants!$A$2:$E$5000,4,FALSE),\"\")","v":""},{"$f":"IF(Score!C757>0,Score!C757,\"\")","v":""}]
[{"$f":"IF(Score!B758>0,Score!A758,\"\")","v":""},{"$f":"IF(Score!B758>0,IF(COUNTIF($E$3:E759,E759)>7,\"\",MAX($B$3:B758)+1),\"\")","v":""},{"$f":"IF(Score!B758>0,Score!B758,\"\")","v":""},{"$f":"IF(Score!B758>0,VLOOKUP(C759,Entrants!$A$2:$E$5000,3,FALSE),\"\")","v":""},{"$f":"IF(Score!B758>0,VLOOKUP(C759,Entrants!$A$2:$E$5000,2,FALSE),\"\")","v":""},{"$f":"IF(Score!B758>0,VLOOKUP(C759,Entrants!$A$2:$E$5000,4,FALSE),\"\")","v":""},{"$f":"IF(Score!C758>0,Score!C758,\"\")","v":""}]
[{"$f":"IF(Score!B759>0,Score!A759,\"\")","v":""},{"$f":"IF(Score!B759>0,IF(COUNTIF($E$3:E760,E760)>7,\"\",MAX($B$3:B759)+1),\"\")","v":""},{"$f":"IF(Score!B759>0,Score!B759,\"\")","v":""},{"$f":"IF(Score!B759>0,VLOOKUP(C760,Entrants!$A$2:$E$5000,3,FALSE),\"\")","v":""},{"$f":"IF(Score!B759>0,VLOOKUP(C760,Entrants!$A$2:$E$5000,2,FALSE),\"\")","v":""},{"$f":"IF(Score!B759>0,VLOOKUP(C760,Entrants!$A$2:$E$5000,4,FALSE),\"\")","v":""},{"$f":"IF(Score!C759>0,Score!C759,\"\")","v":""}]
[{"$f":"IF(Score!B760>0,Score!A760,\"\")","v":""},{"$f":"IF(Score!B760>0,IF(COUNTIF($E$3:E761,E761)>7,\"\",MAX($B$3:B760)+1),\"\")","v":""},{"$f":"IF(Score!B760>0,Score!B760,\"\")","v":""},{"$f":"IF(Score!B760>0,VLOOKUP(C761,Entrants!$A$2:$E$5000,3,FALSE),\"\")","v":""},{"$f":"IF(Score!B760>0,VLOOKUP(C761,Entrants!$A$2:$E$5000,2,FALSE),\"\")","v":""},{"$f":"IF(Score!B760>0,VLOOKUP(C761,Entrants!$A$2:$E$5000,4,FALSE),\"\")","v":""},{"$f":"IF(Score!C760>0,Score!C760,\"\")","v":""}]
[{"$f":"IF(Score!B761>0,Score!A761,\"\")","v":""},{"$f":"IF(Score!B761>0,IF(COUNTIF($E$3:E762,E762)>7,\"\",MAX($B$3:B761)+1),\"\")","v":""},{"$f":"IF(Score!B761>0,Score!B761,\"\")","v":""},{"$f":"IF(Score!B761>0,VLOOKUP(C762,Entrants!$A$2:$E$5000,3,FALSE),\"\")","v":""},{"$f":"IF(Score!B761>0,VLOOKUP(C762,Entrants!$A$2:$E$5000,2,FALSE),\"\")","v":""},{"$f":"IF(Score!B761>0,VLOOKUP(C762,Entrants!$A$2:$E$5000,4,FALSE),\"\")","v":""},{"$f":"IF(Score!C761>0,Score!C761,\"\")","v":""}]
[{"$f":"IF(Score!B762>0,Score!A762,\"\")","v":""},{"$f":"IF(Score!B762>0,IF(COUNTIF($E$3:E763,E763)>7,\"\",MAX($B$3:B762)+1),\"\")","v":""},{"$f":"IF(Score!B762>0,Score!B762,\"\")","v":""},{"$f":"IF(Score!B762>0,VLOOKUP(C763,Entrants!$A$2:$E$5000,3,FALSE),\"\")","v":""},{"$f":"IF(Score!B762>0,VLOOKUP(C763,Entrants!$A$2:$E$5000,2,FALSE),\"\")","v":""},{"$f":"IF(Score!B762>0,VLOOKUP(C763,Entrants!$A$2:$E$5000,4,FALSE),\"\")","v":""},{"$f":"IF(Score!C762>0,Score!C762,\"\")","v":""}]
[{"$f":"IF(Score!B763>0,Score!A763,\"\")","v":""},{"$f":"IF(Score!B763>0,IF(COUNTIF($E$3:E764,E764)>7,\"\",MAX($B$3:B763)+1),\"\")","v":""},{"$f":"IF(Score!B763>0,Score!B763,\"\")","v":""},{"$f":"IF(Score!B763>0,VLOOKUP(C764,Entrants!$A$2:$E$5000,3,FALSE),\"\")","v":""},{"$f":"IF(Score!B763>0,VLOOKUP(C764,Entrants!$A$2:$E$5000,2,FALSE),\"\")","v":""},{"$f":"IF(Score!B763>0,VLOOKUP(C764,Entrants!$A$2:$E$5000,4,FALSE),\"\")","v":""},{"$f":"IF(Score!C763>0,Score!C763,\"\")","v":""}]
[{"$f":"IF(Score!B764>0,Score!A764,\"\")","v":""},{"$f":"IF(Score!B764>0,IF(COUNTIF($E$3:E765,E765)>7,\"\",MAX($B$3:B764)+1),\"\")","v":""},{"$f":"IF(Score!B764>0,Score!B764,\"\")","v":""},{"$f":"IF(Score!B764>0,VLOOKUP(C765,Entrants!$A$2:$E$5000,3,FALSE),\"\")","v":""},{"$f":"IF(Score!B764>0,VLOOKUP(C765,Entrants!$A$2:$E$5000,2,FALSE),\"\")","v":""},{"$f":"IF(Score!B764>0,VLOOKUP(C765,Entrants!$A$2:$E$5000,4,FALSE),\"\")","v":""},{"$f":"IF(Score!C764>0,Score!C764,\"\")","v":""}]
[{"$f":"IF(Score!B765>0,Score!A765,\"\")","v":""},{"$f":"IF(Score!B765>0,IF(COUNTIF($E$3:E766,E766)>7,\"\",MAX($B$3:B765)+1),\"\")","v":""},{"$f":"IF(Score!B765>0,Score!B765,\"\")","v":""},{"$f":"IF(Score!B765>0,VLOOKUP(C766,Entrants!$A$2:$E$5000,3,FALSE),\"\")","v":""},{"$f":"IF(Score!B765>0,VLOOKUP(C766,Entrants!$A$2:$E$5000,2,FALSE),\"\")","v":""},{"$f":"IF(Score!B765>0,VLOOKUP(C766,Entrants!$A$2:$E$5000,4,FALSE),\"\")","v":""},{"$f":"IF(Score!C765>0,Score!C765,\"\")","v":""}]
[{"$f":"IF(Score!B766>0,Score!A766,\"\")","v":""},{"$f":"IF(Score!B766>0,IF(COUNTIF($E$3:E767,E767)>7,\"\",MAX($B$3:B766)+1),\"\")","v":""},{"$f":"IF(Score!B766>0,Score!B766,\"\")","v":""},{"$f":"IF(Score!B766>0,VLOOKUP(C767,Entrants!$A$2:$E$5000,3,FALSE),\"\")","v":""},{"$f":"IF(Score!B766>0,VLOOKUP(C767,Entrants!$A$2:$E$5000,2,FALSE),\"\")","v":""},{"$f":"IF(Score!B766>0,VLOOKUP(C767,Entrants!$A$2:$E$5000,4,FALSE),\"\")","v":""},{"$f":"IF(Score!C766>0,Score!C766,\"\")","v":""}]
[{"$f":"IF(Score!B767>0,Score!A767,\"\")","v":""},{"$f":"IF(Score!B767>0,IF(COUNTIF($E$3:E768,E768)>7,\"\",MAX($B$3:B767)+1),\"\")","v":""},{"$f":"IF(Score!B767>0,Score!B767,\"\")","v":""},{"$f":"IF(Score!B767>0,VLOOKUP(C768,Entrants!$A$2:$E$5000,3,FALSE),\"\")","v":""},{"$f":"IF(Score!B767>0,VLOOKUP(C768,Entrants!$A$2:$E$5000,2,FALSE),\"\")","v":""},{"$f":"IF(Score!B767>0,VLOOKUP(C768,Entrants!$A$2:$E$5000,4,FALSE),\"\")","v":""},{"$f":"IF(Score!C767>0,Score!C767,\"\")","v":""}]
[{"$f":"IF(Score!B768>0,Score!A768,\"\")","v":""},{"$f":"IF(Score!B768>0,IF(COUNTIF($E$3:E769,E769)>7,\"\",MAX($B$3:B768)+1),\"\")","v":""},{"$f":"IF(Score!B768>0,Score!B768,\"\")","v":""},{"$f":"IF(Score!B768>0,VLOOKUP(C769,Entrants!$A$2:$E$5000,3,FALSE),\"\")","v":""},{"$f":"IF(Score!B768>0,VLOOKUP(C769,Entrants!$A$2:$E$5000,2,FALSE),\"\")","v":""},{"$f":"IF(Score!B768>0,VLOOKUP(C769,Entrants!$A$2:$E$5000,4,FALSE),\"\")","v":""},{"$f":"IF(Score!C768>0,Score!C768,\"\")","v":""}]
[{"$f":"IF(Score!B769>0,Score!A769,\"\")","v":""},{"$f":"IF(Score!B769>0,IF(COUNTIF($E$3:E770,E770)>7,\"\",MAX($B$3:B769)+1),\"\")","v":""},{"$f":"IF(Score!B769>0,Score!B769,\"\")","v":""},{"$f":"IF(Score!B769>0,VLOOKUP(C770,Entrants!$A$2:$E$5000,3,FALSE),\"\")","v":""},{"$f":"IF(Score!B769>0,VLOOKUP(C770,Entrants!$A$2:$E$5000,2,FALSE),\"\")","v":""},{"$f":"IF(Score!B769>0,VLOOKUP(C770,Entrants!$A$2:$E$5000,4,FALSE),\"\")","v":""},{"$f":"IF(Score!C769>0,Score!C769,\"\")","v":""}]
[{"$f":"IF(Score!B770>0,Score!A770,\"\")","v":""},{"$f":"IF(Score!B770>0,IF(COUNTIF($E$3:E771,E771)>7,\"\",MAX($B$3:B770)+1),\"\")","v":""},{"$f":"IF(Score!B770>0,Score!B770,\"\")","v":""},{"$f":"IF(Score!B770>0,VLOOKUP(C771,Entrants!$A$2:$E$5000,3,FALSE),\"\")","v":""},{"$f":"IF(Score!B770>0,VLOOKUP(C771,Entrants!$A$2:$E$5000,2,FALSE),\"\")","v":""},{"$f":"IF(Score!B770>0,VLOOKUP(C771,Entrants!$A$2:$E$5000,4,FALSE),\"\")","v":""},{"$f":"IF(Score!C770>0,Score!C770,\"\")","v":""}]
[{"$f":"IF(Score!B771>0,Score!A771,\"\")","v":""},{"$f":"IF(Score!B771>0,IF(COUNTIF($E$3:E772,E772)>7,\"\",MAX($B$3:B771)+1),\"\")","v":""},{"$f":"IF(Score!B771>0,Score!B771,\"\")","v":""},{"$f":"IF(Score!B771>0,VLOOKUP(C772,Entrants!$A$2:$E$5000,3,FALSE),\"\")","v":""},{"$f":"IF(Score!B771>0,VLOOKUP(C772,Entrants!$A$2:$E$5000,2,FALSE),\"\")","v":""},{"$f":"IF(Score!B771>0,VLOOKUP(C772,Entrants!$A$2:$E$5000,4,FALSE),\"\")","v":""},{"$f":"IF(Score!C771>0,Score!C771,\"\")","v":""}]
[{"$f":"IF(Score!B772>0,Score!A772,\"\")","v":""},{"$f":"IF(Score!B772>0,IF(COUNTIF($E$3:E773,E773)>7,\"\",MAX($B$3:B772)+1),\"\")","v":""},{"$f":"IF(Score!B772>0,Score!B772,\"\")","v":""},{"$f":"IF(Score!B772>0,VLOOKUP(C773,Entrants!$A$2:$E$5000,3,FALSE),\"\")","v":""},{"$f":"IF(Score!B772>0,VLOOKUP(C773,Entrants!$A$2:$E$5000,2,FALSE),\"\")","v":""},{"$f":"IF(Score!B772>0,VLOOKUP(C773,Entrants!$A$2:$E$5000,4,FALSE),\"\")","v":""},{"$f":"IF(Score!C772>0,Score!C772,\"\")","v":""}]
[{"$f":"IF(Score!B773>0,Score!A773,\"\")","v":""},{"$f":"IF(Score!B773>0,IF(COUNTIF($E$3:E774,E774)>7,\"\",MAX($B$3:B773)+1),\"\")","v":""},{"$f":"IF(Score!B773>0,Score!B773,\"\")","v":""},{"$f":"IF(Score!B773>0,VLOOKUP(C774,Entrants!$A$2:$E$5000,3,FALSE),\"\")","v":""},{"$f":"IF(Score!B773>0,VLOOKUP(C774,Entrants!$A$2:$E$5000,2,FALSE),\"\")","v":""},{"$f":"IF(Score!B773>0,VLOOKUP(C774,Entrants!$A$2:$E$5000,4,FALSE),\"\")","v":""},{"$f":"IF(Score!C773>0,Score!C773,\"\")","v":""}]
[{"$f":"IF(Score!B774>0,Score!A774,\"\")","v":""},{"$f":"IF(Score!B774>0,IF(COUNTIF($E$3:E775,E775)>7,\"\",MAX($B$3:B774)+1),\"\")","v":""},{"$f":"IF(Score!B774>0,Score!B774,\"\")","v":""},{"$f":"IF(Score!B774>0,VLOOKUP(C775,Entrants!$A$2:$E$5000,3,FALSE),\"\")","v":""},{"$f":"IF(Score!B774>0,VLOOKUP(C775,Entrants!$A$2:$E$5000,2,FALSE),\"\")","v":""},{"$f":"IF(Score!B774>0,VLOOKUP(C775,Entrants!$A$2:$E$5000,4,FALSE),\"\")","v":""},{"$f":"IF(Score!C774>0,Score!C774,\"\")","v":""}]
[{"$f":"IF(Score!B775>0,Score!A775,\"\")","v":""},{"$f":"IF(Score!B775>0,IF(COUNTIF($E$3:E776,E776)>7,\"\",MAX($B$3:B775)+1),\"\")","v":""},{"$f":"IF(Score!B775>0,Score!B775,\"\")","v":""},{"$f":"IF(Score!B775>0,VLOOKUP(C776,Entrants!$A$2:$E$5000,3,FALSE),\"\")","v":""},{"$f":"IF(Score!B775>0,VLOOKUP(C776,Entrants!$A$2:$E$5000,2,FALSE),\"\")","v":""},{"$f":"IF(Score!B775>0,VLOOKUP(C776,Entrants!$A$2:$E$5000,4,FALSE),\"\")","v":""},{"$f":"IF(Score!C775>0,Score!C775,\"\")","v":""}]
[{"$f":"IF(Score!B776>0,Score!A776,\"\")","v":""},{"$f":"IF(Score!B776>0,IF(COUNTIF($E$3:E777,E777)>7,\"\",MAX($B$3:B776)+1),\"\")","v":""},{"$f":"IF(Score!B776>0,Score!B776,\"\")","v":""},{"$f":"IF(Score!B776>0,VLOOKUP(C777,Entrants!$A$2:$E$5000,3,FALSE),\"\")","v":""},{"$f":"IF(Score!B776>0,VLOOKUP(C777,Entrants!$A$2:$E$5000,2,FALSE),\"\")","v":""},{"$f":"IF(Score!B776>0,VLOOKUP(C777,Entrants!$A$2:$E$5000,4,FALSE),\"\")","v":""},{"$f":"IF(Score!C776>0,Score!C776,\"\")","v":""}]
[{"$f":"IF(Score!B777>0,Score!A777,\"\")","v":""},{"$f":"IF(Score!B777>0,IF(COUNTIF($E$3:E778,E778)>7,\"\",MAX($B$3:B777)+1),\"\")","v":""},{"$f":"IF(Score!B777>0,Score!B777,\"\")","v":""},{"$f":"IF(Score!B777>0,VLOOKUP(C778,Entrants!$A$2:$E$5000,3,FALSE),\"\")","v":""},{"$f":"IF(Score!B777>0,VLOOKUP(C778,Entrants!$A$2:$E$5000,2,FALSE),\"\")","v":""},{"$f":"IF(Score!B777>0,VLOOKUP(C778,Entrants!$A$2:$E$5000,4,FALSE),\"\")","v":""},{"$f":"IF(Score!C777>0,Score!C777,\"\")","v":""}]
[{"$f":"IF(Score!B778>0,Score!A778,\"\")","v":""},{"$f":"IF(Score!B778>0,IF(COUNTIF($E$3:E779,E779)>7,\"\",MAX($B$3:B778)+1),\"\")","v":""},{"$f":"IF(Score!B778>0,Score!B778,\"\")","v":""},{"$f":"IF(Score!B778>0,VLOOKUP(C779,Entrants!$A$2:$E$5000,3,FALSE),\"\")","v":""},{"$f":"IF(Score!B778>0,VLOOKUP(C779,Entrants!$A$2:$E$5000,2,FALSE),\"\")","v":""},{"$f":"IF(Score!B778>0,VLOOKUP(C779,Entrants!$A$2:$E$5000,4,FALSE),\"\")","v":""},{"$f":"IF(Score!C778>0,Score!C778,\"\")","v":""}]
[{"$f":"IF(Score!B779>0,Score!A779,\"\")","v":""},{"$f":"IF(Score!B779>0,IF(COUNTIF($E$3:E780,E780)>7,\"\",MAX($B$3:B779)+1),\"\")","v":""},{"$f":"IF(Score!B779>0,Score!B779,\"\")","v":""},{"$f":"IF(Score!B779>0,VLOOKUP(C780,Entrants!$A$2:$E$5000,3,FALSE),\"\")","v":""},{"$f":"IF(Score!B779>0,VLOOKUP(C780,Entrants!$A$2:$E$5000,2,FALSE),\"\")","v":""},{"$f":"IF(Score!B779>0,VLOOKUP(C780,Entrants!$A$2:$E$5000,4,FALSE),\"\")","v":""},{"$f":"IF(Score!C779>0,Score!C779,\"\")","v":""}]
[{"$f":"IF(Score!B780>0,Score!A780,\"\")","v":""},{"$f":"IF(Score!B780>0,IF(COUNTIF($E$3:E781,E781)>7,\"\",MAX($B$3:B780)+1),\"\")","v":""},{"$f":"IF(Score!B780>0,Score!B780,\"\")","v":""},{"$f":"IF(Score!B780>0,VLOOKUP(C781,Entrants!$A$2:$E$5000,3,FALSE),\"\")","v":""},{"$f":"IF(Score!B780>0,VLOOKUP(C781,Entrants!$A$2:$E$5000,2,FALSE),\"\")","v":""},{"$f":"IF(Score!B780>0,VLOOKUP(C781,Entrants!$A$2:$E$5000,4,FALSE),\"\")","v":""},{"$f":"IF(Score!C780>0,Score!C780,\"\")","v":""}]
[{"$f":"IF(Score!B781>0,Score!A781,\"\")","v":""},{"$f":"IF(Score!B781>0,IF(COUNTIF($E$3:E782,E782)>7,\"\",MAX($B$3:B781)+1),\"\")","v":""},{"$f":"IF(Score!B781>0,Score!B781,\"\")","v":""},{"$f":"IF(Score!B781>0,VLOOKUP(C782,Entrants!$A$2:$E$5000,3,FALSE),\"\")","v":""},{"$f":"IF(Score!B781>0,VLOOKUP(C782,Entrants!$A$2:$E$5000,2,FALSE),\"\")","v":""},{"$f":"IF(Score!B781>0,VLOOKUP(C782,Entrants!$A$2:$E$5000,4,FALSE),\"\")","v":""},{"$f":"IF(Score!C781>0,Score!C781,\"\")","v":""}]
[{"$f":"IF(Score!B782>0,Score!A782,\"\")","v":""},{"$f":"IF(Score!B782>0,IF(COUNTIF($E$3:E783,E783)>7,\"\",MAX($B$3:B782)+1),\"\")","v":""},{"$f":"IF(Score!B782>0,Score!B782,\"\")","v":""},{"$f":"IF(Score!B782>0,VLOOKUP(C783,Entrants!$A$2:$E$5000,3,FALSE),\"\")","v":""},{"$f":"IF(Score!B782>0,VLOOKUP(C783,Entrants!$A$2:$E$5000,2,FALSE),\"\")","v":""},{"$f":"IF(Score!B782>0,VLOOKUP(C783,Entrants!$A$2:$E$5000,4,FALSE),\"\")","v":""},{"$f":"IF(Score!C782>0,Score!C782,\"\")","v":""}]
[{"$f":"IF(Score!B783>0,Score!A783,\"\")","v":""},{"$f":"IF(Score!B783>0,IF(COUNTIF($E$3:E784,E784)>7,\"\",MAX($B$3:B783)+1),\"\")","v":""},{"$f":"IF(Score!B783>0,Score!B783,\"\")","v":""},{"$f":"IF(Score!B783>0,VLOOKUP(C784,Entrants!$A$2:$E$5000,3,FALSE),\"\")","v":""},{"$f":"IF(Score!B783>0,VLOOKUP(C784,Entrants!$A$2:$E$5000,2,FALSE),\"\")","v":""},{"$f":"IF(Score!B783>0,VLOOKUP(C784,Entrants!$A$2:$E$5000,4,FALSE),\"\")","v":""},{"$f":"IF(Score!C783>0,Score!C783,\"\")","v":""}]
[{"$f":"IF(Score!B784>0,Score!A784,\"\")","v":""},{"$f":"IF(Score!B784>0,IF(COUNTIF($E$3:E785,E785)>7,\"\",MAX($B$3:B784)+1),\"\")","v":""},{"$f":"IF(Score!B784>0,Score!B784,\"\")","v":""},{"$f":"IF(Score!B784>0,VLOOKUP(C785,Entrants!$A$2:$E$5000,3,FALSE),\"\")","v":""},{"$f":"IF(Score!B784>0,VLOOKUP(C785,Entrants!$A$2:$E$5000,2,FALSE),\"\")","v":""},{"$f":"IF(Score!B784>0,VLOOKUP(C785,Entrants!$A$2:$E$5000,4,FALSE),\"\")","v":""},{"$f":"IF(Score!C784>0,Score!C784,\"\")","v":""}]
[{"$f":"IF(Score!B785>0,Score!A785,\"\")","v":""},{"$f":"IF(Score!B785>0,IF(COUNTIF($E$3:E786,E786)>7,\"\",MAX($B$3:B785)+1),\"\")","v":""},{"$f":"IF(Score!B785>0,Score!B785,\"\")","v":""},{"$f":"IF(Score!B785>0,VLOOKUP(C786,Entrants!$A$2:$E$5000,3,FALSE),\"\")","v":""},{"$f":"IF(Score!B785>0,VLOOKUP(C786,Entrants!$A$2:$E$5000,2,FALSE),\"\")","v":""},{"$f":"IF(Score!B785>0,VLOOKUP(C786,Entrants!$A$2:$E$5000,4,FALSE),\"\")","v":""},{"$f":"IF(Score!C785>0,Score!C785,\"\")","v":""}]
[{"$f":"IF(Score!B786>0,Score!A786,\"\")","v":""},{"$f":"IF(Score!B786>0,IF(COUNTIF($E$3:E787,E787)>7,\"\",MAX($B$3:B786)+1),\"\")","v":""},{"$f":"IF(Score!B786>0,Score!B786,\"\")","v":""},{"$f":"IF(Score!B786>0,VLOOKUP(C787,Entrants!$A$2:$E$5000,3,FALSE),\"\")","v":""},{"$f":"IF(Score!B786>0,VLOOKUP(C787,Entrants!$A$2:$E$5000,2,FALSE),\"\")","v":""},{"$f":"IF(Score!B786>0,VLOOKUP(C787,Entrants!$A$2:$E$5000,4,FALSE),\"\")","v":""},{"$f":"IF(Score!C786>0,Score!C786,\"\")","v":""}]
[{"$f":"IF(Score!B787>0,Score!A787,\"\")","v":""},{"$f":"IF(Score!B787>0,IF(COUNTIF($E$3:E788,E788)>7,\"\",MAX($B$3:B787)+1),\"\")","v":""},{"$f":"IF(Score!B787>0,Score!B787,\"\")","v":""},{"$f":"IF(Score!B787>0,VLOOKUP(C788,Entrants!$A$2:$E$5000,3,FALSE),\"\")","v":""},{"$f":"IF(Score!B787>0,VLOOKUP(C788,Entrants!$A$2:$E$5000,2,FALSE),\"\")","v":""},{"$f":"IF(Score!B787>0,VLOOKUP(C788,Entrants!$A$2:$E$5000,4,FALSE),\"\")","v":""},{"$f":"IF(Score!C787>0,Score!C787,\"\")","v":""}]
[{"$f":"IF(Score!B788>0,Score!A788,\"\")","v":""},{"$f":"IF(Score!B788>0,IF(COUNTIF($E$3:E789,E789)>7,\"\",MAX($B$3:B788)+1),\"\")","v":""},{"$f":"IF(Score!B788>0,Score!B788,\"\")","v":""},{"$f":"IF(Score!B788>0,VLOOKUP(C789,Entrants!$A$2:$E$5000,3,FALSE),\"\")","v":""},{"$f":"IF(Score!B788>0,VLOOKUP(C789,Entrants!$A$2:$E$5000,2,FALSE),\"\")","v":""},{"$f":"IF(Score!B788>0,VLOOKUP(C789,Entrants!$A$2:$E$5000,4,FALSE),\"\")","v":""},{"$f":"IF(Score!C788>0,Score!C788,\"\")","v":""}]
[{"$f":"IF(Score!B789>0,Score!A789,\"\")","v":""},{"$f":"IF(Score!B789>0,IF(COUNTIF($E$3:E790,E790)>7,\"\",MAX($B$3:B789)+1),\"\")","v":""},{"$f":"IF(Score!B789>0,Score!B789,\"\")","v":""},{"$f":"IF(Score!B789>0,VLOOKUP(C790,Entrants!$A$2:$E$5000,3,FALSE),\"\")","v":""},{"$f":"IF(Score!B789>0,VLOOKUP(C790,Entrants!$A$2:$E$5000,2,FALSE),\"\")","v":""},{"$f":"IF(Score!B789>0,VLOOKUP(C790,Entrants!$A$2:$E$5000,4,FALSE),\"\")","v":""},{"$f":"IF(Score!C789>0,Score!C789,\"\")","v":""}]
[{"$f":"IF(Score!B790>0,Score!A790,\"\")","v":""},{"$f":"IF(Score!B790>0,IF(COUNTIF($E$3:E791,E791)>7,\"\",MAX($B$3:B790)+1),\"\")","v":""},{"$f":"IF(Score!B790>0,Score!B790,\"\")","v":""},{"$f":"IF(Score!B790>0,VLOOKUP(C791,Entrants!$A$2:$E$5000,3,FALSE),\"\")","v":""},{"$f":"IF(Score!B790>0,VLOOKUP(C791,Entrants!$A$2:$E$5000,2,FALSE),\"\")","v":""},{"$f":"IF(Score!B790>0,VLOOKUP(C791,Entrants!$A$2:$E$5000,4,FALSE),\"\")","v":""},{"$f":"IF(Score!C790>0,Score!C790,\"\")","v":""}]
[{"$f":"IF(Score!B791>0,Score!A791,\"\")","v":""},{"$f":"IF(Score!B791>0,IF(COUNTIF($E$3:E792,E792)>7,\"\",MAX($B$3:B791)+1),\"\")","v":""},{"$f":"IF(Score!B791>0,Score!B791,\"\")","v":""},{"$f":"IF(Score!B791>0,VLOOKUP(C792,Entrants!$A$2:$E$5000,3,FALSE),\"\")","v":""},{"$f":"IF(Score!B791>0,VLOOKUP(C792,Entrants!$A$2:$E$5000,2,FALSE),\"\")","v":""},{"$f":"IF(Score!B791>0,VLOOKUP(C792,Entrants!$A$2:$E$5000,4,FALSE),\"\")","v":""},{"$f":"IF(Score!C791>0,Score!C791,\"\")","v":""}]
[{"$f":"IF(Score!B792>0,Score!A792,\"\")","v":""},{"$f":"IF(Score!B792>0,IF(COUNTIF($E$3:E793,E793)>7,\"\",MAX($B$3:B792)+1),\"\")","v":""},{"$f":"IF(Score!B792>0,Score!B792,\"\")","v":""},{"$f":"IF(Score!B792>0,VLOOKUP(C793,Entrants!$A$2:$E$5000,3,FALSE),\"\")","v":""},{"$f":"IF(Score!B792>0,VLOOKUP(C793,Entrants!$A$2:$E$5000,2,FALSE),\"\")","v":""},{"$f":"IF(Score!B792>0,VLOOKUP(C793,Entrants!$A$2:$E$5000,4,FALSE),\"\")","v":""},{"$f":"IF(Score!C792>0,Score!C792,\"\")","v":""}]
[{"$f":"IF(Score!B793>0,Score!A793,\"\")","v":""},{"$f":"IF(Score!B793>0,IF(COUNTIF($E$3:E794,E794)>7,\"\",MAX($B$3:B793)+1),\"\")","v":""},{"$f":"IF(Score!B793>0,Score!B793,\"\")","v":""},{"$f":"IF(Score!B793>0,VLOOKUP(C794,Entrants!$A$2:$E$5000,3,FALSE),\"\")","v":""},{"$f":"IF(Score!B793>0,VLOOKUP(C794,Entrants!$A$2:$E$5000,2,FALSE),\"\")","v":""},{"$f":"IF(Score!B793>0,VLOOKUP(C794,Entrants!$A$2:$E$5000,4,FALSE),\"\")","v":""},{"$f":"IF(Score!C793>0,Score!C793,\"\")","v":""}]
[{"$f":"IF(Score!B794>0,Score!A794,\"\")","v":""},{"$f":"IF(Score!B794>0,IF(COUNTIF($E$3:E795,E795)>7,\"\",MAX($B$3:B794)+1),\"\")","v":""},{"$f":"IF(Score!B794>0,Score!B794,\"\")","v":""},{"$f":"IF(Score!B794>0,VLOOKUP(C795,Entrants!$A$2:$E$5000,3,FALSE),\"\")","v":""},{"$f":"IF(Score!B794>0,VLOOKUP(C795,Entrants!$A$2:$E$5000,2,FALSE),\"\")","v":""},{"$f":"IF(Score!B794>0,VLOOKUP(C795,Entrants!$A$2:$E$5000,4,FALSE),\"\")","v":""},{"$f":"IF(Score!C794>0,Score!C794,\"\")","v":""}]
[{"$f":"IF(Score!B795>0,Score!A795,\"\")","v":""},{"$f":"IF(Score!B795>0,IF(COUNTIF($E$3:E796,E796)>7,\"\",MAX($B$3:B795)+1),\"\")","v":""},{"$f":"IF(Score!B795>0,Score!B795,\"\")","v":""},{"$f":"IF(Score!B795>0,VLOOKUP(C796,Entrants!$A$2:$E$5000,3,FALSE),\"\")","v":""},{"$f":"IF(Score!B795>0,VLOOKUP(C796,Entrants!$A$2:$E$5000,2,FALSE),\"\")","v":""},{"$f":"IF(Score!B795>0,VLOOKUP(C796,Entrants!$A$2:$E$5000,4,FALSE),\"\")","v":""},{"$f":"IF(Score!C795>0,Score!C795,\"\")","v":""}]
[{"$f":"IF(Score!B796>0,Score!A796,\"\")","v":""},{"$f":"IF(Score!B796>0,IF(COUNTIF($E$3:E797,E797)>7,\"\",MAX($B$3:B796)+1),\"\")","v":""},{"$f":"IF(Score!B796>0,Score!B796,\"\")","v":""},{"$f":"IF(Score!B796>0,VLOOKUP(C797,Entrants!$A$2:$E$5000,3,FALSE),\"\")","v":""},{"$f":"IF(Score!B796>0,VLOOKUP(C797,Entrants!$A$2:$E$5000,2,FALSE),\"\")","v":""},{"$f":"IF(Score!B796>0,VLOOKUP(C797,Entrants!$A$2:$E$5000,4,FALSE),\"\")","v":""},{"$f":"IF(Score!C796>0,Score!C796,\"\")","v":""}]
[{"$f":"IF(Score!B797>0,Score!A797,\"\")","v":""},{"$f":"IF(Score!B797>0,IF(COUNTIF($E$3:E798,E798)>7,\"\",MAX($B$3:B797)+1),\"\")","v":""},{"$f":"IF(Score!B797>0,Score!B797,\"\")","v":""},{"$f":"IF(Score!B797>0,VLOOKUP(C798,Entrants!$A$2:$E$5000,3,FALSE),\"\")","v":""},{"$f":"IF(Score!B797>0,VLOOKUP(C798,Entrants!$A$2:$E$5000,2,FALSE),\"\")","v":""},{"$f":"IF(Score!B797>0,VLOOKUP(C798,Entrants!$A$2:$E$5000,4,FALSE),\"\")","v":""},{"$f":"IF(Score!C797>0,Score!C797,\"\")","v":""}]
[{"$f":"IF(Score!B798>0,Score!A798,\"\")","v":""},{"$f":"IF(Score!B798>0,IF(COUNTIF($E$3:E799,E799)>7,\"\",MAX($B$3:B798)+1),\"\")","v":""},{"$f":"IF(Score!B798>0,Score!B798,\"\")","v":""},{"$f":"IF(Score!B798>0,VLOOKUP(C799,Entrants!$A$2:$E$5000,3,FALSE),\"\")","v":""},{"$f":"IF(Score!B798>0,VLOOKUP(C799,Entrants!$A$2:$E$5000,2,FALSE),\"\")","v":""},{"$f":"IF(Score!B798>0,VLOOKUP(C799,Entrants!$A$2:$E$5000,4,FALSE),\"\")","v":""},{"$f":"IF(Score!C798>0,Score!C798,\"\")","v":""}]
[{"$f":"IF(Score!B799>0,Score!A799,\"\")","v":""},{"$f":"IF(Score!B799>0,IF(COUNTIF($E$3:E800,E800)>7,\"\",MAX($B$3:B799)+1),\"\")","v":""},{"$f":"IF(Score!B799>0,Score!B799,\"\")","v":""},{"$f":"IF(Score!B799>0,VLOOKUP(C800,Entrants!$A$2:$E$5000,3,FALSE),\"\")","v":""},{"$f":"IF(Score!B799>0,VLOOKUP(C800,Entrants!$A$2:$E$5000,2,FALSE),\"\")","v":""},{"$f":"IF(Score!B799>0,VLOOKUP(C800,Entrants!$A$2:$E$5000,4,FALSE),\"\")","v":""},{"$f":"IF(Score!C799>0,Score!C799,\"\")","v":""}]
[{"$f":"IF(Score!B800>0,Score!A800,\"\")","v":""},{"$f":"IF(Score!B800>0,IF(COUNTIF($E$3:E801,E801)>7,\"\",MAX($B$3:B800)+1),\"\")","v":""},{"$f":"IF(Score!B800>0,Score!B800,\"\")","v":""},{"$f":"IF(Score!B800>0,VLOOKUP(C801,Entrants!$A$2:$E$5000,3,FALSE),\"\")","v":""},{"$f":"IF(Score!B800>0,VLOOKUP(C801,Entrants!$A$2:$E$5000,2,FALSE),\"\")","v":""},{"$f":"IF(Score!B800>0,VLOOKUP(C801,Entrants!$A$2:$E$5000,4,FALSE),\"\")","v":""},{"$f":"IF(Score!C800>0,Score!C800,\"\")","v":""}]
[{"$f":"IF(Score!B801>0,Score!A801,\"\")","v":""},{"$f":"IF(Score!B801>0,IF(COUNTIF($E$3:E802,E802)>7,\"\",MAX($B$3:B801)+1),\"\")","v":""},{"$f":"IF(Score!B801>0,Score!B801,\"\")","v":""},{"$f":"IF(Score!B801>0,VLOOKUP(C802,Entrants!$A$2:$E$5000,3,FALSE),\"\")","v":""},{"$f":"IF(Score!B801>0,VLOOKUP(C802,Entrants!$A$2:$E$5000,2,FALSE),\"\")","v":""},{"$f":"IF(Score!B801>0,VLOOKUP(C802,Entrants!$A$2:$E$5000,4,FALSE),\"\")","v":""},{"$f":"IF(Score!C801>0,Score!C801,\"\")","v":""}]
[{"$f":"IF(Score!B802>0,Score!A802,\"\")","v":""},{"$f":"IF(Score!B802>0,IF(COUNTIF($E$3:E803,E803)>7,\"\",MAX($B$3:B802)+1),\"\")","v":""},{"$f":"IF(Score!B802>0,Score!B802,\"\")","v":""},{"$f":"IF(Score!B802>0,VLOOKUP(C803,Entrants!$A$2:$E$5000,3,FALSE),\"\")","v":""},{"$f":"IF(Score!B802>0,VLOOKUP(C803,Entrants!$A$2:$E$5000,2,FALSE),\"\")","v":""},{"$f":"IF(Score!B802>0,VLOOKUP(C803,Entrants!$A$2:$E$5000,4,FALSE),\"\")","v":""},{"$f":"IF(Score!C802>0,Score!C802,\"\")","v":""}]
[{"$f":"IF(Score!B803>0,Score!A803,\"\")","v":""},{"$f":"IF(Score!B803>0,IF(COUNTIF($E$3:E804,E804)>7,\"\",MAX($B$3:B803)+1),\"\")","v":""},{"$f":"IF(Score!B803>0,Score!B803,\"\")","v":""},{"$f":"IF(Score!B803>0,VLOOKUP(C804,Entrants!$A$2:$E$5000,3,FALSE),\"\")","v":""},{"$f":"IF(Score!B803>0,VLOOKUP(C804,Entrants!$A$2:$E$5000,2,FALSE),\"\")","v":""},{"$f":"IF(Score!B803>0,VLOOKUP(C804,Entrants!$A$2:$E$5000,4,FALSE),\"\")","v":""},{"$f":"IF(Score!C803>0,Score!C803,\"\")","v":""}]
[{"$f":"IF(Score!B804>0,Score!A804,\"\")","v":""},{"$f":"IF(Score!B804>0,IF(COUNTIF($E$3:E805,E805)>7,\"\",MAX($B$3:B804)+1),\"\")","v":""},{"$f":"IF(Score!B804>0,Score!B804,\"\")","v":""},{"$f":"IF(Score!B804>0,VLOOKUP(C805,Entrants!$A$2:$E$5000,3,FALSE),\"\")","v":""},{"$f":"IF(Score!B804>0,VLOOKUP(C805,Entrants!$A$2:$E$5000,2,FALSE),\"\")","v":""},{"$f":"IF(Score!B804>0,VLOOKUP(C805,Entrants!$A$2:$E$5000,4,FALSE),\"\")","v":""},{"$f":"IF(Score!C804>0,Score!C804,\"\")","v":""}]
[{"$f":"IF(Score!B805>0,Score!A805,\"\")","v":""},{"$f":"IF(Score!B805>0,IF(COUNTIF($E$3:E806,E806)>7,\"\",MAX($B$3:B805)+1),\"\")","v":""},{"$f":"IF(Score!B805>0,Score!B805,\"\")","v":""},{"$f":"IF(Score!B805>0,VLOOKUP(C806,Entrants!$A$2:$E$5000,3,FALSE),\"\")","v":""},{"$f":"IF(Score!B805>0,VLOOKUP(C806,Entrants!$A$2:$E$5000,2,FALSE),\"\")","v":""},{"$f":"IF(Score!B805>0,VLOOKUP(C806,Entrants!$A$2:$E$5000,4,FALSE),\"\")","v":""},{"$f":"IF(Score!C805>0,Score!C805,\"\")","v":""}]
[{"$f":"IF(Score!B806>0,Score!A806,\"\")","v":""},{"$f":"IF(Score!B806>0,IF(COUNTIF($E$3:E807,E807)>7,\"\",MAX($B$3:B806)+1),\"\")","v":""},{"$f":"IF(Score!B806>0,Score!B806,\"\")","v":""},{"$f":"IF(Score!B806>0,VLOOKUP(C807,Entrants!$A$2:$E$5000,3,FALSE),\"\")","v":""},{"$f":"IF(Score!B806>0,VLOOKUP(C807,Entrants!$A$2:$E$5000,2,FALSE),\"\")","v":""},{"$f":"IF(Score!B806>0,VLOOKUP(C807,Entrants!$A$2:$E$5000,4,FALSE),\"\")","v":""},{"$f":"IF(Score!C806>0,Score!C806,\"\")","v":""}]
[{"$f":"IF(Score!B807>0,Score!A807,\"\")","v":""},{"$f":"IF(Score!B807>0,IF(COUNTIF($E$3:E808,E808)>7,\"\",MAX($B$3:B807)+1),\"\")","v":""},{"$f":"IF(Score!B807>0,Score!B807,\"\")","v":""},{"$f":"IF(Score!B807>0,VLOOKUP(C808,Entrants!$A$2:$E$5000,3,FALSE),\"\")","v":""},{"$f":"IF(Score!B807>0,VLOOKUP(C808,Entrants!$A$2:$E$5000,2,FALSE),\"\")","v":""},{"$f":"IF(Score!B807>0,VLOOKUP(C808,Entrants!$A$2:$E$5000,4,FALSE),\"\")","v":""},{"$f":"IF(Score!C807>0,Score!C807,\"\")","v":""}]
[{"$f":"IF(Score!B808>0,Score!A808,\"\")","v":""},{"$f":"IF(Score!B808>0,IF(COUNTIF($E$3:E809,E809)>7,\"\",MAX($B$3:B808)+1),\"\")","v":""},{"$f":"IF(Score!B808>0,Score!B808,\"\")","v":""},{"$f":"IF(Score!B808>0,VLOOKUP(C809,Entrants!$A$2:$E$5000,3,FALSE),\"\")","v":""},{"$f":"IF(Score!B808>0,VLOOKUP(C809,Entrants!$A$2:$E$5000,2,FALSE),\"\")","v":""},{"$f":"IF(Score!B808>0,VLOOKUP(C809,Entrants!$A$2:$E$5000,4,FALSE),\"\")","v":""},{"$f":"IF(Score!C808>0,Score!C808,\"\")","v":""}]
[{"$f":"IF(Score!B809>0,Score!A809,\"\")","v":""},{"$f":"IF(Score!B809>0,IF(COUNTIF($E$3:E810,E810)>7,\"\",MAX($B$3:B809)+1),\"\")","v":""},{"$f":"IF(Score!B809>0,Score!B809,\"\")","v":""},{"$f":"IF(Score!B809>0,VLOOKUP(C810,Entrants!$A$2:$E$5000,3,FALSE),\"\")","v":""},{"$f":"IF(Score!B809>0,VLOOKUP(C810,Entrants!$A$2:$E$5000,2,FALSE),\"\")","v":""},{"$f":"IF(Score!B809>0,VLOOKUP(C810,Entrants!$A$2:$E$5000,4,FALSE),\"\")","v":""},{"$f":"IF(Score!C809>0,Score!C809,\"\")","v":""}]
[{"$f":"IF(Score!B810>0,Score!A810,\"\")","v":""},{"$f":"IF(Score!B810>0,IF(COUNTIF($E$3:E811,E811)>7,\"\",MAX($B$3:B810)+1),\"\")","v":""},{"$f":"IF(Score!B810>0,Score!B810,\"\")","v":""},{"$f":"IF(Score!B810>0,VLOOKUP(C811,Entrants!$A$2:$E$5000,3,FALSE),\"\")","v":""},{"$f":"IF(Score!B810>0,VLOOKUP(C811,Entrants!$A$2:$E$5000,2,FALSE),\"\")","v":""},{"$f":"IF(Score!B810>0,VLOOKUP(C811,Entrants!$A$2:$E$5000,4,FALSE),\"\")","v":""},{"$f":"IF(Score!C810>0,Score!C810,\"\")","v":""}]
[{"$f":"IF(Score!B811>0,Score!A811,\"\")","v":""},{"$f":"IF(Score!B811>0,IF(COUNTIF($E$3:E812,E812)>7,\"\",MAX($B$3:B811)+1),\"\")","v":""},{"$f":"IF(Score!B811>0,Score!B811,\"\")","v":""},{"$f":"IF(Score!B811>0,VLOOKUP(C812,Entrants!$A$2:$E$5000,3,FALSE),\"\")","v":""},{"$f":"IF(Score!B811>0,VLOOKUP(C812,Entrants!$A$2:$E$5000,2,FALSE),\"\")","v":""},{"$f":"IF(Score!B811>0,VLOOKUP(C812,Entrants!$A$2:$E$5000,4,FALSE),\"\")","v":""},{"$f":"IF(Score!C811>0,Score!C811,\"\")","v":""}]
[{"$f":"IF(Score!B812>0,Score!A812,\"\")","v":""},{"$f":"IF(Score!B812>0,IF(COUNTIF($E$3:E813,E813)>7,\"\",MAX($B$3:B812)+1),\"\")","v":""},{"$f":"IF(Score!B812>0,Score!B812,\"\")","v":""},{"$f":"IF(Score!B812>0,VLOOKUP(C813,Entrants!$A$2:$E$5000,3,FALSE),\"\")","v":""},{"$f":"IF(Score!B812>0,VLOOKUP(C813,Entrants!$A$2:$E$5000,2,FALSE),\"\")","v":""},{"$f":"IF(Score!B812>0,VLOOKUP(C813,Entrants!$A$2:$E$5000,4,FALSE),\"\")","v":""},{"$f":"IF(Score!C812>0,Score!C812,\"\")","v":""}]
[{"$f":"IF(Score!B813>0,Score!A813,\"\")","v":""},{"$f":"IF(Score!B813>0,IF(COUNTIF($E$3:E814,E814)>7,\"\",MAX($B$3:B813)+1),\"\")","v":""},{"$f":"IF(Score!B813>0,Score!B813,\"\")","v":""},{"$f":"IF(Score!B813>0,VLOOKUP(C814,Entrants!$A$2:$E$5000,3,FALSE),\"\")","v":""},{"$f":"IF(Score!B813>0,VLOOKUP(C814,Entrants!$A$2:$E$5000,2,FALSE),\"\")","v":""},{"$f":"IF(Score!B813>0,VLOOKUP(C814,Entrants!$A$2:$E$5000,4,FALSE),\"\")","v":""},{"$f":"IF(Score!C813>0,Score!C813,\"\")","v":""}]
[{"$f":"IF(Score!B814>0,Score!A814,\"\")","v":""},{"$f":"IF(Score!B814>0,IF(COUNTIF($E$3:E815,E815)>7,\"\",MAX($B$3:B814)+1),\"\")","v":""},{"$f":"IF(Score!B814>0,Score!B814,\"\")","v":""},{"$f":"IF(Score!B814>0,VLOOKUP(C815,Entrants!$A$2:$E$5000,3,FALSE),\"\")","v":""},{"$f":"IF(Score!B814>0,VLOOKUP(C815,Entrants!$A$2:$E$5000,2,FALSE),\"\")","v":""},{"$f":"IF(Score!B814>0,VLOOKUP(C815,Entrants!$A$2:$E$5000,4,FALSE),\"\")","v":""},{"$f":"IF(Score!C814>0,Score!C814,\"\")","v":""}]
[{"$f":"IF(Score!B815>0,Score!A815,\"\")","v":""},{"$f":"IF(Score!B815>0,IF(COUNTIF($E$3:E816,E816)>7,\"\",MAX($B$3:B815)+1),\"\")","v":""},{"$f":"IF(Score!B815>0,Score!B815,\"\")","v":""},{"$f":"IF(Score!B815>0,VLOOKUP(C816,Entrants!$A$2:$E$5000,3,FALSE),\"\")","v":""},{"$f":"IF(Score!B815>0,VLOOKUP(C816,Entrants!$A$2:$E$5000,2,FALSE),\"\")","v":""},{"$f":"IF(Score!B815>0,VLOOKUP(C816,Entrants!$A$2:$E$5000,4,FALSE),\"\")","v":""},{"$f":"IF(Score!C815>0,Score!C815,\"\")","v":""}]
[{"$f":"IF(Score!B816>0,Score!A816,\"\")","v":""},{"$f":"IF(Score!B816>0,IF(COUNTIF($E$3:E817,E817)>7,\"\",MAX($B$3:B816)+1),\"\")","v":""},{"$f":"IF(Score!B816>0,Score!B816,\"\")","v":""},{"$f":"IF(Score!B816>0,VLOOKUP(C817,Entrants!$A$2:$E$5000,3,FALSE),\"\")","v":""},{"$f":"IF(Score!B816>0,VLOOKUP(C817,Entrants!$A$2:$E$5000,2,FALSE),\"\")","v":""},{"$f":"IF(Score!B816>0,VLOOKUP(C817,Entrants!$A$2:$E$5000,4,FALSE),\"\")","v":""},{"$f":"IF(Score!C816>0,Score!C816,\"\")","v":""}]
[{"$f":"IF(Score!B817>0,Score!A817,\"\")","v":""},{"$f":"IF(Score!B817>0,IF(COUNTIF($E$3:E818,E818)>7,\"\",MAX($B$3:B817)+1),\"\")","v":""},{"$f":"IF(Score!B817>0,Score!B817,\"\")","v":""},{"$f":"IF(Score!B817>0,VLOOKUP(C818,Entrants!$A$2:$E$5000,3,FALSE),\"\")","v":""},{"$f":"IF(Score!B817>0,VLOOKUP(C818,Entrants!$A$2:$E$5000,2,FALSE),\"\")","v":""},{"$f":"IF(Score!B817>0,VLOOKUP(C818,Entrants!$A$2:$E$5000,4,FALSE),\"\")","v":""},{"$f":"IF(Score!C817>0,Score!C817,\"\")","v":""}]
[{"$f":"IF(Score!B818>0,Score!A818,\"\")","v":""},{"$f":"IF(Score!B818>0,IF(COUNTIF($E$3:E819,E819)>7,\"\",MAX($B$3:B818)+1),\"\")","v":""},{"$f":"IF(Score!B818>0,Score!B818,\"\")","v":""},{"$f":"IF(Score!B818>0,VLOOKUP(C819,Entrants!$A$2:$E$5000,3,FALSE),\"\")","v":""},{"$f":"IF(Score!B818>0,VLOOKUP(C819,Entrants!$A$2:$E$5000,2,FALSE),\"\")","v":""},{"$f":"IF(Score!B818>0,VLOOKUP(C819,Entrants!$A$2:$E$5000,4,FALSE),\"\")","v":""},{"$f":"IF(Score!C818>0,Score!C818,\"\")","v":""}]
[{"$f":"IF(Score!B819>0,Score!A819,\"\")","v":""},{"$f":"IF(Score!B819>0,IF(COUNTIF($E$3:E820,E820)>7,\"\",MAX($B$3:B819)+1),\"\")","v":""},{"$f":"IF(Score!B819>0,Score!B819,\"\")","v":""},{"$f":"IF(Score!B819>0,VLOOKUP(C820,Entrants!$A$2:$E$5000,3,FALSE),\"\")","v":""},{"$f":"IF(Score!B819>0,VLOOKUP(C820,Entrants!$A$2:$E$5000,2,FALSE),\"\")","v":""},{"$f":"IF(Score!B819>0,VLOOKUP(C820,Entrants!$A$2:$E$5000,4,FALSE),\"\")","v":""},{"$f":"IF(Score!C819>0,Score!C819,\"\")","v":""}]
[{"$f":"IF(Score!B820>0,Score!A820,\"\")","v":""},{"$f":"IF(Score!B820>0,IF(COUNTIF($E$3:E821,E821)>7,\"\",MAX($B$3:B820)+1),\"\")","v":""},{"$f":"IF(Score!B820>0,Score!B820,\"\")","v":""},{"$f":"IF(Score!B820>0,VLOOKUP(C821,Entrants!$A$2:$E$5000,3,FALSE),\"\")","v":""},{"$f":"IF(Score!B820>0,VLOOKUP(C821,Entrants!$A$2:$E$5000,2,FALSE),\"\")","v":""},{"$f":"IF(Score!B820>0,VLOOKUP(C821,Entrants!$A$2:$E$5000,4,FALSE),\"\")","v":""},{"$f":"IF(Score!C820>0,Score!C820,\"\")","v":""}]
[{"$f":"IF(Score!B821>0,Score!A821,\"\")","v":""},{"$f":"IF(Score!B821>0,IF(COUNTIF($E$3:E822,E822)>7,\"\",MAX($B$3:B821)+1),\"\")","v":""},{"$f":"IF(Score!B821>0,Score!B821,\"\")","v":""},{"$f":"IF(Score!B821>0,VLOOKUP(C822,Entrants!$A$2:$E$5000,3,FALSE),\"\")","v":""},{"$f":"IF(Score!B821>0,VLOOKUP(C822,Entrants!$A$2:$E$5000,2,FALSE),\"\")","v":""},{"$f":"IF(Score!B821>0,VLOOKUP(C822,Entrants!$A$2:$E$5000,4,FALSE),\"\")","v":""},{"$f":"IF(Score!C821>0,Score!C821,\"\")","v":""}]
[{"$f":"IF(Score!B822>0,Score!A822,\"\")","v":""},{"$f":"IF(Score!B822>0,IF(COUNTIF($E$3:E823,E823)>7,\"\",MAX($B$3:B822)+1),\"\")","v":""},{"$f":"IF(Score!B822>0,Score!B822,\"\")","v":""},{"$f":"IF(Score!B822>0,VLOOKUP(C823,Entrants!$A$2:$E$5000,3,FALSE),\"\")","v":""},{"$f":"IF(Score!B822>0,VLOOKUP(C823,Entrants!$A$2:$E$5000,2,FALSE),\"\")","v":""},{"$f":"IF(Score!B822>0,VLOOKUP(C823,Entrants!$A$2:$E$5000,4,FALSE),\"\")","v":""},{"$f":"IF(Score!C822>0,Score!C822,\"\")","v":""}]
[{"$f":"IF(Score!B823>0,Score!A823,\"\")","v":""},{"$f":"IF(Score!B823>0,IF(COUNTIF($E$3:E824,E824)>7,\"\",MAX($B$3:B823)+1),\"\")","v":""},{"$f":"IF(Score!B823>0,Score!B823,\"\")","v":""},{"$f":"IF(Score!B823>0,VLOOKUP(C824,Entrants!$A$2:$E$5000,3,FALSE),\"\")","v":""},{"$f":"IF(Score!B823>0,VLOOKUP(C824,Entrants!$A$2:$E$5000,2,FALSE),\"\")","v":""},{"$f":"IF(Score!B823>0,VLOOKUP(C824,Entrants!$A$2:$E$5000,4,FALSE),\"\")","v":""},{"$f":"IF(Score!C823>0,Score!C823,\"\")","v":""}]
[{"$f":"IF(Score!B824>0,Score!A824,\"\")","v":""},{"$f":"IF(Score!B824>0,IF(COUNTIF($E$3:E825,E825)>7,\"\",MAX($B$3:B824)+1),\"\")","v":""},{"$f":"IF(Score!B824>0,Score!B824,\"\")","v":""},{"$f":"IF(Score!B824>0,VLOOKUP(C825,Entrants!$A$2:$E$5000,3,FALSE),\"\")","v":""},{"$f":"IF(Score!B824>0,VLOOKUP(C825,Entrants!$A$2:$E$5000,2,FALSE),\"\")","v":""},{"$f":"IF(Score!B824>0,VLOOKUP(C825,Entrants!$A$2:$E$5000,4,FALSE),\"\")","v":""},{"$f":"IF(Score!C824>0,Score!C824,\"\")","v":""}]
[{"$f":"IF(Score!B825>0,Score!A825,\"\")","v":""},{"$f":"IF(Score!B825>0,IF(COUNTIF($E$3:E826,E826)>7,\"\",MAX($B$3:B825)+1),\"\")","v":""},{"$f":"IF(Score!B825>0,Score!B825,\"\")","v":""},{"$f":"IF(Score!B825>0,VLOOKUP(C826,Entrants!$A$2:$E$5000,3,FALSE),\"\")","v":""},{"$f":"IF(Score!B825>0,VLOOKUP(C826,Entrants!$A$2:$E$5000,2,FALSE),\"\")","v":""},{"$f":"IF(Score!B825>0,VLOOKUP(C826,Entrants!$A$2:$E$5000,4,FALSE),\"\")","v":""},{"$f":"IF(Score!C825>0,Score!C825,\"\")","v":""}]
[{"$f":"IF(Score!B826>0,Score!A826,\"\")","v":""},{"$f":"IF(Score!B826>0,IF(COUNTIF($E$3:E827,E827)>7,\"\",MAX($B$3:B826)+1),\"\")","v":""},{"$f":"IF(Score!B826>0,Score!B826,\"\")","v":""},{"$f":"IF(Score!B826>0,VLOOKUP(C827,Entrants!$A$2:$E$5000,3,FALSE),\"\")","v":""},{"$f":"IF(Score!B826>0,VLOOKUP(C827,Entrants!$A$2:$E$5000,2,FALSE),\"\")","v":""},{"$f":"IF(Score!B826>0,VLOOKUP(C827,Entrants!$A$2:$E$5000,4,FALSE),\"\")","v":""},{"$f":"IF(Score!C826>0,Score!C826,\"\")","v":""}]
[{"$f":"IF(Score!B827>0,Score!A827,\"\")","v":""},{"$f":"IF(Score!B827>0,IF(COUNTIF($E$3:E828,E828)>7,\"\",MAX($B$3:B827)+1),\"\")","v":""},{"$f":"IF(Score!B827>0,Score!B827,\"\")","v":""},{"$f":"IF(Score!B827>0,VLOOKUP(C828,Entrants!$A$2:$E$5000,3,FALSE),\"\")","v":""},{"$f":"IF(Score!B827>0,VLOOKUP(C828,Entrants!$A$2:$E$5000,2,FALSE),\"\")","v":""},{"$f":"IF(Score!B827>0,VLOOKUP(C828,Entrants!$A$2:$E$5000,4,FALSE),\"\")","v":""},{"$f":"IF(Score!C827>0,Score!C827,\"\")","v":""}]
[{"$f":"IF(Score!B828>0,Score!A828,\"\")","v":""},{"$f":"IF(Score!B828>0,IF(COUNTIF($E$3:E829,E829)>7,\"\",MAX($B$3:B828)+1),\"\")","v":""},{"$f":"IF(Score!B828>0,Score!B828,\"\")","v":""},{"$f":"IF(Score!B828>0,VLOOKUP(C829,Entrants!$A$2:$E$5000,3,FALSE),\"\")","v":""},{"$f":"IF(Score!B828>0,VLOOKUP(C829,Entrants!$A$2:$E$5000,2,FALSE),\"\")","v":""},{"$f":"IF(Score!B828>0,VLOOKUP(C829,Entrants!$A$2:$E$5000,4,FALSE),\"\")","v":""},{"$f":"IF(Score!C828>0,Score!C828,\"\")","v":""}]
[{"$f":"IF(Score!B829>0,Score!A829,\"\")","v":""},{"$f":"IF(Score!B829>0,IF(COUNTIF($E$3:E830,E830)>7,\"\",MAX($B$3:B829)+1),\"\")","v":""},{"$f":"IF(Score!B829>0,Score!B829,\"\")","v":""},{"$f":"IF(Score!B829>0,VLOOKUP(C830,Entrants!$A$2:$E$5000,3,FALSE),\"\")","v":""},{"$f":"IF(Score!B829>0,VLOOKUP(C830,Entrants!$A$2:$E$5000,2,FALSE),\"\")","v":""},{"$f":"IF(Score!B829>0,VLOOKUP(C830,Entrants!$A$2:$E$5000,4,FALSE),\"\")","v":""},{"$f":"IF(Score!C829>0,Score!C829,\"\")","v":""}]
[{"$f":"IF(Score!B830>0,Score!A830,\"\")","v":""},{"$f":"IF(Score!B830>0,IF(COUNTIF($E$3:E831,E831)>7,\"\",MAX($B$3:B830)+1),\"\")","v":""},{"$f":"IF(Score!B830>0,Score!B830,\"\")","v":""},{"$f":"IF(Score!B830>0,VLOOKUP(C831,Entrants!$A$2:$E$5000,3,FALSE),\"\")","v":""},{"$f":"IF(Score!B830>0,VLOOKUP(C831,Entrants!$A$2:$E$5000,2,FALSE),\"\")","v":""},{"$f":"IF(Score!B830>0,VLOOKUP(C831,Entrants!$A$2:$E$5000,4,FALSE),\"\")","v":""},{"$f":"IF(Score!C830>0,Score!C830,\"\")","v":""}]
[{"$f":"IF(Score!B831>0,Score!A831,\"\")","v":""},{"$f":"IF(Score!B831>0,IF(COUNTIF($E$3:E832,E832)>7,\"\",MAX($B$3:B831)+1),\"\")","v":""},{"$f":"IF(Score!B831>0,Score!B831,\"\")","v":""},{"$f":"IF(Score!B831>0,VLOOKUP(C832,Entrants!$A$2:$E$5000,3,FALSE),\"\")","v":""},{"$f":"IF(Score!B831>0,VLOOKUP(C832,Entrants!$A$2:$E$5000,2,FALSE),\"\")","v":""},{"$f":"IF(Score!B831>0,VLOOKUP(C832,Entrants!$A$2:$E$5000,4,FALSE),\"\")","v":""},{"$f":"IF(Score!C831>0,Score!C831,\"\")","v":""}]
[{"$f":"IF(Score!B832>0,Score!A832,\"\")","v":""},{"$f":"IF(Score!B832>0,IF(COUNTIF($E$3:E833,E833)>7,\"\",MAX($B$3:B832)+1),\"\")","v":""},{"$f":"IF(Score!B832>0,Score!B832,\"\")","v":""},{"$f":"IF(Score!B832>0,VLOOKUP(C833,Entrants!$A$2:$E$5000,3,FALSE),\"\")","v":""},{"$f":"IF(Score!B832>0,VLOOKUP(C833,Entrants!$A$2:$E$5000,2,FALSE),\"\")","v":""},{"$f":"IF(Score!B832>0,VLOOKUP(C833,Entrants!$A$2:$E$5000,4,FALSE),\"\")","v":""},{"$f":"IF(Score!C832>0,Score!C832,\"\")","v":""}]
[{"$f":"IF(Score!B833>0,Score!A833,\"\")","v":""},{"$f":"IF(Score!B833>0,IF(COUNTIF($E$3:E834,E834)>7,\"\",MAX($B$3:B833)+1),\"\")","v":""},{"$f":"IF(Score!B833>0,Score!B833,\"\")","v":""},{"$f":"IF(Score!B833>0,VLOOKUP(C834,Entrants!$A$2:$E$5000,3,FALSE),\"\")","v":""},{"$f":"IF(Score!B833>0,VLOOKUP(C834,Entrants!$A$2:$E$5000,2,FALSE),\"\")","v":""},{"$f":"IF(Score!B833>0,VLOOKUP(C834,Entrants!$A$2:$E$5000,4,FALSE),\"\")","v":""},{"$f":"IF(Score!C833>0,Score!C833,\"\")","v":""}]
[{"$f":"IF(Score!B834>0,Score!A834,\"\")","v":""},{"$f":"IF(Score!B834>0,IF(COUNTIF($E$3:E835,E835)>7,\"\",MAX($B$3:B834)+1),\"\")","v":""},{"$f":"IF(Score!B834>0,Score!B834,\"\")","v":""},{"$f":"IF(Score!B834>0,VLOOKUP(C835,Entrants!$A$2:$E$5000,3,FALSE),\"\")","v":""},{"$f":"IF(Score!B834>0,VLOOKUP(C835,Entrants!$A$2:$E$5000,2,FALSE),\"\")","v":""},{"$f":"IF(Score!B834>0,VLOOKUP(C835,Entrants!$A$2:$E$5000,4,FALSE),\"\")","v":""},{"$f":"IF(Score!C834>0,Score!C834,\"\")","v":""}]
[{"$f":"IF(Score!B835>0,Score!A835,\"\")","v":""},{"$f":"IF(Score!B835>0,IF(COUNTIF($E$3:E836,E836)>7,\"\",MAX($B$3:B835)+1),\"\")","v":""},{"$f":"IF(Score!B835>0,Score!B835,\"\")","v":""},{"$f":"IF(Score!B835>0,VLOOKUP(C836,Entrants!$A$2:$E$5000,3,FALSE),\"\")","v":""},{"$f":"IF(Score!B835>0,VLOOKUP(C836,Entrants!$A$2:$E$5000,2,FALSE),\"\")","v":""},{"$f":"IF(Score!B835>0,VLOOKUP(C836,Entrants!$A$2:$E$5000,4,FALSE),\"\")","v":""},{"$f":"IF(Score!C835>0,Score!C835,\"\")","v":""}]
[{"$f":"IF(Score!B836>0,Score!A836,\"\")","v":""},{"$f":"IF(Score!B836>0,IF(COUNTIF($E$3:E837,E837)>7,\"\",MAX($B$3:B836)+1),\"\")","v":""},{"$f":"IF(Score!B836>0,Score!B836,\"\")","v":""},{"$f":"IF(Score!B836>0,VLOOKUP(C837,Entrants!$A$2:$E$5000,3,FALSE),\"\")","v":""},{"$f":"IF(Score!B836>0,VLOOKUP(C837,Entrants!$A$2:$E$5000,2,FALSE),\"\")","v":""},{"$f":"IF(Score!B836>0,VLOOKUP(C837,Entrants!$A$2:$E$5000,4,FALSE),\"\")","v":""},{"$f":"IF(Score!C836>0,Score!C836,\"\")","v":""}]
[{"$f":"IF(Score!B837>0,Score!A837,\"\")","v":""},{"$f":"IF(Score!B837>0,IF(COUNTIF($E$3:E838,E838)>7,\"\",MAX($B$3:B837)+1),\"\")","v":""},{"$f":"IF(Score!B837>0,Score!B837,\"\")","v":""},{"$f":"IF(Score!B837>0,VLOOKUP(C838,Entrants!$A$2:$E$5000,3,FALSE),\"\")","v":""},{"$f":"IF(Score!B837>0,VLOOKUP(C838,Entrants!$A$2:$E$5000,2,FALSE),\"\")","v":""},{"$f":"IF(Score!B837>0,VLOOKUP(C838,Entrants!$A$2:$E$5000,4,FALSE),\"\")","v":""},{"$f":"IF(Score!C837>0,Score!C837,\"\")","v":""}]
[{"$f":"IF(Score!B838>0,Score!A838,\"\")","v":""},{"$f":"IF(Score!B838>0,IF(COUNTIF($E$3:E839,E839)>7,\"\",MAX($B$3:B838)+1),\"\")","v":""},{"$f":"IF(Score!B838>0,Score!B838,\"\")","v":""},{"$f":"IF(Score!B838>0,VLOOKUP(C839,Entrants!$A$2:$E$5000,3,FALSE),\"\")","v":""},{"$f":"IF(Score!B838>0,VLOOKUP(C839,Entrants!$A$2:$E$5000,2,FALSE),\"\")","v":""},{"$f":"IF(Score!B838>0,VLOOKUP(C839,Entrants!$A$2:$E$5000,4,FALSE),\"\")","v":""},{"$f":"IF(Score!C838>0,Score!C838,\"\")","v":""}]
[{"$f":"IF(Score!B839>0,Score!A839,\"\")","v":""},{"$f":"IF(Score!B839>0,IF(COUNTIF($E$3:E840,E840)>7,\"\",MAX($B$3:B839)+1),\"\")","v":""},{"$f":"IF(Score!B839>0,Score!B839,\"\")","v":""},{"$f":"IF(Score!B839>0,VLOOKUP(C840,Entrants!$A$2:$E$5000,3,FALSE),\"\")","v":""},{"$f":"IF(Score!B839>0,VLOOKUP(C840,Entrants!$A$2:$E$5000,2,FALSE),\"\")","v":""},{"$f":"IF(Score!B839>0,VLOOKUP(C840,Entrants!$A$2:$E$5000,4,FALSE),\"\")","v":""},{"$f":"IF(Score!C839>0,Score!C839,\"\")","v":""}]
[{"$f":"IF(Score!B840>0,Score!A840,\"\")","v":""},{"$f":"IF(Score!B840>0,IF(COUNTIF($E$3:E841,E841)>7,\"\",MAX($B$3:B840)+1),\"\")","v":""},{"$f":"IF(Score!B840>0,Score!B840,\"\")","v":""},{"$f":"IF(Score!B840>0,VLOOKUP(C841,Entrants!$A$2:$E$5000,3,FALSE),\"\")","v":""},{"$f":"IF(Score!B840>0,VLOOKUP(C841,Entrants!$A$2:$E$5000,2,FALSE),\"\")","v":""},{"$f":"IF(Score!B840>0,VLOOKUP(C841,Entrants!$A$2:$E$5000,4,FALSE),\"\")","v":""},{"$f":"IF(Score!C840>0,Score!C840,\"\")","v":""}]
[{"$f":"IF(Score!B841>0,Score!A841,\"\")","v":""},{"$f":"IF(Score!B841>0,IF(COUNTIF($E$3:E842,E842)>7,\"\",MAX($B$3:B841)+1),\"\")","v":""},{"$f":"IF(Score!B841>0,Score!B841,\"\")","v":""},{"$f":"IF(Score!B841>0,VLOOKUP(C842,Entrants!$A$2:$E$5000,3,FALSE),\"\")","v":""},{"$f":"IF(Score!B841>0,VLOOKUP(C842,Entrants!$A$2:$E$5000,2,FALSE),\"\")","v":""},{"$f":"IF(Score!B841>0,VLOOKUP(C842,Entrants!$A$2:$E$5000,4,FALSE),\"\")","v":""},{"$f":"IF(Score!C841>0,Score!C841,\"\")","v":""}]
[{"$f":"IF(Score!B842>0,Score!A842,\"\")","v":""},{"$f":"IF(Score!B842>0,IF(COUNTIF($E$3:E843,E843)>7,\"\",MAX($B$3:B842)+1),\"\")","v":""},{"$f":"IF(Score!B842>0,Score!B842,\"\")","v":""},{"$f":"IF(Score!B842>0,VLOOKUP(C843,Entrants!$A$2:$E$5000,3,FALSE),\"\")","v":""},{"$f":"IF(Score!B842>0,VLOOKUP(C843,Entrants!$A$2:$E$5000,2,FALSE),\"\")","v":""},{"$f":"IF(Score!B842>0,VLOOKUP(C843,Entrants!$A$2:$E$5000,4,FALSE),\"\")","v":""},{"$f":"IF(Score!C842>0,Score!C842,\"\")","v":""}]
[{"$f":"IF(Score!B843>0,Score!A843,\"\")","v":""},{"$f":"IF(Score!B843>0,IF(COUNTIF($E$3:E844,E844)>7,\"\",MAX($B$3:B843)+1),\"\")","v":""},{"$f":"IF(Score!B843>0,Score!B843,\"\")","v":""},{"$f":"IF(Score!B843>0,VLOOKUP(C844,Entrants!$A$2:$E$5000,3,FALSE),\"\")","v":""},{"$f":"IF(Score!B843>0,VLOOKUP(C844,Entrants!$A$2:$E$5000,2,FALSE),\"\")","v":""},{"$f":"IF(Score!B843>0,VLOOKUP(C844,Entrants!$A$2:$E$5000,4,FALSE),\"\")","v":""},{"$f":"IF(Score!C843>0,Score!C843,\"\")","v":""}]
[{"$f":"IF(Score!B844>0,Score!A844,\"\")","v":""},{"$f":"IF(Score!B844>0,IF(COUNTIF($E$3:E845,E845)>7,\"\",MAX($B$3:B844)+1),\"\")","v":""},{"$f":"IF(Score!B844>0,Score!B844,\"\")","v":""},{"$f":"IF(Score!B844>0,VLOOKUP(C845,Entrants!$A$2:$E$5000,3,FALSE),\"\")","v":""},{"$f":"IF(Score!B844>0,VLOOKUP(C845,Entrants!$A$2:$E$5000,2,FALSE),\"\")","v":""},{"$f":"IF(Score!B844>0,VLOOKUP(C845,Entrants!$A$2:$E$5000,4,FALSE),\"\")","v":""},{"$f":"IF(Score!C844>0,Score!C844,\"\")","v":""}]
[{"$f":"IF(Score!B845>0,Score!A845,\"\")","v":""},{"$f":"IF(Score!B845>0,IF(COUNTIF($E$3:E846,E846)>7,\"\",MAX($B$3:B845)+1),\"\")","v":""},{"$f":"IF(Score!B845>0,Score!B845,\"\")","v":""},{"$f":"IF(Score!B845>0,VLOOKUP(C846,Entrants!$A$2:$E$5000,3,FALSE),\"\")","v":""},{"$f":"IF(Score!B845>0,VLOOKUP(C846,Entrants!$A$2:$E$5000,2,FALSE),\"\")","v":""},{"$f":"IF(Score!B845>0,VLOOKUP(C846,Entrants!$A$2:$E$5000,4,FALSE),\"\")","v":""},{"$f":"IF(Score!C845>0,Score!C845,\"\")","v":""}]
[{"$f":"IF(Score!B846>0,Score!A846,\"\")","v":""},{"$f":"IF(Score!B846>0,IF(COUNTIF($E$3:E847,E847)>7,\"\",MAX($B$3:B846)+1),\"\")","v":""},{"$f":"IF(Score!B846>0,Score!B846,\"\")","v":""},{"$f":"IF(Score!B846>0,VLOOKUP(C847,Entrants!$A$2:$E$5000,3,FALSE),\"\")","v":""},{"$f":"IF(Score!B846>0,VLOOKUP(C847,Entrants!$A$2:$E$5000,2,FALSE),\"\")","v":""},{"$f":"IF(Score!B846>0,VLOOKUP(C847,Entrants!$A$2:$E$5000,4,FALSE),\"\")","v":""},{"$f":"IF(Score!C846>0,Score!C846,\"\")","v":""}]
[{"$f":"IF(Score!B847>0,Score!A847,\"\")","v":""},{"$f":"IF(Score!B847>0,IF(COUNTIF($E$3:E848,E848)>7,\"\",MAX($B$3:B847)+1),\"\")","v":""},{"$f":"IF(Score!B847>0,Score!B847,\"\")","v":""},{"$f":"IF(Score!B847>0,VLOOKUP(C848,Entrants!$A$2:$E$5000,3,FALSE),\"\")","v":""},{"$f":"IF(Score!B847>0,VLOOKUP(C848,Entrants!$A$2:$E$5000,2,FALSE),\"\")","v":""},{"$f":"IF(Score!B847>0,VLOOKUP(C848,Entrants!$A$2:$E$5000,4,FALSE),\"\")","v":""},{"$f":"IF(Score!C847>0,Score!C847,\"\")","v":""}]
[{"$f":"IF(Score!B848>0,Score!A848,\"\")","v":""},{"$f":"IF(Score!B848>0,IF(COUNTIF($E$3:E849,E849)>7,\"\",MAX($B$3:B848)+1),\"\")","v":""},{"$f":"IF(Score!B848>0,Score!B848,\"\")","v":""},{"$f":"IF(Score!B848>0,VLOOKUP(C849,Entrants!$A$2:$E$5000,3,FALSE),\"\")","v":""},{"$f":"IF(Score!B848>0,VLOOKUP(C849,Entrants!$A$2:$E$5000,2,FALSE),\"\")","v":""},{"$f":"IF(Score!B848>0,VLOOKUP(C849,Entrants!$A$2:$E$5000,4,FALSE),\"\")","v":""},{"$f":"IF(Score!C848>0,Score!C848,\"\")","v":""}]
[{"$f":"IF(Score!B849>0,Score!A849,\"\")","v":""},{"$f":"IF(Score!B849>0,IF(COUNTIF($E$3:E850,E850)>7,\"\",MAX($B$3:B849)+1),\"\")","v":""},{"$f":"IF(Score!B849>0,Score!B849,\"\")","v":""},{"$f":"IF(Score!B849>0,VLOOKUP(C850,Entrants!$A$2:$E$5000,3,FALSE),\"\")","v":""},{"$f":"IF(Score!B849>0,VLOOKUP(C850,Entrants!$A$2:$E$5000,2,FALSE),\"\")","v":""},{"$f":"IF(Score!B849>0,VLOOKUP(C850,Entrants!$A$2:$E$5000,4,FALSE),\"\")","v":""},{"$f":"IF(Score!C849>0,Score!C849,\"\")","v":""}]
[{"$f":"IF(Score!B850>0,Score!A850,\"\")","v":""},{"$f":"IF(Score!B850>0,IF(COUNTIF($E$3:E851,E851)>7,\"\",MAX($B$3:B850)+1),\"\")","v":""},{"$f":"IF(Score!B850>0,Score!B850,\"\")","v":""},{"$f":"IF(Score!B850>0,VLOOKUP(C851,Entrants!$A$2:$E$5000,3,FALSE),\"\")","v":""},{"$f":"IF(Score!B850>0,VLOOKUP(C851,Entrants!$A$2:$E$5000,2,FALSE),\"\")","v":""},{"$f":"IF(Score!B850>0,VLOOKUP(C851,Entrants!$A$2:$E$5000,4,FALSE),\"\")","v":""},{"$f":"IF(Score!C850>0,Score!C850,\"\")","v":""}]
[{"$f":"IF(Score!B851>0,Score!A851,\"\")","v":""},{"$f":"IF(Score!B851>0,IF(COUNTIF($E$3:E852,E852)>7,\"\",MAX($B$3:B851)+1),\"\")","v":""},{"$f":"IF(Score!B851>0,Score!B851,\"\")","v":""},{"$f":"IF(Score!B851>0,VLOOKUP(C852,Entrants!$A$2:$E$5000,3,FALSE),\"\")","v":""},{"$f":"IF(Score!B851>0,VLOOKUP(C852,Entrants!$A$2:$E$5000,2,FALSE),\"\")","v":""},{"$f":"IF(Score!B851>0,VLOOKUP(C852,Entrants!$A$2:$E$5000,4,FALSE),\"\")","v":""},{"$f":"IF(Score!C851>0,Score!C851,\"\")","v":""}]
[{"$f":"IF(Score!B852>0,Score!A852,\"\")","v":""},{"$f":"IF(Score!B852>0,IF(COUNTIF($E$3:E853,E853)>7,\"\",MAX($B$3:B852)+1),\"\")","v":""},{"$f":"IF(Score!B852>0,Score!B852,\"\")","v":""},{"$f":"IF(Score!B852>0,VLOOKUP(C853,Entrants!$A$2:$E$5000,3,FALSE),\"\")","v":""},{"$f":"IF(Score!B852>0,VLOOKUP(C853,Entrants!$A$2:$E$5000,2,FALSE),\"\")","v":""},{"$f":"IF(Score!B852>0,VLOOKUP(C853,Entrants!$A$2:$E$5000,4,FALSE),\"\")","v":""},{"$f":"IF(Score!C852>0,Score!C852,\"\")","v":""}]
[{"$f":"IF(Score!B853>0,Score!A853,\"\")","v":""},{"$f":"IF(Score!B853>0,IF(COUNTIF($E$3:E854,E854)>7,\"\",MAX($B$3:B853)+1),\"\")","v":""},{"$f":"IF(Score!B853>0,Score!B853,\"\")","v":""},{"$f":"IF(Score!B853>0,VLOOKUP(C854,Entrants!$A$2:$E$5000,3,FALSE),\"\")","v":""},{"$f":"IF(Score!B853>0,VLOOKUP(C854,Entrants!$A$2:$E$5000,2,FALSE),\"\")","v":""},{"$f":"IF(Score!B853>0,VLOOKUP(C854,Entrants!$A$2:$E$5000,4,FALSE),\"\")","v":""},{"$f":"IF(Score!C853>0,Score!C853,\"\")","v":""}]
[{"$f":"IF(Score!B854>0,Score!A854,\"\")","v":""},{"$f":"IF(Score!B854>0,IF(COUNTIF($E$3:E855,E855)>7,\"\",MAX($B$3:B854)+1),\"\")","v":""},{"$f":"IF(Score!B854>0,Score!B854,\"\")","v":""},{"$f":"IF(Score!B854>0,VLOOKUP(C855,Entrants!$A$2:$E$5000,3,FALSE),\"\")","v":""},{"$f":"IF(Score!B854>0,VLOOKUP(C855,Entrants!$A$2:$E$5000,2,FALSE),\"\")","v":""},{"$f":"IF(Score!B854>0,VLOOKUP(C855,Entrants!$A$2:$E$5000,4,FALSE),\"\")","v":""},{"$f":"IF(Score!C854>0,Score!C854,\"\")","v":""}]
[{"$f":"IF(Score!B855>0,Score!A855,\"\")","v":""},{"$f":"IF(Score!B855>0,IF(COUNTIF($E$3:E856,E856)>7,\"\",MAX($B$3:B855)+1),\"\")","v":""},{"$f":"IF(Score!B855>0,Score!B855,\"\")","v":""},{"$f":"IF(Score!B855>0,VLOOKUP(C856,Entrants!$A$2:$E$5000,3,FALSE),\"\")","v":""},{"$f":"IF(Score!B855>0,VLOOKUP(C856,Entrants!$A$2:$E$5000,2,FALSE),\"\")","v":""},{"$f":"IF(Score!B855>0,VLOOKUP(C856,Entrants!$A$2:$E$5000,4,FALSE),\"\")","v":""},{"$f":"IF(Score!C855>0,Score!C855,\"\")","v":""}]
[{"$f":"IF(Score!B856>0,Score!A856,\"\")","v":""},{"$f":"IF(Score!B856>0,IF(COUNTIF($E$3:E857,E857)>7,\"\",MAX($B$3:B856)+1),\"\")","v":""},{"$f":"IF(Score!B856>0,Score!B856,\"\")","v":""},{"$f":"IF(Score!B856>0,VLOOKUP(C857,Entrants!$A$2:$E$5000,3,FALSE),\"\")","v":""},{"$f":"IF(Score!B856>0,VLOOKUP(C857,Entrants!$A$2:$E$5000,2,FALSE),\"\")","v":""},{"$f":"IF(Score!B856>0,VLOOKUP(C857,Entrants!$A$2:$E$5000,4,FALSE),\"\")","v":""},{"$f":"IF(Score!C856>0,Score!C856,\"\")","v":""}]
[{"$f":"IF(Score!B857>0,Score!A857,\"\")","v":""},{"$f":"IF(Score!B857>0,IF(COUNTIF($E$3:E858,E858)>7,\"\",MAX($B$3:B857)+1),\"\")","v":""},{"$f":"IF(Score!B857>0,Score!B857,\"\")","v":""},{"$f":"IF(Score!B857>0,VLOOKUP(C858,Entrants!$A$2:$E$5000,3,FALSE),\"\")","v":""},{"$f":"IF(Score!B857>0,VLOOKUP(C858,Entrants!$A$2:$E$5000,2,FALSE),\"\")","v":""},{"$f":"IF(Score!B857>0,VLOOKUP(C858,Entrants!$A$2:$E$5000,4,FALSE),\"\")","v":""},{"$f":"IF(Score!C857>0,Score!C857,\"\")","v":""}]
[{"$f":"IF(Score!B858>0,Score!A858,\"\")","v":""},{"$f":"IF(Score!B858>0,IF(COUNTIF($E$3:E859,E859)>7,\"\",MAX($B$3:B858)+1),\"\")","v":""},{"$f":"IF(Score!B858>0,Score!B858,\"\")","v":""},{"$f":"IF(Score!B858>0,VLOOKUP(C859,Entrants!$A$2:$E$5000,3,FALSE),\"\")","v":""},{"$f":"IF(Score!B858>0,VLOOKUP(C859,Entrants!$A$2:$E$5000,2,FALSE),\"\")","v":""},{"$f":"IF(Score!B858>0,VLOOKUP(C859,Entrants!$A$2:$E$5000,4,FALSE),\"\")","v":""},{"$f":"IF(Score!C858>0,Score!C858,\"\")","v":""}]
[{"$f":"IF(Score!B859>0,Score!A859,\"\")","v":""},{"$f":"IF(Score!B859>0,IF(COUNTIF($E$3:E860,E860)>7,\"\",MAX($B$3:B859)+1),\"\")","v":""},{"$f":"IF(Score!B859>0,Score!B859,\"\")","v":""},{"$f":"IF(Score!B859>0,VLOOKUP(C860,Entrants!$A$2:$E$5000,3,FALSE),\"\")","v":""},{"$f":"IF(Score!B859>0,VLOOKUP(C860,Entrants!$A$2:$E$5000,2,FALSE),\"\")","v":""},{"$f":"IF(Score!B859>0,VLOOKUP(C860,Entrants!$A$2:$E$5000,4,FALSE),\"\")","v":""},{"$f":"IF(Score!C859>0,Score!C859,\"\")","v":""}]
[{"$f":"IF(Score!B860>0,Score!A860,\"\")","v":""},{"$f":"IF(Score!B860>0,IF(COUNTIF($E$3:E861,E861)>7,\"\",MAX($B$3:B860)+1),\"\")","v":""},{"$f":"IF(Score!B860>0,Score!B860,\"\")","v":""},{"$f":"IF(Score!B860>0,VLOOKUP(C861,Entrants!$A$2:$E$5000,3,FALSE),\"\")","v":""},{"$f":"IF(Score!B860>0,VLOOKUP(C861,Entrants!$A$2:$E$5000,2,FALSE),\"\")","v":""},{"$f":"IF(Score!B860>0,VLOOKUP(C861,Entrants!$A$2:$E$5000,4,FALSE),\"\")","v":""},{"$f":"IF(Score!C860>0,Score!C860,\"\")","v":""}]
[{"$f":"IF(Score!B861>0,Score!A861,\"\")","v":""},{"$f":"IF(Score!B861>0,IF(COUNTIF($E$3:E862,E862)>7,\"\",MAX($B$3:B861)+1),\"\")","v":""},{"$f":"IF(Score!B861>0,Score!B861,\"\")","v":""},{"$f":"IF(Score!B861>0,VLOOKUP(C862,Entrants!$A$2:$E$5000,3,FALSE),\"\")","v":""},{"$f":"IF(Score!B861>0,VLOOKUP(C862,Entrants!$A$2:$E$5000,2,FALSE),\"\")","v":""},{"$f":"IF(Score!B861>0,VLOOKUP(C862,Entrants!$A$2:$E$5000,4,FALSE),\"\")","v":""},{"$f":"IF(Score!C861>0,Score!C861,\"\")","v":""}]
[{"$f":"IF(Score!B862>0,Score!A862,\"\")","v":""},{"$f":"IF(Score!B862>0,IF(COUNTIF($E$3:E863,E863)>7,\"\",MAX($B$3:B862)+1),\"\")","v":""},{"$f":"IF(Score!B862>0,Score!B862,\"\")","v":""},{"$f":"IF(Score!B862>0,VLOOKUP(C863,Entrants!$A$2:$E$5000,3,FALSE),\"\")","v":""},{"$f":"IF(Score!B862>0,VLOOKUP(C863,Entrants!$A$2:$E$5000,2,FALSE),\"\")","v":""},{"$f":"IF(Score!B862>0,VLOOKUP(C863,Entrants!$A$2:$E$5000,4,FALSE),\"\")","v":""},{"$f":"IF(Score!C862>0,Score!C862,\"\")","v":""}]
[{"$f":"IF(Score!B863>0,Score!A863,\"\")","v":""},{"$f":"IF(Score!B863>0,IF(COUNTIF($E$3:E864,E864)>7,\"\",MAX($B$3:B863)+1),\"\")","v":""},{"$f":"IF(Score!B863>0,Score!B863,\"\")","v":""},{"$f":"IF(Score!B863>0,VLOOKUP(C864,Entrants!$A$2:$E$5000,3,FALSE),\"\")","v":""},{"$f":"IF(Score!B863>0,VLOOKUP(C864,Entrants!$A$2:$E$5000,2,FALSE),\"\")","v":""},{"$f":"IF(Score!B863>0,VLOOKUP(C864,Entrants!$A$2:$E$5000,4,FALSE),\"\")","v":""},{"$f":"IF(Score!C863>0,Score!C863,\"\")","v":""}]
[{"$f":"IF(Score!B864>0,Score!A864,\"\")","v":""},{"$f":"IF(Score!B864>0,IF(COUNTIF($E$3:E865,E865)>7,\"\",MAX($B$3:B864)+1),\"\")","v":""},{"$f":"IF(Score!B864>0,Score!B864,\"\")","v":""},{"$f":"IF(Score!B864>0,VLOOKUP(C865,Entrants!$A$2:$E$5000,3,FALSE),\"\")","v":""},{"$f":"IF(Score!B864>0,VLOOKUP(C865,Entrants!$A$2:$E$5000,2,FALSE),\"\")","v":""},{"$f":"IF(Score!B864>0,VLOOKUP(C865,Entrants!$A$2:$E$5000,4,FALSE),\"\")","v":""},{"$f":"IF(Score!C864>0,Score!C864,\"\")","v":""}]
[{"$f":"IF(Score!B865>0,Score!A865,\"\")","v":""},{"$f":"IF(Score!B865>0,IF(COUNTIF($E$3:E866,E866)>7,\"\",MAX($B$3:B865)+1),\"\")","v":""},{"$f":"IF(Score!B865>0,Score!B865,\"\")","v":""},{"$f":"IF(Score!B865>0,VLOOKUP(C866,Entrants!$A$2:$E$5000,3,FALSE),\"\")","v":""},{"$f":"IF(Score!B865>0,VLOOKUP(C866,Entrants!$A$2:$E$5000,2,FALSE),\"\")","v":""},{"$f":"IF(Score!B865>0,VLOOKUP(C866,Entrants!$A$2:$E$5000,4,FALSE),\"\")","v":""},{"$f":"IF(Score!C865>0,Score!C865,\"\")","v":""}]
[{"$f":"IF(Score!B866>0,Score!A866,\"\")","v":""},{"$f":"IF(Score!B866>0,IF(COUNTIF($E$3:E867,E867)>7,\"\",MAX($B$3:B866)+1),\"\")","v":""},{"$f":"IF(Score!B866>0,Score!B866,\"\")","v":""},{"$f":"IF(Score!B866>0,VLOOKUP(C867,Entrants!$A$2:$E$5000,3,FALSE),\"\")","v":""},{"$f":"IF(Score!B866>0,VLOOKUP(C867,Entrants!$A$2:$E$5000,2,FALSE),\"\")","v":""},{"$f":"IF(Score!B866>0,VLOOKUP(C867,Entrants!$A$2:$E$5000,4,FALSE),\"\")","v":""},{"$f":"IF(Score!C866>0,Score!C866,\"\")","v":""}]
[{"$f":"IF(Score!B867>0,Score!A867,\"\")","v":""},{"$f":"IF(Score!B867>0,IF(COUNTIF($E$3:E868,E868)>7,\"\",MAX($B$3:B867)+1),\"\")","v":""},{"$f":"IF(Score!B867>0,Score!B867,\"\")","v":""},{"$f":"IF(Score!B867>0,VLOOKUP(C868,Entrants!$A$2:$E$5000,3,FALSE),\"\")","v":""},{"$f":"IF(Score!B867>0,VLOOKUP(C868,Entrants!$A$2:$E$5000,2,FALSE),\"\")","v":""},{"$f":"IF(Score!B867>0,VLOOKUP(C868,Entrants!$A$2:$E$5000,4,FALSE),\"\")","v":""},{"$f":"IF(Score!C867>0,Score!C867,\"\")","v":""}]
[{"$f":"IF(Score!B868>0,Score!A868,\"\")","v":""},{"$f":"IF(Score!B868>0,IF(COUNTIF($E$3:E869,E869)>7,\"\",MAX($B$3:B868)+1),\"\")","v":""},{"$f":"IF(Score!B868>0,Score!B868,\"\")","v":""},{"$f":"IF(Score!B868>0,VLOOKUP(C869,Entrants!$A$2:$E$5000,3,FALSE),\"\")","v":""},{"$f":"IF(Score!B868>0,VLOOKUP(C869,Entrants!$A$2:$E$5000,2,FALSE),\"\")","v":""},{"$f":"IF(Score!B868>0,VLOOKUP(C869,Entrants!$A$2:$E$5000,4,FALSE),\"\")","v":""},{"$f":"IF(Score!C868>0,Score!C868,\"\")","v":""}]
[{"$f":"IF(Score!B869>0,Score!A869,\"\")","v":""},{"$f":"IF(Score!B869>0,IF(COUNTIF($E$3:E870,E870)>7,\"\",MAX($B$3:B869)+1),\"\")","v":""},{"$f":"IF(Score!B869>0,Score!B869,\"\")","v":""},{"$f":"IF(Score!B869>0,VLOOKUP(C870,Entrants!$A$2:$E$5000,3,FALSE),\"\")","v":""},{"$f":"IF(Score!B869>0,VLOOKUP(C870,Entrants!$A$2:$E$5000,2,FALSE),\"\")","v":""},{"$f":"IF(Score!B869>0,VLOOKUP(C870,Entrants!$A$2:$E$5000,4,FALSE),\"\")","v":""},{"$f":"IF(Score!C869>0,Score!C869,\"\")","v":""}]
[{"$f":"IF(Score!B870>0,Score!A870,\"\")","v":""},{"$f":"IF(Score!B870>0,IF(COUNTIF($E$3:E871,E871)>7,\"\",MAX($B$3:B870)+1),\"\")","v":""},{"$f":"IF(Score!B870>0,Score!B870,\"\")","v":""},{"$f":"IF(Score!B870>0,VLOOKUP(C871,Entrants!$A$2:$E$5000,3,FALSE),\"\")","v":""},{"$f":"IF(Score!B870>0,VLOOKUP(C871,Entrants!$A$2:$E$5000,2,FALSE),\"\")","v":""},{"$f":"IF(Score!B870>0,VLOOKUP(C871,Entrants!$A$2:$E$5000,4,FALSE),\"\")","v":""},{"$f":"IF(Score!C870>0,Score!C870,\"\")","v":""}]
[{"$f":"IF(Score!B871>0,Score!A871,\"\")","v":""},{"$f":"IF(Score!B871>0,IF(COUNTIF($E$3:E872,E872)>7,\"\",MAX($B$3:B871)+1),\"\")","v":""},{"$f":"IF(Score!B871>0,Score!B871,\"\")","v":""},{"$f":"IF(Score!B871>0,VLOOKUP(C872,Entrants!$A$2:$E$5000,3,FALSE),\"\")","v":""},{"$f":"IF(Score!B871>0,VLOOKUP(C872,Entrants!$A$2:$E$5000,2,FALSE),\"\")","v":""},{"$f":"IF(Score!B871>0,VLOOKUP(C872,Entrants!$A$2:$E$5000,4,FALSE),\"\")","v":""},{"$f":"IF(Score!C871>0,Score!C871,\"\")","v":""}]
[{"$f":"IF(Score!B872>0,Score!A872,\"\")","v":""},{"$f":"IF(Score!B872>0,IF(COUNTIF($E$3:E873,E873)>7,\"\",MAX($B$3:B872)+1),\"\")","v":""},{"$f":"IF(Score!B872>0,Score!B872,\"\")","v":""},{"$f":"IF(Score!B872>0,VLOOKUP(C873,Entrants!$A$2:$E$5000,3,FALSE),\"\")","v":""},{"$f":"IF(Score!B872>0,VLOOKUP(C873,Entrants!$A$2:$E$5000,2,FALSE),\"\")","v":""},{"$f":"IF(Score!B872>0,VLOOKUP(C873,Entrants!$A$2:$E$5000,4,FALSE),\"\")","v":""},{"$f":"IF(Score!C872>0,Score!C872,\"\")","v":""}]
[{"$f":"IF(Score!B873>0,Score!A873,\"\")","v":""},{"$f":"IF(Score!B873>0,IF(COUNTIF($E$3:E874,E874)>7,\"\",MAX($B$3:B873)+1),\"\")","v":""},{"$f":"IF(Score!B873>0,Score!B873,\"\")","v":""},{"$f":"IF(Score!B873>0,VLOOKUP(C874,Entrants!$A$2:$E$5000,3,FALSE),\"\")","v":""},{"$f":"IF(Score!B873>0,VLOOKUP(C874,Entrants!$A$2:$E$5000,2,FALSE),\"\")","v":""},{"$f":"IF(Score!B873>0,VLOOKUP(C874,Entrants!$A$2:$E$5000,4,FALSE),\"\")","v":""},{"$f":"IF(Score!C873>0,Score!C873,\"\")","v":""}]
[{"$f":"IF(Score!B874>0,Score!A874,\"\")","v":""},{"$f":"IF(Score!B874>0,IF(COUNTIF($E$3:E875,E875)>7,\"\",MAX($B$3:B874)+1),\"\")","v":""},{"$f":"IF(Score!B874>0,Score!B874,\"\")","v":""},{"$f":"IF(Score!B874>0,VLOOKUP(C875,Entrants!$A$2:$E$5000,3,FALSE),\"\")","v":""},{"$f":"IF(Score!B874>0,VLOOKUP(C875,Entrants!$A$2:$E$5000,2,FALSE),\"\")","v":""},{"$f":"IF(Score!B874>0,VLOOKUP(C875,Entrants!$A$2:$E$5000,4,FALSE),\"\")","v":""},{"$f":"IF(Score!C874>0,Score!C874,\"\")","v":""}]
[{"$f":"IF(Score!B875>0,Score!A875,\"\")","v":""},{"$f":"IF(Score!B875>0,IF(COUNTIF($E$3:E876,E876)>7,\"\",MAX($B$3:B875)+1),\"\")","v":""},{"$f":"IF(Score!B875>0,Score!B875,\"\")","v":""},{"$f":"IF(Score!B875>0,VLOOKUP(C876,Entrants!$A$2:$E$5000,3,FALSE),\"\")","v":""},{"$f":"IF(Score!B875>0,VLOOKUP(C876,Entrants!$A$2:$E$5000,2,FALSE),\"\")","v":""},{"$f":"IF(Score!B875>0,VLOOKUP(C876,Entrants!$A$2:$E$5000,4,FALSE),\"\")","v":""},{"$f":"IF(Score!C875>0,Score!C875,\"\")","v":""}]
[{"$f":"IF(Score!B876>0,Score!A876,\"\")","v":""},{"$f":"IF(Score!B876>0,IF(COUNTIF($E$3:E877,E877)>7,\"\",MAX($B$3:B876)+1),\"\")","v":""},{"$f":"IF(Score!B876>0,Score!B876,\"\")","v":""},{"$f":"IF(Score!B876>0,VLOOKUP(C877,Entrants!$A$2:$E$5000,3,FALSE),\"\")","v":""},{"$f":"IF(Score!B876>0,VLOOKUP(C877,Entrants!$A$2:$E$5000,2,FALSE),\"\")","v":""},{"$f":"IF(Score!B876>0,VLOOKUP(C877,Entrants!$A$2:$E$5000,4,FALSE),\"\")","v":""},{"$f":"IF(Score!C876>0,Score!C876,\"\")","v":""}]
[{"$f":"IF(Score!B877>0,Score!A877,\"\")","v":""},{"$f":"IF(Score!B877>0,IF(COUNTIF($E$3:E878,E878)>7,\"\",MAX($B$3:B877)+1),\"\")","v":""},{"$f":"IF(Score!B877>0,Score!B877,\"\")","v":""},{"$f":"IF(Score!B877>0,VLOOKUP(C878,Entrants!$A$2:$E$5000,3,FALSE),\"\")","v":""},{"$f":"IF(Score!B877>0,VLOOKUP(C878,Entrants!$A$2:$E$5000,2,FALSE),\"\")","v":""},{"$f":"IF(Score!B877>0,VLOOKUP(C878,Entrants!$A$2:$E$5000,4,FALSE),\"\")","v":""},{"$f":"IF(Score!C877>0,Score!C877,\"\")","v":""}]
[{"$f":"IF(Score!B878>0,Score!A878,\"\")","v":""},{"$f":"IF(Score!B878>0,IF(COUNTIF($E$3:E879,E879)>7,\"\",MAX($B$3:B878)+1),\"\")","v":""},{"$f":"IF(Score!B878>0,Score!B878,\"\")","v":""},{"$f":"IF(Score!B878>0,VLOOKUP(C879,Entrants!$A$2:$E$5000,3,FALSE),\"\")","v":""},{"$f":"IF(Score!B878>0,VLOOKUP(C879,Entrants!$A$2:$E$5000,2,FALSE),\"\")","v":""},{"$f":"IF(Score!B878>0,VLOOKUP(C879,Entrants!$A$2:$E$5000,4,FALSE),\"\")","v":""},{"$f":"IF(Score!C878>0,Score!C878,\"\")","v":""}]
[{"$f":"IF(Score!B879>0,Score!A879,\"\")","v":""},{"$f":"IF(Score!B879>0,IF(COUNTIF($E$3:E880,E880)>7,\"\",MAX($B$3:B879)+1),\"\")","v":""},{"$f":"IF(Score!B879>0,Score!B879,\"\")","v":""},{"$f":"IF(Score!B879>0,VLOOKUP(C880,Entrants!$A$2:$E$5000,3,FALSE),\"\")","v":""},{"$f":"IF(Score!B879>0,VLOOKUP(C880,Entrants!$A$2:$E$5000,2,FALSE),\"\")","v":""},{"$f":"IF(Score!B879>0,VLOOKUP(C880,Entrants!$A$2:$E$5000,4,FALSE),\"\")","v":""},{"$f":"IF(Score!C879>0,Score!C879,\"\")","v":""}]
[{"$f":"IF(Score!B880>0,Score!A880,\"\")","v":""},{"$f":"IF(Score!B880>0,IF(COUNTIF($E$3:E881,E881)>7,\"\",MAX($B$3:B880)+1),\"\")","v":""},{"$f":"IF(Score!B880>0,Score!B880,\"\")","v":""},{"$f":"IF(Score!B880>0,VLOOKUP(C881,Entrants!$A$2:$E$5000,3,FALSE),\"\")","v":""},{"$f":"IF(Score!B880>0,VLOOKUP(C881,Entrants!$A$2:$E$5000,2,FALSE),\"\")","v":""},{"$f":"IF(Score!B880>0,VLOOKUP(C881,Entrants!$A$2:$E$5000,4,FALSE),\"\")","v":""},{"$f":"IF(Score!C880>0,Score!C880,\"\")","v":""}]
[{"$f":"IF(Score!B881>0,Score!A881,\"\")","v":""},{"$f":"IF(Score!B881>0,IF(COUNTIF($E$3:E882,E882)>7,\"\",MAX($B$3:B881)+1),\"\")","v":""},{"$f":"IF(Score!B881>0,Score!B881,\"\")","v":""},{"$f":"IF(Score!B881>0,VLOOKUP(C882,Entrants!$A$2:$E$5000,3,FALSE),\"\")","v":""},{"$f":"IF(Score!B881>0,VLOOKUP(C882,Entrants!$A$2:$E$5000,2,FALSE),\"\")","v":""},{"$f":"IF(Score!B881>0,VLOOKUP(C882,Entrants!$A$2:$E$5000,4,FALSE),\"\")","v":""},{"$f":"IF(Score!C881>0,Score!C881,\"\")","v":""}]
[{"$f":"IF(Score!B882>0,Score!A882,\"\")","v":""},{"$f":"IF(Score!B882>0,IF(COUNTIF($E$3:E883,E883)>7,\"\",MAX($B$3:B882)+1),\"\")","v":""},{"$f":"IF(Score!B882>0,Score!B882,\"\")","v":""},{"$f":"IF(Score!B882>0,VLOOKUP(C883,Entrants!$A$2:$E$5000,3,FALSE),\"\")","v":""},{"$f":"IF(Score!B882>0,VLOOKUP(C883,Entrants!$A$2:$E$5000,2,FALSE),\"\")","v":""},{"$f":"IF(Score!B882>0,VLOOKUP(C883,Entrants!$A$2:$E$5000,4,FALSE),\"\")","v":""},{"$f":"IF(Score!C882>0,Score!C882,\"\")","v":""}]
[{"$f":"IF(Score!B883>0,Score!A883,\"\")","v":""},{"$f":"IF(Score!B883>0,IF(COUNTIF($E$3:E884,E884)>7,\"\",MAX($B$3:B883)+1),\"\")","v":""},{"$f":"IF(Score!B883>0,Score!B883,\"\")","v":""},{"$f":"IF(Score!B883>0,VLOOKUP(C884,Entrants!$A$2:$E$5000,3,FALSE),\"\")","v":""},{"$f":"IF(Score!B883>0,VLOOKUP(C884,Entrants!$A$2:$E$5000,2,FALSE),\"\")","v":""},{"$f":"IF(Score!B883>0,VLOOKUP(C884,Entrants!$A$2:$E$5000,4,FALSE),\"\")","v":""},{"$f":"IF(Score!C883>0,Score!C883,\"\")","v":""}]
[{"$f":"IF(Score!B884>0,Score!A884,\"\")","v":""},{"$f":"IF(Score!B884>0,IF(COUNTIF($E$3:E885,E885)>7,\"\",MAX($B$3:B884)+1),\"\")","v":""},{"$f":"IF(Score!B884>0,Score!B884,\"\")","v":""},{"$f":"IF(Score!B884>0,VLOOKUP(C885,Entrants!$A$2:$E$5000,3,FALSE),\"\")","v":""},{"$f":"IF(Score!B884>0,VLOOKUP(C885,Entrants!$A$2:$E$5000,2,FALSE),\"\")","v":""},{"$f":"IF(Score!B884>0,VLOOKUP(C885,Entrants!$A$2:$E$5000,4,FALSE),\"\")","v":""},{"$f":"IF(Score!C884>0,Score!C884,\"\")","v":""}]
[{"$f":"IF(Score!B885>0,Score!A885,\"\")","v":""},{"$f":"IF(Score!B885>0,IF(COUNTIF($E$3:E886,E886)>7,\"\",MAX($B$3:B885)+1),\"\")","v":""},{"$f":"IF(Score!B885>0,Score!B885,\"\")","v":""},{"$f":"IF(Score!B885>0,VLOOKUP(C886,Entrants!$A$2:$E$5000,3,FALSE),\"\")","v":""},{"$f":"IF(Score!B885>0,VLOOKUP(C886,Entrants!$A$2:$E$5000,2,FALSE),\"\")","v":""},{"$f":"IF(Score!B885>0,VLOOKUP(C886,Entrants!$A$2:$E$5000,4,FALSE),\"\")","v":""},{"$f":"IF(Score!C885>0,Score!C885,\"\")","v":""}]
[{"$f":"IF(Score!B886>0,Score!A886,\"\")","v":""},{"$f":"IF(Score!B886>0,IF(COUNTIF($E$3:E887,E887)>7,\"\",MAX($B$3:B886)+1),\"\")","v":""},{"$f":"IF(Score!B886>0,Score!B886,\"\")","v":""},{"$f":"IF(Score!B886>0,VLOOKUP(C887,Entrants!$A$2:$E$5000,3,FALSE),\"\")","v":""},{"$f":"IF(Score!B886>0,VLOOKUP(C887,Entrants!$A$2:$E$5000,2,FALSE),\"\")","v":""},{"$f":"IF(Score!B886>0,VLOOKUP(C887,Entrants!$A$2:$E$5000,4,FALSE),\"\")","v":""},{"$f":"IF(Score!C886>0,Score!C886,\"\")","v":""}]
[{"$f":"IF(Score!B887>0,Score!A887,\"\")","v":""},{"$f":"IF(Score!B887>0,IF(COUNTIF($E$3:E888,E888)>7,\"\",MAX($B$3:B887)+1),\"\")","v":""},{"$f":"IF(Score!B887>0,Score!B887,\"\")","v":""},{"$f":"IF(Score!B887>0,VLOOKUP(C888,Entrants!$A$2:$E$5000,3,FALSE),\"\")","v":""},{"$f":"IF(Score!B887>0,VLOOKUP(C888,Entrants!$A$2:$E$5000,2,FALSE),\"\")","v":""},{"$f":"IF(Score!B887>0,VLOOKUP(C888,Entrants!$A$2:$E$5000,4,FALSE),\"\")","v":""},{"$f":"IF(Score!C887>0,Score!C887,\"\")","v":""}]
[{"$f":"IF(Score!B888>0,Score!A888,\"\")","v":""},{"$f":"IF(Score!B888>0,IF(COUNTIF($E$3:E889,E889)>7,\"\",MAX($B$3:B888)+1),\"\")","v":""},{"$f":"IF(Score!B888>0,Score!B888,\"\")","v":""},{"$f":"IF(Score!B888>0,VLOOKUP(C889,Entrants!$A$2:$E$5000,3,FALSE),\"\")","v":""},{"$f":"IF(Score!B888>0,VLOOKUP(C889,Entrants!$A$2:$E$5000,2,FALSE),\"\")","v":""},{"$f":"IF(Score!B888>0,VLOOKUP(C889,Entrants!$A$2:$E$5000,4,FALSE),\"\")","v":""},{"$f":"IF(Score!C888>0,Score!C888,\"\")","v":""}]
[{"$f":"IF(Score!B889>0,Score!A889,\"\")","v":""},{"$f":"IF(Score!B889>0,IF(COUNTIF($E$3:E890,E890)>7,\"\",MAX($B$3:B889)+1),\"\")","v":""},{"$f":"IF(Score!B889>0,Score!B889,\"\")","v":""},{"$f":"IF(Score!B889>0,VLOOKUP(C890,Entrants!$A$2:$E$5000,3,FALSE),\"\")","v":""},{"$f":"IF(Score!B889>0,VLOOKUP(C890,Entrants!$A$2:$E$5000,2,FALSE),\"\")","v":""},{"$f":"IF(Score!B889>0,VLOOKUP(C890,Entrants!$A$2:$E$5000,4,FALSE),\"\")","v":""},{"$f":"IF(Score!C889>0,Score!C889,\"\")","v":""}]
[{"$f":"IF(Score!B890>0,Score!A890,\"\")","v":""},{"$f":"IF(Score!B890>0,IF(COUNTIF($E$3:E891,E891)>7,\"\",MAX($B$3:B890)+1),\"\")","v":""},{"$f":"IF(Score!B890>0,Score!B890,\"\")","v":""},{"$f":"IF(Score!B890>0,VLOOKUP(C891,Entrants!$A$2:$E$5000,3,FALSE),\"\")","v":""},{"$f":"IF(Score!B890>0,VLOOKUP(C891,Entrants!$A$2:$E$5000,2,FALSE),\"\")","v":""},{"$f":"IF(Score!B890>0,VLOOKUP(C891,Entrants!$A$2:$E$5000,4,FALSE),\"\")","v":""},{"$f":"IF(Score!C890>0,Score!C890,\"\")","v":""}]
[{"$f":"IF(Score!B891>0,Score!A891,\"\")","v":""},{"$f":"IF(Score!B891>0,IF(COUNTIF($E$3:E892,E892)>7,\"\",MAX($B$3:B891)+1),\"\")","v":""},{"$f":"IF(Score!B891>0,Score!B891,\"\")","v":""},{"$f":"IF(Score!B891>0,VLOOKUP(C892,Entrants!$A$2:$E$5000,3,FALSE),\"\")","v":""},{"$f":"IF(Score!B891>0,VLOOKUP(C892,Entrants!$A$2:$E$5000,2,FALSE),\"\")","v":""},{"$f":"IF(Score!B891>0,VLOOKUP(C892,Entrants!$A$2:$E$5000,4,FALSE),\"\")","v":""},{"$f":"IF(Score!C891>0,Score!C891,\"\")","v":""}]
[{"$f":"IF(Score!B892>0,Score!A892,\"\")","v":""},{"$f":"IF(Score!B892>0,IF(COUNTIF($E$3:E893,E893)>7,\"\",MAX($B$3:B892)+1),\"\")","v":""},{"$f":"IF(Score!B892>0,Score!B892,\"\")","v":""},{"$f":"IF(Score!B892>0,VLOOKUP(C893,Entrants!$A$2:$E$5000,3,FALSE),\"\")","v":""},{"$f":"IF(Score!B892>0,VLOOKUP(C893,Entrants!$A$2:$E$5000,2,FALSE),\"\")","v":""},{"$f":"IF(Score!B892>0,VLOOKUP(C893,Entrants!$A$2:$E$5000,4,FALSE),\"\")","v":""},{"$f":"IF(Score!C892>0,Score!C892,\"\")","v":""}]
[{"$f":"IF(Score!B893>0,Score!A893,\"\")","v":""},{"$f":"IF(Score!B893>0,IF(COUNTIF($E$3:E894,E894)>7,\"\",MAX($B$3:B893)+1),\"\")","v":""},{"$f":"IF(Score!B893>0,Score!B893,\"\")","v":""},{"$f":"IF(Score!B893>0,VLOOKUP(C894,Entrants!$A$2:$E$5000,3,FALSE),\"\")","v":""},{"$f":"IF(Score!B893>0,VLOOKUP(C894,Entrants!$A$2:$E$5000,2,FALSE),\"\")","v":""},{"$f":"IF(Score!B893>0,VLOOKUP(C894,Entrants!$A$2:$E$5000,4,FALSE),\"\")","v":""},{"$f":"IF(Score!C893>0,Score!C893,\"\")","v":""}]
[{"$f":"IF(Score!B894>0,Score!A894,\"\")","v":""},{"$f":"IF(Score!B894>0,IF(COUNTIF($E$3:E895,E895)>7,\"\",MAX($B$3:B894)+1),\"\")","v":""},{"$f":"IF(Score!B894>0,Score!B894,\"\")","v":""},{"$f":"IF(Score!B894>0,VLOOKUP(C895,Entrants!$A$2:$E$5000,3,FALSE),\"\")","v":""},{"$f":"IF(Score!B894>0,VLOOKUP(C895,Entrants!$A$2:$E$5000,2,FALSE),\"\")","v":""},{"$f":"IF(Score!B894>0,VLOOKUP(C895,Entrants!$A$2:$E$5000,4,FALSE),\"\")","v":""},{"$f":"IF(Score!C894>0,Score!C894,\"\")","v":""}]
[{"$f":"IF(Score!B895>0,Score!A895,\"\")","v":""},{"$f":"IF(Score!B895>0,IF(COUNTIF($E$3:E896,E896)>7,\"\",MAX($B$3:B895)+1),\"\")","v":""},{"$f":"IF(Score!B895>0,Score!B895,\"\")","v":""},{"$f":"IF(Score!B895>0,VLOOKUP(C896,Entrants!$A$2:$E$5000,3,FALSE),\"\")","v":""},{"$f":"IF(Score!B895>0,VLOOKUP(C896,Entrants!$A$2:$E$5000,2,FALSE),\"\")","v":""},{"$f":"IF(Score!B895>0,VLOOKUP(C896,Entrants!$A$2:$E$5000,4,FALSE),\"\")","v":""},{"$f":"IF(Score!C895>0,Score!C895,\"\")","v":""}]
[{"$f":"IF(Score!B896>0,Score!A896,\"\")","v":""},{"$f":"IF(Score!B896>0,IF(COUNTIF($E$3:E897,E897)>7,\"\",MAX($B$3:B896)+1),\"\")","v":""},{"$f":"IF(Score!B896>0,Score!B896,\"\")","v":""},{"$f":"IF(Score!B896>0,VLOOKUP(C897,Entrants!$A$2:$E$5000,3,FALSE),\"\")","v":""},{"$f":"IF(Score!B896>0,VLOOKUP(C897,Entrants!$A$2:$E$5000,2,FALSE),\"\")","v":""},{"$f":"IF(Score!B896>0,VLOOKUP(C897,Entrants!$A$2:$E$5000,4,FALSE),\"\")","v":""},{"$f":"IF(Score!C896>0,Score!C896,\"\")","v":""}]
[{"$f":"IF(Score!B897>0,Score!A897,\"\")","v":""},{"$f":"IF(Score!B897>0,IF(COUNTIF($E$3:E898,E898)>7,\"\",MAX($B$3:B897)+1),\"\")","v":""},{"$f":"IF(Score!B897>0,Score!B897,\"\")","v":""},{"$f":"IF(Score!B897>0,VLOOKUP(C898,Entrants!$A$2:$E$5000,3,FALSE),\"\")","v":""},{"$f":"IF(Score!B897>0,VLOOKUP(C898,Entrants!$A$2:$E$5000,2,FALSE),\"\")","v":""},{"$f":"IF(Score!B897>0,VLOOKUP(C898,Entrants!$A$2:$E$5000,4,FALSE),\"\")","v":""},{"$f":"IF(Score!C897>0,Score!C897,\"\")","v":""}]
[{"$f":"IF(Score!B898>0,Score!A898,\"\")","v":""},{"$f":"IF(Score!B898>0,IF(COUNTIF($E$3:E899,E899)>7,\"\",MAX($B$3:B898)+1),\"\")","v":""},{"$f":"IF(Score!B898>0,Score!B898,\"\")","v":""},{"$f":"IF(Score!B898>0,VLOOKUP(C899,Entrants!$A$2:$E$5000,3,FALSE),\"\")","v":""},{"$f":"IF(Score!B898>0,VLOOKUP(C899,Entrants!$A$2:$E$5000,2,FALSE),\"\")","v":""},{"$f":"IF(Score!B898>0,VLOOKUP(C899,Entrants!$A$2:$E$5000,4,FALSE),\"\")","v":""},{"$f":"IF(Score!C898>0,Score!C898,\"\")","v":""}]
[{"$f":"IF(Score!B899>0,Score!A899,\"\")","v":""},{"$f":"IF(Score!B899>0,IF(COUNTIF($E$3:E900,E900)>7,\"\",MAX($B$3:B899)+1),\"\")","v":""},{"$f":"IF(Score!B899>0,Score!B899,\"\")","v":""},{"$f":"IF(Score!B899>0,VLOOKUP(C900,Entrants!$A$2:$E$5000,3,FALSE),\"\")","v":""},{"$f":"IF(Score!B899>0,VLOOKUP(C900,Entrants!$A$2:$E$5000,2,FALSE),\"\")","v":""},{"$f":"IF(Score!B899>0,VLOOKUP(C900,Entrants!$A$2:$E$5000,4,FALSE),\"\")","v":""},{"$f":"IF(Score!C899>0,Score!C899,\"\")","v":""}]
[{"$f":"IF(Score!B900>0,Score!A900,\"\")","v":""},{"$f":"IF(Score!B900>0,IF(COUNTIF($E$3:E901,E901)>7,\"\",MAX($B$3:B900)+1),\"\")","v":""},{"$f":"IF(Score!B900>0,Score!B900,\"\")","v":""},{"$f":"IF(Score!B900>0,VLOOKUP(C901,Entrants!$A$2:$E$5000,3,FALSE),\"\")","v":""},{"$f":"IF(Score!B900>0,VLOOKUP(C901,Entrants!$A$2:$E$5000,2,FALSE),\"\")","v":""},{"$f":"IF(Score!B900>0,VLOOKUP(C901,Entrants!$A$2:$E$5000,4,FALSE),\"\")","v":""},{"$f":"IF(Score!C900>0,Score!C900,\"\")","v":""}]
[{"$f":"IF(Score!B901>0,Score!A901,\"\")","v":""},{"$f":"IF(Score!B901>0,IF(COUNTIF($E$3:E902,E902)>7,\"\",MAX($B$3:B901)+1),\"\")","v":""},{"$f":"IF(Score!B901>0,Score!B901,\"\")","v":""},{"$f":"IF(Score!B901>0,VLOOKUP(C902,Entrants!$A$2:$E$5000,3,FALSE),\"\")","v":""},{"$f":"IF(Score!B901>0,VLOOKUP(C902,Entrants!$A$2:$E$5000,2,FALSE),\"\")","v":""},{"$f":"IF(Score!B901>0,VLOOKUP(C902,Entrants!$A$2:$E$5000,4,FALSE),\"\")","v":""},{"$f":"IF(Score!C901>0,Score!C901,\"\")","v":""}]
[{"$f":"IF(Score!B902>0,Score!A902,\"\")","v":""},{"$f":"IF(Score!B902>0,IF(COUNTIF($E$3:E903,E903)>7,\"\",MAX($B$3:B902)+1),\"\")","v":""},{"$f":"IF(Score!B902>0,Score!B902,\"\")","v":""},{"$f":"IF(Score!B902>0,VLOOKUP(C903,Entrants!$A$2:$E$5000,3,FALSE),\"\")","v":""},{"$f":"IF(Score!B902>0,VLOOKUP(C903,Entrants!$A$2:$E$5000,2,FALSE),\"\")","v":""},{"$f":"IF(Score!B902>0,VLOOKUP(C903,Entrants!$A$2:$E$5000,4,FALSE),\"\")","v":""},{"$f":"IF(Score!C902>0,Score!C902,\"\")","v":""}]
[{"$f":"IF(Score!B903>0,Score!A903,\"\")","v":""},{"$f":"IF(Score!B903>0,IF(COUNTIF($E$3:E904,E904)>7,\"\",MAX($B$3:B903)+1),\"\")","v":""},{"$f":"IF(Score!B903>0,Score!B903,\"\")","v":""},{"$f":"IF(Score!B903>0,VLOOKUP(C904,Entrants!$A$2:$E$5000,3,FALSE),\"\")","v":""},{"$f":"IF(Score!B903>0,VLOOKUP(C904,Entrants!$A$2:$E$5000,2,FALSE),\"\")","v":""},{"$f":"IF(Score!B903>0,VLOOKUP(C904,Entrants!$A$2:$E$5000,4,FALSE),\"\")","v":""},{"$f":"IF(Score!C903>0,Score!C903,\"\")","v":""}]
[{"$f":"IF(Score!B904>0,Score!A904,\"\")","v":""},{"$f":"IF(Score!B904>0,IF(COUNTIF($E$3:E905,E905)>7,\"\",MAX($B$3:B904)+1),\"\")","v":""},{"$f":"IF(Score!B904>0,Score!B904,\"\")","v":""},{"$f":"IF(Score!B904>0,VLOOKUP(C905,Entrants!$A$2:$E$5000,3,FALSE),\"\")","v":""},{"$f":"IF(Score!B904>0,VLOOKUP(C905,Entrants!$A$2:$E$5000,2,FALSE),\"\")","v":""},{"$f":"IF(Score!B904>0,VLOOKUP(C905,Entrants!$A$2:$E$5000,4,FALSE),\"\")","v":""},{"$f":"IF(Score!C904>0,Score!C904,\"\")","v":""}]
[{"$f":"IF(Score!B905>0,Score!A905,\"\")","v":""},{"$f":"IF(Score!B905>0,IF(COUNTIF($E$3:E906,E906)>7,\"\",MAX($B$3:B905)+1),\"\")","v":""},{"$f":"IF(Score!B905>0,Score!B905,\"\")","v":""},{"$f":"IF(Score!B905>0,VLOOKUP(C906,Entrants!$A$2:$E$5000,3,FALSE),\"\")","v":""},{"$f":"IF(Score!B905>0,VLOOKUP(C906,Entrants!$A$2:$E$5000,2,FALSE),\"\")","v":""},{"$f":"IF(Score!B905>0,VLOOKUP(C906,Entrants!$A$2:$E$5000,4,FALSE),\"\")","v":""},{"$f":"IF(Score!C905>0,Score!C905,\"\")","v":""}]
[{"$f":"IF(Score!B906>0,Score!A906,\"\")","v":""},{"$f":"IF(Score!B906>0,IF(COUNTIF($E$3:E907,E907)>7,\"\",MAX($B$3:B906)+1),\"\")","v":""},{"$f":"IF(Score!B906>0,Score!B906,\"\")","v":""},{"$f":"IF(Score!B906>0,VLOOKUP(C907,Entrants!$A$2:$E$5000,3,FALSE),\"\")","v":""},{"$f":"IF(Score!B906>0,VLOOKUP(C907,Entrants!$A$2:$E$5000,2,FALSE),\"\")","v":""},{"$f":"IF(Score!B906>0,VLOOKUP(C907,Entrants!$A$2:$E$5000,4,FALSE),\"\")","v":""},{"$f":"IF(Score!C906>0,Score!C906,\"\")","v":""}]
[{"$f":"IF(Score!B907>0,Score!A907,\"\")","v":""},{"$f":"IF(Score!B907>0,IF(COUNTIF($E$3:E908,E908)>7,\"\",MAX($B$3:B907)+1),\"\")","v":""},{"$f":"IF(Score!B907>0,Score!B907,\"\")","v":""},{"$f":"IF(Score!B907>0,VLOOKUP(C908,Entrants!$A$2:$E$5000,3,FALSE),\"\")","v":""},{"$f":"IF(Score!B907>0,VLOOKUP(C908,Entrants!$A$2:$E$5000,2,FALSE),\"\")","v":""},{"$f":"IF(Score!B907>0,VLOOKUP(C908,Entrants!$A$2:$E$5000,4,FALSE),\"\")","v":""},{"$f":"IF(Score!C907>0,Score!C907,\"\")","v":""}]
[{"$f":"IF(Score!B908>0,Score!A908,\"\")","v":""},{"$f":"IF(Score!B908>0,IF(COUNTIF($E$3:E909,E909)>7,\"\",MAX($B$3:B908)+1),\"\")","v":""},{"$f":"IF(Score!B908>0,Score!B908,\"\")","v":""},{"$f":"IF(Score!B908>0,VLOOKUP(C909,Entrants!$A$2:$E$5000,3,FALSE),\"\")","v":""},{"$f":"IF(Score!B908>0,VLOOKUP(C909,Entrants!$A$2:$E$5000,2,FALSE),\"\")","v":""},{"$f":"IF(Score!B908>0,VLOOKUP(C909,Entrants!$A$2:$E$5000,4,FALSE),\"\")","v":""},{"$f":"IF(Score!C908>0,Score!C908,\"\")","v":""}]
[{"$f":"IF(Score!B909>0,Score!A909,\"\")","v":""},{"$f":"IF(Score!B909>0,IF(COUNTIF($E$3:E910,E910)>7,\"\",MAX($B$3:B909)+1),\"\")","v":""},{"$f":"IF(Score!B909>0,Score!B909,\"\")","v":""},{"$f":"IF(Score!B909>0,VLOOKUP(C910,Entrants!$A$2:$E$5000,3,FALSE),\"\")","v":""},{"$f":"IF(Score!B909>0,VLOOKUP(C910,Entrants!$A$2:$E$5000,2,FALSE),\"\")","v":""},{"$f":"IF(Score!B909>0,VLOOKUP(C910,Entrants!$A$2:$E$5000,4,FALSE),\"\")","v":""},{"$f":"IF(Score!C909>0,Score!C909,\"\")","v":""}]
[{"$f":"IF(Score!B910>0,Score!A910,\"\")","v":""},{"$f":"IF(Score!B910>0,IF(COUNTIF($E$3:E911,E911)>7,\"\",MAX($B$3:B910)+1),\"\")","v":""},{"$f":"IF(Score!B910>0,Score!B910,\"\")","v":""},{"$f":"IF(Score!B910>0,VLOOKUP(C911,Entrants!$A$2:$E$5000,3,FALSE),\"\")","v":""},{"$f":"IF(Score!B910>0,VLOOKUP(C911,Entrants!$A$2:$E$5000,2,FALSE),\"\")","v":""},{"$f":"IF(Score!B910>0,VLOOKUP(C911,Entrants!$A$2:$E$5000,4,FALSE),\"\")","v":""},{"$f":"IF(Score!C910>0,Score!C910,\"\")","v":""}]
[{"$f":"IF(Score!B911>0,Score!A911,\"\")","v":""},{"$f":"IF(Score!B911>0,IF(COUNTIF($E$3:E912,E912)>7,\"\",MAX($B$3:B911)+1),\"\")","v":""},{"$f":"IF(Score!B911>0,Score!B911,\"\")","v":""},{"$f":"IF(Score!B911>0,VLOOKUP(C912,Entrants!$A$2:$E$5000,3,FALSE),\"\")","v":""},{"$f":"IF(Score!B911>0,VLOOKUP(C912,Entrants!$A$2:$E$5000,2,FALSE),\"\")","v":""},{"$f":"IF(Score!B911>0,VLOOKUP(C912,Entrants!$A$2:$E$5000,4,FALSE),\"\")","v":""},{"$f":"IF(Score!C911>0,Score!C911,\"\")","v":""}]
[{"$f":"IF(Score!B912>0,Score!A912,\"\")","v":""},{"$f":"IF(Score!B912>0,IF(COUNTIF($E$3:E913,E913)>7,\"\",MAX($B$3:B912)+1),\"\")","v":""},{"$f":"IF(Score!B912>0,Score!B912,\"\")","v":""},{"$f":"IF(Score!B912>0,VLOOKUP(C913,Entrants!$A$2:$E$5000,3,FALSE),\"\")","v":""},{"$f":"IF(Score!B912>0,VLOOKUP(C913,Entrants!$A$2:$E$5000,2,FALSE),\"\")","v":""},{"$f":"IF(Score!B912>0,VLOOKUP(C913,Entrants!$A$2:$E$5000,4,FALSE),\"\")","v":""},{"$f":"IF(Score!C912>0,Score!C912,\"\")","v":""}]
[{"$f":"IF(Score!B913>0,Score!A913,\"\")","v":""},{"$f":"IF(Score!B913>0,IF(COUNTIF($E$3:E914,E914)>7,\"\",MAX($B$3:B913)+1),\"\")","v":""},{"$f":"IF(Score!B913>0,Score!B913,\"\")","v":""},{"$f":"IF(Score!B913>0,VLOOKUP(C914,Entrants!$A$2:$E$5000,3,FALSE),\"\")","v":""},{"$f":"IF(Score!B913>0,VLOOKUP(C914,Entrants!$A$2:$E$5000,2,FALSE),\"\")","v":""},{"$f":"IF(Score!B913>0,VLOOKUP(C914,Entrants!$A$2:$E$5000,4,FALSE),\"\")","v":""},{"$f":"IF(Score!C913>0,Score!C913,\"\")","v":""}]
[{"$f":"IF(Score!B914>0,Score!A914,\"\")","v":""},{"$f":"IF(Score!B914>0,IF(COUNTIF($E$3:E915,E915)>7,\"\",MAX($B$3:B914)+1),\"\")","v":""},{"$f":"IF(Score!B914>0,Score!B914,\"\")","v":""},{"$f":"IF(Score!B914>0,VLOOKUP(C915,Entrants!$A$2:$E$5000,3,FALSE),\"\")","v":""},{"$f":"IF(Score!B914>0,VLOOKUP(C915,Entrants!$A$2:$E$5000,2,FALSE),\"\")","v":""},{"$f":"IF(Score!B914>0,VLOOKUP(C915,Entrants!$A$2:$E$5000,4,FALSE),\"\")","v":""},{"$f":"IF(Score!C914>0,Score!C914,\"\")","v":""}]
[{"$f":"IF(Score!B915>0,Score!A915,\"\")","v":""},{"$f":"IF(Score!B915>0,IF(COUNTIF($E$3:E916,E916)>7,\"\",MAX($B$3:B915)+1),\"\")","v":""},{"$f":"IF(Score!B915>0,Score!B915,\"\")","v":""},{"$f":"IF(Score!B915>0,VLOOKUP(C916,Entrants!$A$2:$E$5000,3,FALSE),\"\")","v":""},{"$f":"IF(Score!B915>0,VLOOKUP(C916,Entrants!$A$2:$E$5000,2,FALSE),\"\")","v":""},{"$f":"IF(Score!B915>0,VLOOKUP(C916,Entrants!$A$2:$E$5000,4,FALSE),\"\")","v":""},{"$f":"IF(Score!C915>0,Score!C915,\"\")","v":""}]
[{"$f":"IF(Score!B916>0,Score!A916,\"\")","v":""},{"$f":"IF(Score!B916>0,IF(COUNTIF($E$3:E917,E917)>7,\"\",MAX($B$3:B916)+1),\"\")","v":""},{"$f":"IF(Score!B916>0,Score!B916,\"\")","v":""},{"$f":"IF(Score!B916>0,VLOOKUP(C917,Entrants!$A$2:$E$5000,3,FALSE),\"\")","v":""},{"$f":"IF(Score!B916>0,VLOOKUP(C917,Entrants!$A$2:$E$5000,2,FALSE),\"\")","v":""},{"$f":"IF(Score!B916>0,VLOOKUP(C917,Entrants!$A$2:$E$5000,4,FALSE),\"\")","v":""},{"$f":"IF(Score!C916>0,Score!C916,\"\")","v":""}]
[{"$f":"IF(Score!B917>0,Score!A917,\"\")","v":""},{"$f":"IF(Score!B917>0,IF(COUNTIF($E$3:E918,E918)>7,\"\",MAX($B$3:B917)+1),\"\")","v":""},{"$f":"IF(Score!B917>0,Score!B917,\"\")","v":""},{"$f":"IF(Score!B917>0,VLOOKUP(C918,Entrants!$A$2:$E$5000,3,FALSE),\"\")","v":""},{"$f":"IF(Score!B917>0,VLOOKUP(C918,Entrants!$A$2:$E$5000,2,FALSE),\"\")","v":""},{"$f":"IF(Score!B917>0,VLOOKUP(C918,Entrants!$A$2:$E$5000,4,FALSE),\"\")","v":""},{"$f":"IF(Score!C917>0,Score!C917,\"\")","v":""}]
[{"$f":"IF(Score!B918>0,Score!A918,\"\")","v":""},{"$f":"IF(Score!B918>0,IF(COUNTIF($E$3:E919,E919)>7,\"\",MAX($B$3:B918)+1),\"\")","v":""},{"$f":"IF(Score!B918>0,Score!B918,\"\")","v":""},{"$f":"IF(Score!B918>0,VLOOKUP(C919,Entrants!$A$2:$E$5000,3,FALSE),\"\")","v":""},{"$f":"IF(Score!B918>0,VLOOKUP(C919,Entrants!$A$2:$E$5000,2,FALSE),\"\")","v":""},{"$f":"IF(Score!B918>0,VLOOKUP(C919,Entrants!$A$2:$E$5000,4,FALSE),\"\")","v":""},{"$f":"IF(Score!C918>0,Score!C918,\"\")","v":""}]
[{"$f":"IF(Score!B919>0,Score!A919,\"\")","v":""},{"$f":"IF(Score!B919>0,IF(COUNTIF($E$3:E920,E920)>7,\"\",MAX($B$3:B919)+1),\"\")","v":""},{"$f":"IF(Score!B919>0,Score!B919,\"\")","v":""},{"$f":"IF(Score!B919>0,VLOOKUP(C920,Entrants!$A$2:$E$5000,3,FALSE),\"\")","v":""},{"$f":"IF(Score!B919>0,VLOOKUP(C920,Entrants!$A$2:$E$5000,2,FALSE),\"\")","v":""},{"$f":"IF(Score!B919>0,VLOOKUP(C920,Entrants!$A$2:$E$5000,4,FALSE),\"\")","v":""},{"$f":"IF(Score!C919>0,Score!C919,\"\")","v":""}]
[{"$f":"IF(Score!B920>0,Score!A920,\"\")","v":""},{"$f":"IF(Score!B920>0,IF(COUNTIF($E$3:E921,E921)>7,\"\",MAX($B$3:B920)+1),\"\")","v":""},{"$f":"IF(Score!B920>0,Score!B920,\"\")","v":""},{"$f":"IF(Score!B920>0,VLOOKUP(C921,Entrants!$A$2:$E$5000,3,FALSE),\"\")","v":""},{"$f":"IF(Score!B920>0,VLOOKUP(C921,Entrants!$A$2:$E$5000,2,FALSE),\"\")","v":""},{"$f":"IF(Score!B920>0,VLOOKUP(C921,Entrants!$A$2:$E$5000,4,FALSE),\"\")","v":""},{"$f":"IF(Score!C920>0,Score!C920,\"\")","v":""}]
[{"$f":"IF(Score!B921>0,Score!A921,\"\")","v":""},{"$f":"IF(Score!B921>0,IF(COUNTIF($E$3:E922,E922)>7,\"\",MAX($B$3:B921)+1),\"\")","v":""},{"$f":"IF(Score!B921>0,Score!B921,\"\")","v":""},{"$f":"IF(Score!B921>0,VLOOKUP(C922,Entrants!$A$2:$E$5000,3,FALSE),\"\")","v":""},{"$f":"IF(Score!B921>0,VLOOKUP(C922,Entrants!$A$2:$E$5000,2,FALSE),\"\")","v":""},{"$f":"IF(Score!B921>0,VLOOKUP(C922,Entrants!$A$2:$E$5000,4,FALSE),\"\")","v":""},{"$f":"IF(Score!C921>0,Score!C921,\"\")","v":""}]
[{"$f":"IF(Score!B922>0,Score!A922,\"\")","v":""},{"$f":"IF(Score!B922>0,IF(COUNTIF($E$3:E923,E923)>7,\"\",MAX($B$3:B922)+1),\"\")","v":""},{"$f":"IF(Score!B922>0,Score!B922,\"\")","v":""},{"$f":"IF(Score!B922>0,VLOOKUP(C923,Entrants!$A$2:$E$5000,3,FALSE),\"\")","v":""},{"$f":"IF(Score!B922>0,VLOOKUP(C923,Entrants!$A$2:$E$5000,2,FALSE),\"\")","v":""},{"$f":"IF(Score!B922>0,VLOOKUP(C923,Entrants!$A$2:$E$5000,4,FALSE),\"\")","v":""},{"$f":"IF(Score!C922>0,Score!C922,\"\")","v":""}]
[{"$f":"IF(Score!B923>0,Score!A923,\"\")","v":""},{"$f":"IF(Score!B923>0,IF(COUNTIF($E$3:E924,E924)>7,\"\",MAX($B$3:B923)+1),\"\")","v":""},{"$f":"IF(Score!B923>0,Score!B923,\"\")","v":""},{"$f":"IF(Score!B923>0,VLOOKUP(C924,Entrants!$A$2:$E$5000,3,FALSE),\"\")","v":""},{"$f":"IF(Score!B923>0,VLOOKUP(C924,Entrants!$A$2:$E$5000,2,FALSE),\"\")","v":""},{"$f":"IF(Score!B923>0,VLOOKUP(C924,Entrants!$A$2:$E$5000,4,FALSE),\"\")","v":""},{"$f":"IF(Score!C923>0,Score!C923,\"\")","v":""}]
[{"$f":"IF(Score!B924>0,Score!A924,\"\")","v":""},{"$f":"IF(Score!B924>0,IF(COUNTIF($E$3:E925,E925)>7,\"\",MAX($B$3:B924)+1),\"\")","v":""},{"$f":"IF(Score!B924>0,Score!B924,\"\")","v":""},{"$f":"IF(Score!B924>0,VLOOKUP(C925,Entrants!$A$2:$E$5000,3,FALSE),\"\")","v":""},{"$f":"IF(Score!B924>0,VLOOKUP(C925,Entrants!$A$2:$E$5000,2,FALSE),\"\")","v":""},{"$f":"IF(Score!B924>0,VLOOKUP(C925,Entrants!$A$2:$E$5000,4,FALSE),\"\")","v":""},{"$f":"IF(Score!C924>0,Score!C924,\"\")","v":""}]
[{"$f":"IF(Score!B925>0,Score!A925,\"\")","v":""},{"$f":"IF(Score!B925>0,IF(COUNTIF($E$3:E926,E926)>7,\"\",MAX($B$3:B925)+1),\"\")","v":""},{"$f":"IF(Score!B925>0,Score!B925,\"\")","v":""},{"$f":"IF(Score!B925>0,VLOOKUP(C926,Entrants!$A$2:$E$5000,3,FALSE),\"\")","v":""},{"$f":"IF(Score!B925>0,VLOOKUP(C926,Entrants!$A$2:$E$5000,2,FALSE),\"\")","v":""},{"$f":"IF(Score!B925>0,VLOOKUP(C926,Entrants!$A$2:$E$5000,4,FALSE),\"\")","v":""},{"$f":"IF(Score!C925>0,Score!C925,\"\")","v":""}]
[{"$f":"IF(Score!B926>0,Score!A926,\"\")","v":""},{"$f":"IF(Score!B926>0,IF(COUNTIF($E$3:E927,E927)>7,\"\",MAX($B$3:B926)+1),\"\")","v":""},{"$f":"IF(Score!B926>0,Score!B926,\"\")","v":""},{"$f":"IF(Score!B926>0,VLOOKUP(C927,Entrants!$A$2:$E$5000,3,FALSE),\"\")","v":""},{"$f":"IF(Score!B926>0,VLOOKUP(C927,Entrants!$A$2:$E$5000,2,FALSE),\"\")","v":""},{"$f":"IF(Score!B926>0,VLOOKUP(C927,Entrants!$A$2:$E$5000,4,FALSE),\"\")","v":""},{"$f":"IF(Score!C926>0,Score!C926,\"\")","v":""}]
[{"$f":"IF(Score!B927>0,Score!A927,\"\")","v":""},{"$f":"IF(Score!B927>0,IF(COUNTIF($E$3:E928,E928)>7,\"\",MAX($B$3:B927)+1),\"\")","v":""},{"$f":"IF(Score!B927>0,Score!B927,\"\")","v":""},{"$f":"IF(Score!B927>0,VLOOKUP(C928,Entrants!$A$2:$E$5000,3,FALSE),\"\")","v":""},{"$f":"IF(Score!B927>0,VLOOKUP(C928,Entrants!$A$2:$E$5000,2,FALSE),\"\")","v":""},{"$f":"IF(Score!B927>0,VLOOKUP(C928,Entrants!$A$2:$E$5000,4,FALSE),\"\")","v":""},{"$f":"IF(Score!C927>0,Score!C927,\"\")","v":""}]
[{"$f":"IF(Score!B928>0,Score!A928,\"\")","v":""},{"$f":"IF(Score!B928>0,IF(COUNTIF($E$3:E929,E929)>7,\"\",MAX($B$3:B928)+1),\"\")","v":""},{"$f":"IF(Score!B928>0,Score!B928,\"\")","v":""},{"$f":"IF(Score!B928>0,VLOOKUP(C929,Entrants!$A$2:$E$5000,3,FALSE),\"\")","v":""},{"$f":"IF(Score!B928>0,VLOOKUP(C929,Entrants!$A$2:$E$5000,2,FALSE),\"\")","v":""},{"$f":"IF(Score!B928>0,VLOOKUP(C929,Entrants!$A$2:$E$5000,4,FALSE),\"\")","v":""},{"$f":"IF(Score!C928>0,Score!C928,\"\")","v":""}]
[{"$f":"IF(Score!B929>0,Score!A929,\"\")","v":""},{"$f":"IF(Score!B929>0,IF(COUNTIF($E$3:E930,E930)>7,\"\",MAX($B$3:B929)+1),\"\")","v":""},{"$f":"IF(Score!B929>0,Score!B929,\"\")","v":""},{"$f":"IF(Score!B929>0,VLOOKUP(C930,Entrants!$A$2:$E$5000,3,FALSE),\"\")","v":""},{"$f":"IF(Score!B929>0,VLOOKUP(C930,Entrants!$A$2:$E$5000,2,FALSE),\"\")","v":""},{"$f":"IF(Score!B929>0,VLOOKUP(C930,Entrants!$A$2:$E$5000,4,FALSE),\"\")","v":""},{"$f":"IF(Score!C929>0,Score!C929,\"\")","v":""}]
[{"$f":"IF(Score!B930>0,Score!A930,\"\")","v":""},{"$f":"IF(Score!B930>0,IF(COUNTIF($E$3:E931,E931)>7,\"\",MAX($B$3:B930)+1),\"\")","v":""},{"$f":"IF(Score!B930>0,Score!B930,\"\")","v":""},{"$f":"IF(Score!B930>0,VLOOKUP(C931,Entrants!$A$2:$E$5000,3,FALSE),\"\")","v":""},{"$f":"IF(Score!B930>0,VLOOKUP(C931,Entrants!$A$2:$E$5000,2,FALSE),\"\")","v":""},{"$f":"IF(Score!B930>0,VLOOKUP(C931,Entrants!$A$2:$E$5000,4,FALSE),\"\")","v":""},{"$f":"IF(Score!C930>0,Score!C930,\"\")","v":""}]
[{"$f":"IF(Score!B931>0,Score!A931,\"\")","v":""},{"$f":"IF(Score!B931>0,IF(COUNTIF($E$3:E932,E932)>7,\"\",MAX($B$3:B931)+1),\"\")","v":""},{"$f":"IF(Score!B931>0,Score!B931,\"\")","v":""},{"$f":"IF(Score!B931>0,VLOOKUP(C932,Entrants!$A$2:$E$5000,3,FALSE),\"\")","v":""},{"$f":"IF(Score!B931>0,VLOOKUP(C932,Entrants!$A$2:$E$5000,2,FALSE),\"\")","v":""},{"$f":"IF(Score!B931>0,VLOOKUP(C932,Entrants!$A$2:$E$5000,4,FALSE),\"\")","v":""},{"$f":"IF(Score!C931>0,Score!C931,\"\")","v":""}]
[{"$f":"IF(Score!B932>0,Score!A932,\"\")","v":""},{"$f":"IF(Score!B932>0,IF(COUNTIF($E$3:E933,E933)>7,\"\",MAX($B$3:B932)+1),\"\")","v":""},{"$f":"IF(Score!B932>0,Score!B932,\"\")","v":""},{"$f":"IF(Score!B932>0,VLOOKUP(C933,Entrants!$A$2:$E$5000,3,FALSE),\"\")","v":""},{"$f":"IF(Score!B932>0,VLOOKUP(C933,Entrants!$A$2:$E$5000,2,FALSE),\"\")","v":""},{"$f":"IF(Score!B932>0,VLOOKUP(C933,Entrants!$A$2:$E$5000,4,FALSE),\"\")","v":""},{"$f":"IF(Score!C932>0,Score!C932,\"\")","v":""}]
[{"$f":"IF(Score!B933>0,Score!A933,\"\")","v":""},{"$f":"IF(Score!B933>0,IF(COUNTIF($E$3:E934,E934)>7,\"\",MAX($B$3:B933)+1),\"\")","v":""},{"$f":"IF(Score!B933>0,Score!B933,\"\")","v":""},{"$f":"IF(Score!B933>0,VLOOKUP(C934,Entrants!$A$2:$E$5000,3,FALSE),\"\")","v":""},{"$f":"IF(Score!B933>0,VLOOKUP(C934,Entrants!$A$2:$E$5000,2,FALSE),\"\")","v":""},{"$f":"IF(Score!B933>0,VLOOKUP(C934,Entrants!$A$2:$E$5000,4,FALSE),\"\")","v":""},{"$f":"IF(Score!C933>0,Score!C933,\"\")","v":""}]
[{"$f":"IF(Score!B934>0,Score!A934,\"\")","v":""},{"$f":"IF(Score!B934>0,IF(COUNTIF($E$3:E935,E935)>7,\"\",MAX($B$3:B934)+1),\"\")","v":""},{"$f":"IF(Score!B934>0,Score!B934,\"\")","v":""},{"$f":"IF(Score!B934>0,VLOOKUP(C935,Entrants!$A$2:$E$5000,3,FALSE),\"\")","v":""},{"$f":"IF(Score!B934>0,VLOOKUP(C935,Entrants!$A$2:$E$5000,2,FALSE),\"\")","v":""},{"$f":"IF(Score!B934>0,VLOOKUP(C935,Entrants!$A$2:$E$5000,4,FALSE),\"\")","v":""},{"$f":"IF(Score!C934>0,Score!C934,\"\")","v":""}]
[{"$f":"IF(Score!B935>0,Score!A935,\"\")","v":""},{"$f":"IF(Score!B935>0,IF(COUNTIF($E$3:E936,E936)>7,\"\",MAX($B$3:B935)+1),\"\")","v":""},{"$f":"IF(Score!B935>0,Score!B935,\"\")","v":""},{"$f":"IF(Score!B935>0,VLOOKUP(C936,Entrants!$A$2:$E$5000,3,FALSE),\"\")","v":""},{"$f":"IF(Score!B935>0,VLOOKUP(C936,Entrants!$A$2:$E$5000,2,FALSE),\"\")","v":""},{"$f":"IF(Score!B935>0,VLOOKUP(C936,Entrants!$A$2:$E$5000,4,FALSE),\"\")","v":""},{"$f":"IF(Score!C935>0,Score!C935,\"\")","v":""}]
[{"$f":"IF(Score!B936>0,Score!A936,\"\")","v":""},{"$f":"IF(Score!B936>0,IF(COUNTIF($E$3:E937,E937)>7,\"\",MAX($B$3:B936)+1),\"\")","v":""},{"$f":"IF(Score!B936>0,Score!B936,\"\")","v":""},{"$f":"IF(Score!B936>0,VLOOKUP(C937,Entrants!$A$2:$E$5000,3,FALSE),\"\")","v":""},{"$f":"IF(Score!B936>0,VLOOKUP(C937,Entrants!$A$2:$E$5000,2,FALSE),\"\")","v":""},{"$f":"IF(Score!B936>0,VLOOKUP(C937,Entrants!$A$2:$E$5000,4,FALSE),\"\")","v":""},{"$f":"IF(Score!C936>0,Score!C936,\"\")","v":""}]
[{"$f":"IF(Score!B937>0,Score!A937,\"\")","v":""},{"$f":"IF(Score!B937>0,IF(COUNTIF($E$3:E938,E938)>7,\"\",MAX($B$3:B937)+1),\"\")","v":""},{"$f":"IF(Score!B937>0,Score!B937,\"\")","v":""},{"$f":"IF(Score!B937>0,VLOOKUP(C938,Entrants!$A$2:$E$5000,3,FALSE),\"\")","v":""},{"$f":"IF(Score!B937>0,VLOOKUP(C938,Entrants!$A$2:$E$5000,2,FALSE),\"\")","v":""},{"$f":"IF(Score!B937>0,VLOOKUP(C938,Entrants!$A$2:$E$5000,4,FALSE),\"\")","v":""},{"$f":"IF(Score!C937>0,Score!C937,\"\")","v":""}]
[{"$f":"IF(Score!B938>0,Score!A938,\"\")","v":""},{"$f":"IF(Score!B938>0,IF(COUNTIF($E$3:E939,E939)>7,\"\",MAX($B$3:B938)+1),\"\")","v":""},{"$f":"IF(Score!B938>0,Score!B938,\"\")","v":""},{"$f":"IF(Score!B938>0,VLOOKUP(C939,Entrants!$A$2:$E$5000,3,FALSE),\"\")","v":""},{"$f":"IF(Score!B938>0,VLOOKUP(C939,Entrants!$A$2:$E$5000,2,FALSE),\"\")","v":""},{"$f":"IF(Score!B938>0,VLOOKUP(C939,Entrants!$A$2:$E$5000,4,FALSE),\"\")","v":""},{"$f":"IF(Score!C938>0,Score!C938,\"\")","v":""}]
[{"$f":"IF(Score!B939>0,Score!A939,\"\")","v":""},{"$f":"IF(Score!B939>0,IF(COUNTIF($E$3:E940,E940)>7,\"\",MAX($B$3:B939)+1),\"\")","v":""},{"$f":"IF(Score!B939>0,Score!B939,\"\")","v":""},{"$f":"IF(Score!B939>0,VLOOKUP(C940,Entrants!$A$2:$E$5000,3,FALSE),\"\")","v":""},{"$f":"IF(Score!B939>0,VLOOKUP(C940,Entrants!$A$2:$E$5000,2,FALSE),\"\")","v":""},{"$f":"IF(Score!B939>0,VLOOKUP(C940,Entrants!$A$2:$E$5000,4,FALSE),\"\")","v":""},{"$f":"IF(Score!C939>0,Score!C939,\"\")","v":""}]
[{"$f":"IF(Score!B940>0,Score!A940,\"\")","v":""},{"$f":"IF(Score!B940>0,IF(COUNTIF($E$3:E941,E941)>7,\"\",MAX($B$3:B940)+1),\"\")","v":""},{"$f":"IF(Score!B940>0,Score!B940,\"\")","v":""},{"$f":"IF(Score!B940>0,VLOOKUP(C941,Entrants!$A$2:$E$5000,3,FALSE),\"\")","v":""},{"$f":"IF(Score!B940>0,VLOOKUP(C941,Entrants!$A$2:$E$5000,2,FALSE),\"\")","v":""},{"$f":"IF(Score!B940>0,VLOOKUP(C941,Entrants!$A$2:$E$5000,4,FALSE),\"\")","v":""},{"$f":"IF(Score!C940>0,Score!C940,\"\")","v":""}]
[{"$f":"IF(Score!B941>0,Score!A941,\"\")","v":""},{"$f":"IF(Score!B941>0,IF(COUNTIF($E$3:E942,E942)>7,\"\",MAX($B$3:B941)+1),\"\")","v":""},{"$f":"IF(Score!B941>0,Score!B941,\"\")","v":""},{"$f":"IF(Score!B941>0,VLOOKUP(C942,Entrants!$A$2:$E$5000,3,FALSE),\"\")","v":""},{"$f":"IF(Score!B941>0,VLOOKUP(C942,Entrants!$A$2:$E$5000,2,FALSE),\"\")","v":""},{"$f":"IF(Score!B941>0,VLOOKUP(C942,Entrants!$A$2:$E$5000,4,FALSE),\"\")","v":""},{"$f":"IF(Score!C941>0,Score!C941,\"\")","v":""}]
[{"$f":"IF(Score!B942>0,Score!A942,\"\")","v":""},{"$f":"IF(Score!B942>0,IF(COUNTIF($E$3:E943,E943)>7,\"\",MAX($B$3:B942)+1),\"\")","v":""},{"$f":"IF(Score!B942>0,Score!B942,\"\")","v":""},{"$f":"IF(Score!B942>0,VLOOKUP(C943,Entrants!$A$2:$E$5000,3,FALSE),\"\")","v":""},{"$f":"IF(Score!B942>0,VLOOKUP(C943,Entrants!$A$2:$E$5000,2,FALSE),\"\")","v":""},{"$f":"IF(Score!B942>0,VLOOKUP(C943,Entrants!$A$2:$E$5000,4,FALSE),\"\")","v":""},{"$f":"IF(Score!C942>0,Score!C942,\"\")","v":""}]
[{"$f":"IF(Score!B943>0,Score!A943,\"\")","v":""},{"$f":"IF(Score!B943>0,IF(COUNTIF($E$3:E944,E944)>7,\"\",MAX($B$3:B943)+1),\"\")","v":""},{"$f":"IF(Score!B943>0,Score!B943,\"\")","v":""},{"$f":"IF(Score!B943>0,VLOOKUP(C944,Entrants!$A$2:$E$5000,3,FALSE),\"\")","v":""},{"$f":"IF(Score!B943>0,VLOOKUP(C944,Entrants!$A$2:$E$5000,2,FALSE),\"\")","v":""},{"$f":"IF(Score!B943>0,VLOOKUP(C944,Entrants!$A$2:$E$5000,4,FALSE),\"\")","v":""},{"$f":"IF(Score!C943>0,Score!C943,\"\")","v":""}]
[{"$f":"IF(Score!B944>0,Score!A944,\"\")","v":""},{"$f":"IF(Score!B944>0,IF(COUNTIF($E$3:E945,E945)>7,\"\",MAX($B$3:B944)+1),\"\")","v":""},{"$f":"IF(Score!B944>0,Score!B944,\"\")","v":""},{"$f":"IF(Score!B944>0,VLOOKUP(C945,Entrants!$A$2:$E$5000,3,FALSE),\"\")","v":""},{"$f":"IF(Score!B944>0,VLOOKUP(C945,Entrants!$A$2:$E$5000,2,FALSE),\"\")","v":""},{"$f":"IF(Score!B944>0,VLOOKUP(C945,Entrants!$A$2:$E$5000,4,FALSE),\"\")","v":""},{"$f":"IF(Score!C944>0,Score!C944,\"\")","v":""}]
[{"$f":"IF(Score!B945>0,Score!A945,\"\")","v":""},{"$f":"IF(Score!B945>0,IF(COUNTIF($E$3:E946,E946)>7,\"\",MAX($B$3:B945)+1),\"\")","v":""},{"$f":"IF(Score!B945>0,Score!B945,\"\")","v":""},{"$f":"IF(Score!B945>0,VLOOKUP(C946,Entrants!$A$2:$E$5000,3,FALSE),\"\")","v":""},{"$f":"IF(Score!B945>0,VLOOKUP(C946,Entrants!$A$2:$E$5000,2,FALSE),\"\")","v":""},{"$f":"IF(Score!B945>0,VLOOKUP(C946,Entrants!$A$2:$E$5000,4,FALSE),\"\")","v":""},{"$f":"IF(Score!C945>0,Score!C945,\"\")","v":""}]
[{"$f":"IF(Score!B946>0,Score!A946,\"\")","v":""},{"$f":"IF(Score!B946>0,IF(COUNTIF($E$3:E947,E947)>7,\"\",MAX($B$3:B946)+1),\"\")","v":""},{"$f":"IF(Score!B946>0,Score!B946,\"\")","v":""},{"$f":"IF(Score!B946>0,VLOOKUP(C947,Entrants!$A$2:$E$5000,3,FALSE),\"\")","v":""},{"$f":"IF(Score!B946>0,VLOOKUP(C947,Entrants!$A$2:$E$5000,2,FALSE),\"\")","v":""},{"$f":"IF(Score!B946>0,VLOOKUP(C947,Entrants!$A$2:$E$5000,4,FALSE),\"\")","v":""},{"$f":"IF(Score!C946>0,Score!C946,\"\")","v":""}]
[{"$f":"IF(Score!B947>0,Score!A947,\"\")","v":""},{"$f":"IF(Score!B947>0,IF(COUNTIF($E$3:E948,E948)>7,\"\",MAX($B$3:B947)+1),\"\")","v":""},{"$f":"IF(Score!B947>0,Score!B947,\"\")","v":""},{"$f":"IF(Score!B947>0,VLOOKUP(C948,Entrants!$A$2:$E$5000,3,FALSE),\"\")","v":""},{"$f":"IF(Score!B947>0,VLOOKUP(C948,Entrants!$A$2:$E$5000,2,FALSE),\"\")","v":""},{"$f":"IF(Score!B947>0,VLOOKUP(C948,Entrants!$A$2:$E$5000,4,FALSE),\"\")","v":""},{"$f":"IF(Score!C947>0,Score!C947,\"\")","v":""}]
[{"$f":"IF(Score!B948>0,Score!A948,\"\")","v":""},{"$f":"IF(Score!B948>0,IF(COUNTIF($E$3:E949,E949)>7,\"\",MAX($B$3:B948)+1),\"\")","v":""},{"$f":"IF(Score!B948>0,Score!B948,\"\")","v":""},{"$f":"IF(Score!B948>0,VLOOKUP(C949,Entrants!$A$2:$E$5000,3,FALSE),\"\")","v":""},{"$f":"IF(Score!B948>0,VLOOKUP(C949,Entrants!$A$2:$E$5000,2,FALSE),\"\")","v":""},{"$f":"IF(Score!B948>0,VLOOKUP(C949,Entrants!$A$2:$E$5000,4,FALSE),\"\")","v":""},{"$f":"IF(Score!C948>0,Score!C948,\"\")","v":""}]
[{"$f":"IF(Score!B949>0,Score!A949,\"\")","v":""},{"$f":"IF(Score!B949>0,IF(COUNTIF($E$3:E950,E950)>7,\"\",MAX($B$3:B949)+1),\"\")","v":""},{"$f":"IF(Score!B949>0,Score!B949,\"\")","v":""},{"$f":"IF(Score!B949>0,VLOOKUP(C950,Entrants!$A$2:$E$5000,3,FALSE),\"\")","v":""},{"$f":"IF(Score!B949>0,VLOOKUP(C950,Entrants!$A$2:$E$5000,2,FALSE),\"\")","v":""},{"$f":"IF(Score!B949>0,VLOOKUP(C950,Entrants!$A$2:$E$5000,4,FALSE),\"\")","v":""},{"$f":"IF(Score!C949>0,Score!C949,\"\")","v":""}]
[{"$f":"IF(Score!B950>0,Score!A950,\"\")","v":""},{"$f":"IF(Score!B950>0,IF(COUNTIF($E$3:E951,E951)>7,\"\",MAX($B$3:B950)+1),\"\")","v":""},{"$f":"IF(Score!B950>0,Score!B950,\"\")","v":""},{"$f":"IF(Score!B950>0,VLOOKUP(C951,Entrants!$A$2:$E$5000,3,FALSE),\"\")","v":""},{"$f":"IF(Score!B950>0,VLOOKUP(C951,Entrants!$A$2:$E$5000,2,FALSE),\"\")","v":""},{"$f":"IF(Score!B950>0,VLOOKUP(C951,Entrants!$A$2:$E$5000,4,FALSE),\"\")","v":""},{"$f":"IF(Score!C950>0,Score!C950,\"\")","v":""}]
[{"$f":"IF(Score!B951>0,Score!A951,\"\")","v":""},{"$f":"IF(Score!B951>0,IF(COUNTIF($E$3:E952,E952)>7,\"\",MAX($B$3:B951)+1),\"\")","v":""},{"$f":"IF(Score!B951>0,Score!B951,\"\")","v":""},{"$f":"IF(Score!B951>0,VLOOKUP(C952,Entrants!$A$2:$E$5000,3,FALSE),\"\")","v":""},{"$f":"IF(Score!B951>0,VLOOKUP(C952,Entrants!$A$2:$E$5000,2,FALSE),\"\")","v":""},{"$f":"IF(Score!B951>0,VLOOKUP(C952,Entrants!$A$2:$E$5000,4,FALSE),\"\")","v":""},{"$f":"IF(Score!C951>0,Score!C951,\"\")","v":""}]
[{"$f":"IF(Score!B952>0,Score!A952,\"\")","v":""},{"$f":"IF(Score!B952>0,IF(COUNTIF($E$3:E953,E953)>7,\"\",MAX($B$3:B952)+1),\"\")","v":""},{"$f":"IF(Score!B952>0,Score!B952,\"\")","v":""},{"$f":"IF(Score!B952>0,VLOOKUP(C953,Entrants!$A$2:$E$5000,3,FALSE),\"\")","v":""},{"$f":"IF(Score!B952>0,VLOOKUP(C953,Entrants!$A$2:$E$5000,2,FALSE),\"\")","v":""},{"$f":"IF(Score!B952>0,VLOOKUP(C953,Entrants!$A$2:$E$5000,4,FALSE),\"\")","v":""},{"$f":"IF(Score!C952>0,Score!C952,\"\")","v":""}]
[{"$f":"IF(Score!B953>0,Score!A953,\"\")","v":""},{"$f":"IF(Score!B953>0,IF(COUNTIF($E$3:E954,E954)>7,\"\",MAX($B$3:B953)+1),\"\")","v":""},{"$f":"IF(Score!B953>0,Score!B953,\"\")","v":""},{"$f":"IF(Score!B953>0,VLOOKUP(C954,Entrants!$A$2:$E$5000,3,FALSE),\"\")","v":""},{"$f":"IF(Score!B953>0,VLOOKUP(C954,Entrants!$A$2:$E$5000,2,FALSE),\"\")","v":""},{"$f":"IF(Score!B953>0,VLOOKUP(C954,Entrants!$A$2:$E$5000,4,FALSE),\"\")","v":""},{"$f":"IF(Score!C953>0,Score!C953,\"\")","v":""}]
[{"$f":"IF(Score!B954>0,Score!A954,\"\")","v":""},{"$f":"IF(Score!B954>0,IF(COUNTIF($E$3:E955,E955)>7,\"\",MAX($B$3:B954)+1),\"\")","v":""},{"$f":"IF(Score!B954>0,Score!B954,\"\")","v":""},{"$f":"IF(Score!B954>0,VLOOKUP(C955,Entrants!$A$2:$E$5000,3,FALSE),\"\")","v":""},{"$f":"IF(Score!B954>0,VLOOKUP(C955,Entrants!$A$2:$E$5000,2,FALSE),\"\")","v":""},{"$f":"IF(Score!B954>0,VLOOKUP(C955,Entrants!$A$2:$E$5000,4,FALSE),\"\")","v":""},{"$f":"IF(Score!C954>0,Score!C954,\"\")","v":""}]
[{"$f":"IF(Score!B955>0,Score!A955,\"\")","v":""},{"$f":"IF(Score!B955>0,IF(COUNTIF($E$3:E956,E956)>7,\"\",MAX($B$3:B955)+1),\"\")","v":""},{"$f":"IF(Score!B955>0,Score!B955,\"\")","v":""},{"$f":"IF(Score!B955>0,VLOOKUP(C956,Entrants!$A$2:$E$5000,3,FALSE),\"\")","v":""},{"$f":"IF(Score!B955>0,VLOOKUP(C956,Entrants!$A$2:$E$5000,2,FALSE),\"\")","v":""},{"$f":"IF(Score!B955>0,VLOOKUP(C956,Entrants!$A$2:$E$5000,4,FALSE),\"\")","v":""},{"$f":"IF(Score!C955>0,Score!C955,\"\")","v":""}]
[{"$f":"IF(Score!B956>0,Score!A956,\"\")","v":""},{"$f":"IF(Score!B956>0,IF(COUNTIF($E$3:E957,E957)>7,\"\",MAX($B$3:B956)+1),\"\")","v":""},{"$f":"IF(Score!B956>0,Score!B956,\"\")","v":""},{"$f":"IF(Score!B956>0,VLOOKUP(C957,Entrants!$A$2:$E$5000,3,FALSE),\"\")","v":""},{"$f":"IF(Score!B956>0,VLOOKUP(C957,Entrants!$A$2:$E$5000,2,FALSE),\"\")","v":""},{"$f":"IF(Score!B956>0,VLOOKUP(C957,Entrants!$A$2:$E$5000,4,FALSE),\"\")","v":""},{"$f":"IF(Score!C956>0,Score!C956,\"\")","v":""}]
[{"$f":"IF(Score!B957>0,Score!A957,\"\")","v":""},{"$f":"IF(Score!B957>0,IF(COUNTIF($E$3:E958,E958)>7,\"\",MAX($B$3:B957)+1),\"\")","v":""},{"$f":"IF(Score!B957>0,Score!B957,\"\")","v":""},{"$f":"IF(Score!B957>0,VLOOKUP(C958,Entrants!$A$2:$E$5000,3,FALSE),\"\")","v":""},{"$f":"IF(Score!B957>0,VLOOKUP(C958,Entrants!$A$2:$E$5000,2,FALSE),\"\")","v":""},{"$f":"IF(Score!B957>0,VLOOKUP(C958,Entrants!$A$2:$E$5000,4,FALSE),\"\")","v":""},{"$f":"IF(Score!C957>0,Score!C957,\"\")","v":""}]
[{"$f":"IF(Score!B958>0,Score!A958,\"\")","v":""},{"$f":"IF(Score!B958>0,IF(COUNTIF($E$3:E959,E959)>7,\"\",MAX($B$3:B958)+1),\"\")","v":""},{"$f":"IF(Score!B958>0,Score!B958,\"\")","v":""},{"$f":"IF(Score!B958>0,VLOOKUP(C959,Entrants!$A$2:$E$5000,3,FALSE),\"\")","v":""},{"$f":"IF(Score!B958>0,VLOOKUP(C959,Entrants!$A$2:$E$5000,2,FALSE),\"\")","v":""},{"$f":"IF(Score!B958>0,VLOOKUP(C959,Entrants!$A$2:$E$5000,4,FALSE),\"\")","v":""},{"$f":"IF(Score!C958>0,Score!C958,\"\")","v":""}]
[{"$f":"IF(Score!B959>0,Score!A959,\"\")","v":""},{"$f":"IF(Score!B959>0,IF(COUNTIF($E$3:E960,E960)>7,\"\",MAX($B$3:B959)+1),\"\")","v":""},{"$f":"IF(Score!B959>0,Score!B959,\"\")","v":""},{"$f":"IF(Score!B959>0,VLOOKUP(C960,Entrants!$A$2:$E$5000,3,FALSE),\"\")","v":""},{"$f":"IF(Score!B959>0,VLOOKUP(C960,Entrants!$A$2:$E$5000,2,FALSE),\"\")","v":""},{"$f":"IF(Score!B959>0,VLOOKUP(C960,Entrants!$A$2:$E$5000,4,FALSE),\"\")","v":""},{"$f":"IF(Score!C959>0,Score!C959,\"\")","v":""}]
[{"$f":"IF(Score!B960>0,Score!A960,\"\")","v":""},{"$f":"IF(Score!B960>0,IF(COUNTIF($E$3:E961,E961)>7,\"\",MAX($B$3:B960)+1),\"\")","v":""},{"$f":"IF(Score!B960>0,Score!B960,\"\")","v":""},{"$f":"IF(Score!B960>0,VLOOKUP(C961,Entrants!$A$2:$E$5000,3,FALSE),\"\")","v":""},{"$f":"IF(Score!B960>0,VLOOKUP(C961,Entrants!$A$2:$E$5000,2,FALSE),\"\")","v":""},{"$f":"IF(Score!B960>0,VLOOKUP(C961,Entrants!$A$2:$E$5000,4,FALSE),\"\")","v":""},{"$f":"IF(Score!C960>0,Score!C960,\"\")","v":""}]
[{"$f":"IF(Score!B961>0,Score!A961,\"\")","v":""},{"$f":"IF(Score!B961>0,IF(COUNTIF($E$3:E962,E962)>7,\"\",MAX($B$3:B961)+1),\"\")","v":""},{"$f":"IF(Score!B961>0,Score!B961,\"\")","v":""},{"$f":"IF(Score!B961>0,VLOOKUP(C962,Entrants!$A$2:$E$5000,3,FALSE),\"\")","v":""},{"$f":"IF(Score!B961>0,VLOOKUP(C962,Entrants!$A$2:$E$5000,2,FALSE),\"\")","v":""},{"$f":"IF(Score!B961>0,VLOOKUP(C962,Entrants!$A$2:$E$5000,4,FALSE),\"\")","v":""},{"$f":"IF(Score!C961>0,Score!C961,\"\")","v":""}]
[{"$f":"IF(Score!B962>0,Score!A962,\"\")","v":""},{"$f":"IF(Score!B962>0,IF(COUNTIF($E$3:E963,E963)>7,\"\",MAX($B$3:B962)+1),\"\")","v":""},{"$f":"IF(Score!B962>0,Score!B962,\"\")","v":""},{"$f":"IF(Score!B962>0,VLOOKUP(C963,Entrants!$A$2:$E$5000,3,FALSE),\"\")","v":""},{"$f":"IF(Score!B962>0,VLOOKUP(C963,Entrants!$A$2:$E$5000,2,FALSE),\"\")","v":""},{"$f":"IF(Score!B962>0,VLOOKUP(C963,Entrants!$A$2:$E$5000,4,FALSE),\"\")","v":""},{"$f":"IF(Score!C962>0,Score!C962,\"\")","v":""}]
[{"$f":"IF(Score!B963>0,Score!A963,\"\")","v":""},{"$f":"IF(Score!B963>0,IF(COUNTIF($E$3:E964,E964)>7,\"\",MAX($B$3:B963)+1),\"\")","v":""},{"$f":"IF(Score!B963>0,Score!B963,\"\")","v":""},{"$f":"IF(Score!B963>0,VLOOKUP(C964,Entrants!$A$2:$E$5000,3,FALSE),\"\")","v":""},{"$f":"IF(Score!B963>0,VLOOKUP(C964,Entrants!$A$2:$E$5000,2,FALSE),\"\")","v":""},{"$f":"IF(Score!B963>0,VLOOKUP(C964,Entrants!$A$2:$E$5000,4,FALSE),\"\")","v":""},{"$f":"IF(Score!C963>0,Score!C963,\"\")","v":""}]
[{"$f":"IF(Score!B964>0,Score!A964,\"\")","v":""},{"$f":"IF(Score!B964>0,IF(COUNTIF($E$3:E965,E965)>7,\"\",MAX($B$3:B964)+1),\"\")","v":""},{"$f":"IF(Score!B964>0,Score!B964,\"\")","v":""},{"$f":"IF(Score!B964>0,VLOOKUP(C965,Entrants!$A$2:$E$5000,3,FALSE),\"\")","v":""},{"$f":"IF(Score!B964>0,VLOOKUP(C965,Entrants!$A$2:$E$5000,2,FALSE),\"\")","v":""},{"$f":"IF(Score!B964>0,VLOOKUP(C965,Entrants!$A$2:$E$5000,4,FALSE),\"\")","v":""},{"$f":"IF(Score!C964>0,Score!C964,\"\")","v":""}]
[{"$f":"IF(Score!B965>0,Score!A965,\"\")","v":""},{"$f":"IF(Score!B965>0,IF(COUNTIF($E$3:E966,E966)>7,\"\",MAX($B$3:B965)+1),\"\")","v":""},{"$f":"IF(Score!B965>0,Score!B965,\"\")","v":""},{"$f":"IF(Score!B965>0,VLOOKUP(C966,Entrants!$A$2:$E$5000,3,FALSE),\"\")","v":""},{"$f":"IF(Score!B965>0,VLOOKUP(C966,Entrants!$A$2:$E$5000,2,FALSE),\"\")","v":""},{"$f":"IF(Score!B965>0,VLOOKUP(C966,Entrants!$A$2:$E$5000,4,FALSE),\"\")","v":""},{"$f":"IF(Score!C965>0,Score!C965,\"\")","v":""}]
[{"$f":"IF(Score!B966>0,Score!A966,\"\")","v":""},{"$f":"IF(Score!B966>0,IF(COUNTIF($E$3:E967,E967)>7,\"\",MAX($B$3:B966)+1),\"\")","v":""},{"$f":"IF(Score!B966>0,Score!B966,\"\")","v":""},{"$f":"IF(Score!B966>0,VLOOKUP(C967,Entrants!$A$2:$E$5000,3,FALSE),\"\")","v":""},{"$f":"IF(Score!B966>0,VLOOKUP(C967,Entrants!$A$2:$E$5000,2,FALSE),\"\")","v":""},{"$f":"IF(Score!B966>0,VLOOKUP(C967,Entrants!$A$2:$E$5000,4,FALSE),\"\")","v":""},{"$f":"IF(Score!C966>0,Score!C966,\"\")","v":""}]
[{"$f":"IF(Score!B967>0,Score!A967,\"\")","v":""},{"$f":"IF(Score!B967>0,IF(COUNTIF($E$3:E968,E968)>7,\"\",MAX($B$3:B967)+1),\"\")","v":""},{"$f":"IF(Score!B967>0,Score!B967,\"\")","v":""},{"$f":"IF(Score!B967>0,VLOOKUP(C968,Entrants!$A$2:$E$5000,3,FALSE),\"\")","v":""},{"$f":"IF(Score!B967>0,VLOOKUP(C968,Entrants!$A$2:$E$5000,2,FALSE),\"\")","v":""},{"$f":"IF(Score!B967>0,VLOOKUP(C968,Entrants!$A$2:$E$5000,4,FALSE),\"\")","v":""},{"$f":"IF(Score!C967>0,Score!C967,\"\")","v":""}]
[{"$f":"IF(Score!B968>0,Score!A968,\"\")","v":""},{"$f":"IF(Score!B968>0,IF(COUNTIF($E$3:E969,E969)>7,\"\",MAX($B$3:B968)+1),\"\")","v":""},{"$f":"IF(Score!B968>0,Score!B968,\"\")","v":""},{"$f":"IF(Score!B968>0,VLOOKUP(C969,Entrants!$A$2:$E$5000,3,FALSE),\"\")","v":""},{"$f":"IF(Score!B968>0,VLOOKUP(C969,Entrants!$A$2:$E$5000,2,FALSE),\"\")","v":""},{"$f":"IF(Score!B968>0,VLOOKUP(C969,Entrants!$A$2:$E$5000,4,FALSE),\"\")","v":""},{"$f":"IF(Score!C968>0,Score!C968,\"\")","v":""}]
[{"$f":"IF(Score!B969>0,Score!A969,\"\")","v":""},{"$f":"IF(Score!B969>0,IF(COUNTIF($E$3:E970,E970)>7,\"\",MAX($B$3:B969)+1),\"\")","v":""},{"$f":"IF(Score!B969>0,Score!B969,\"\")","v":""},{"$f":"IF(Score!B969>0,VLOOKUP(C970,Entrants!$A$2:$E$5000,3,FALSE),\"\")","v":""},{"$f":"IF(Score!B969>0,VLOOKUP(C970,Entrants!$A$2:$E$5000,2,FALSE),\"\")","v":""},{"$f":"IF(Score!B969>0,VLOOKUP(C970,Entrants!$A$2:$E$5000,4,FALSE),\"\")","v":""},{"$f":"IF(Score!C969>0,Score!C969,\"\")","v":""}]
[{"$f":"IF(Score!B970>0,Score!A970,\"\")","v":""},{"$f":"IF(Score!B970>0,IF(COUNTIF($E$3:E971,E971)>7,\"\",MAX($B$3:B970)+1),\"\")","v":""},{"$f":"IF(Score!B970>0,Score!B970,\"\")","v":""},{"$f":"IF(Score!B970>0,VLOOKUP(C971,Entrants!$A$2:$E$5000,3,FALSE),\"\")","v":""},{"$f":"IF(Score!B970>0,VLOOKUP(C971,Entrants!$A$2:$E$5000,2,FALSE),\"\")","v":""},{"$f":"IF(Score!B970>0,VLOOKUP(C971,Entrants!$A$2:$E$5000,4,FALSE),\"\")","v":""},{"$f":"IF(Score!C970>0,Score!C970,\"\")","v":""}]
[{"$f":"IF(Score!B971>0,Score!A971,\"\")","v":""},{"$f":"IF(Score!B971>0,IF(COUNTIF($E$3:E972,E972)>7,\"\",MAX($B$3:B971)+1),\"\")","v":""},{"$f":"IF(Score!B971>0,Score!B971,\"\")","v":""},{"$f":"IF(Score!B971>0,VLOOKUP(C972,Entrants!$A$2:$E$5000,3,FALSE),\"\")","v":""},{"$f":"IF(Score!B971>0,VLOOKUP(C972,Entrants!$A$2:$E$5000,2,FALSE),\"\")","v":""},{"$f":"IF(Score!B971>0,VLOOKUP(C972,Entrants!$A$2:$E$5000,4,FALSE),\"\")","v":""},{"$f":"IF(Score!C971>0,Score!C971,\"\")","v":""}]
[{"$f":"IF(Score!B972>0,Score!A972,\"\")","v":""},{"$f":"IF(Score!B972>0,IF(COUNTIF($E$3:E973,E973)>7,\"\",MAX($B$3:B972)+1),\"\")","v":""},{"$f":"IF(Score!B972>0,Score!B972,\"\")","v":""},{"$f":"IF(Score!B972>0,VLOOKUP(C973,Entrants!$A$2:$E$5000,3,FALSE),\"\")","v":""},{"$f":"IF(Score!B972>0,VLOOKUP(C973,Entrants!$A$2:$E$5000,2,FALSE),\"\")","v":""},{"$f":"IF(Score!B972>0,VLOOKUP(C973,Entrants!$A$2:$E$5000,4,FALSE),\"\")","v":""},{"$f":"IF(Score!C972>0,Score!C972,\"\")","v":""}]
[{"$f":"IF(Score!B973>0,Score!A973,\"\")","v":""},{"$f":"IF(Score!B973>0,IF(COUNTIF($E$3:E974,E974)>7,\"\",MAX($B$3:B973)+1),\"\")","v":""},{"$f":"IF(Score!B973>0,Score!B973,\"\")","v":""},{"$f":"IF(Score!B973>0,VLOOKUP(C974,Entrants!$A$2:$E$5000,3,FALSE),\"\")","v":""},{"$f":"IF(Score!B973>0,VLOOKUP(C974,Entrants!$A$2:$E$5000,2,FALSE),\"\")","v":""},{"$f":"IF(Score!B973>0,VLOOKUP(C974,Entrants!$A$2:$E$5000,4,FALSE),\"\")","v":""},{"$f":"IF(Score!C973>0,Score!C973,\"\")","v":""}]
[{"$f":"IF(Score!B974>0,Score!A974,\"\")","v":""},{"$f":"IF(Score!B974>0,IF(COUNTIF($E$3:E975,E975)>7,\"\",MAX($B$3:B974)+1),\"\")","v":""},{"$f":"IF(Score!B974>0,Score!B974,\"\")","v":""},{"$f":"IF(Score!B974>0,VLOOKUP(C975,Entrants!$A$2:$E$5000,3,FALSE),\"\")","v":""},{"$f":"IF(Score!B974>0,VLOOKUP(C975,Entrants!$A$2:$E$5000,2,FALSE),\"\")","v":""},{"$f":"IF(Score!B974>0,VLOOKUP(C975,Entrants!$A$2:$E$5000,4,FALSE),\"\")","v":""},{"$f":"IF(Score!C974>0,Score!C974,\"\")","v":""}]
[{"$f":"IF(Score!B975>0,Score!A975,\"\")","v":""},{"$f":"IF(Score!B975>0,IF(COUNTIF($E$3:E976,E976)>7,\"\",MAX($B$3:B975)+1),\"\")","v":""},{"$f":"IF(Score!B975>0,Score!B975,\"\")","v":""},{"$f":"IF(Score!B975>0,VLOOKUP(C976,Entrants!$A$2:$E$5000,3,FALSE),\"\")","v":""},{"$f":"IF(Score!B975>0,VLOOKUP(C976,Entrants!$A$2:$E$5000,2,FALSE),\"\")","v":""},{"$f":"IF(Score!B975>0,VLOOKUP(C976,Entrants!$A$2:$E$5000,4,FALSE),\"\")","v":""},{"$f":"IF(Score!C975>0,Score!C975,\"\")","v":""}]
[{"$f":"IF(Score!B976>0,Score!A976,\"\")","v":""},{"$f":"IF(Score!B976>0,IF(COUNTIF($E$3:E977,E977)>7,\"\",MAX($B$3:B976)+1),\"\")","v":""},{"$f":"IF(Score!B976>0,Score!B976,\"\")","v":""},{"$f":"IF(Score!B976>0,VLOOKUP(C977,Entrants!$A$2:$E$5000,3,FALSE),\"\")","v":""},{"$f":"IF(Score!B976>0,VLOOKUP(C977,Entrants!$A$2:$E$5000,2,FALSE),\"\")","v":""},{"$f":"IF(Score!B976>0,VLOOKUP(C977,Entrants!$A$2:$E$5000,4,FALSE),\"\")","v":""},{"$f":"IF(Score!C976>0,Score!C976,\"\")","v":""}]
[{"$f":"IF(Score!B977>0,Score!A977,\"\")","v":""},{"$f":"IF(Score!B977>0,IF(COUNTIF($E$3:E978,E978)>7,\"\",MAX($B$3:B977)+1),\"\")","v":""},{"$f":"IF(Score!B977>0,Score!B977,\"\")","v":""},{"$f":"IF(Score!B977>0,VLOOKUP(C978,Entrants!$A$2:$E$5000,3,FALSE),\"\")","v":""},{"$f":"IF(Score!B977>0,VLOOKUP(C978,Entrants!$A$2:$E$5000,2,FALSE),\"\")","v":""},{"$f":"IF(Score!B977>0,VLOOKUP(C978,Entrants!$A$2:$E$5000,4,FALSE),\"\")","v":""},{"$f":"IF(Score!C977>0,Score!C977,\"\")","v":""}]
[{"$f":"IF(Score!B978>0,Score!A978,\"\")","v":""},{"$f":"IF(Score!B978>0,IF(COUNTIF($E$3:E979,E979)>7,\"\",MAX($B$3:B978)+1),\"\")","v":""},{"$f":"IF(Score!B978>0,Score!B978,\"\")","v":""},{"$f":"IF(Score!B978>0,VLOOKUP(C979,Entrants!$A$2:$E$5000,3,FALSE),\"\")","v":""},{"$f":"IF(Score!B978>0,VLOOKUP(C979,Entrants!$A$2:$E$5000,2,FALSE),\"\")","v":""},{"$f":"IF(Score!B978>0,VLOOKUP(C979,Entrants!$A$2:$E$5000,4,FALSE),\"\")","v":""},{"$f":"IF(Score!C978>0,Score!C978,\"\")","v":""}]
[{"$f":"IF(Score!B979>0,Score!A979,\"\")","v":""},{"$f":"IF(Score!B979>0,IF(COUNTIF($E$3:E980,E980)>7,\"\",MAX($B$3:B979)+1),\"\")","v":""},{"$f":"IF(Score!B979>0,Score!B979,\"\")","v":""},{"$f":"IF(Score!B979>0,VLOOKUP(C980,Entrants!$A$2:$E$5000,3,FALSE),\"\")","v":""},{"$f":"IF(Score!B979>0,VLOOKUP(C980,Entrants!$A$2:$E$5000,2,FALSE),\"\")","v":""},{"$f":"IF(Score!B979>0,VLOOKUP(C980,Entrants!$A$2:$E$5000,4,FALSE),\"\")","v":""},{"$f":"IF(Score!C979>0,Score!C979,\"\")","v":""}]
[{"$f":"IF(Score!B980>0,Score!A980,\"\")","v":""},{"$f":"IF(Score!B980>0,IF(COUNTIF($E$3:E981,E981)>7,\"\",MAX($B$3:B980)+1),\"\")","v":""},{"$f":"IF(Score!B980>0,Score!B980,\"\")","v":""},{"$f":"IF(Score!B980>0,VLOOKUP(C981,Entrants!$A$2:$E$5000,3,FALSE),\"\")","v":""},{"$f":"IF(Score!B980>0,VLOOKUP(C981,Entrants!$A$2:$E$5000,2,FALSE),\"\")","v":""},{"$f":"IF(Score!B980>0,VLOOKUP(C981,Entrants!$A$2:$E$5000,4,FALSE),\"\")","v":""},{"$f":"IF(Score!C980>0,Score!C980,\"\")","v":""}]
[{"$f":"IF(Score!B981>0,Score!A981,\"\")","v":""},{"$f":"IF(Score!B981>0,IF(COUNTIF($E$3:E982,E982)>7,\"\",MAX($B$3:B981)+1),\"\")","v":""},{"$f":"IF(Score!B981>0,Score!B981,\"\")","v":""},{"$f":"IF(Score!B981>0,VLOOKUP(C982,Entrants!$A$2:$E$5000,3,FALSE),\"\")","v":""},{"$f":"IF(Score!B981>0,VLOOKUP(C982,Entrants!$A$2:$E$5000,2,FALSE),\"\")","v":""},{"$f":"IF(Score!B981>0,VLOOKUP(C982,Entrants!$A$2:$E$5000,4,FALSE),\"\")","v":""},{"$f":"IF(Score!C981>0,Score!C981,\"\")","v":""}]
[{"$f":"IF(Score!B982>0,Score!A982,\"\")","v":""},{"$f":"IF(Score!B982>0,IF(COUNTIF($E$3:E983,E983)>7,\"\",MAX($B$3:B982)+1),\"\")","v":""},{"$f":"IF(Score!B982>0,Score!B982,\"\")","v":""},{"$f":"IF(Score!B982>0,VLOOKUP(C983,Entrants!$A$2:$E$5000,3,FALSE),\"\")","v":""},{"$f":"IF(Score!B982>0,VLOOKUP(C983,Entrants!$A$2:$E$5000,2,FALSE),\"\")","v":""},{"$f":"IF(Score!B982>0,VLOOKUP(C983,Entrants!$A$2:$E$5000,4,FALSE),\"\")","v":""},{"$f":"IF(Score!C982>0,Score!C982,\"\")","v":""}]
[{"$f":"IF(Score!B983>0,Score!A983,\"\")","v":""},{"$f":"IF(Score!B983>0,IF(COUNTIF($E$3:E984,E984)>7,\"\",MAX($B$3:B983)+1),\"\")","v":""},{"$f":"IF(Score!B983>0,Score!B983,\"\")","v":""},{"$f":"IF(Score!B983>0,VLOOKUP(C984,Entrants!$A$2:$E$5000,3,FALSE),\"\")","v":""},{"$f":"IF(Score!B983>0,VLOOKUP(C984,Entrants!$A$2:$E$5000,2,FALSE),\"\")","v":""},{"$f":"IF(Score!B983>0,VLOOKUP(C984,Entrants!$A$2:$E$5000,4,FALSE),\"\")","v":""},{"$f":"IF(Score!C983>0,Score!C983,\"\")","v":""}]
[{"$f":"IF(Score!B984>0,Score!A984,\"\")","v":""},{"$f":"IF(Score!B984>0,IF(COUNTIF($E$3:E985,E985)>7,\"\",MAX($B$3:B984)+1),\"\")","v":""},{"$f":"IF(Score!B984>0,Score!B984,\"\")","v":""},{"$f":"IF(Score!B984>0,VLOOKUP(C985,Entrants!$A$2:$E$5000,3,FALSE),\"\")","v":""},{"$f":"IF(Score!B984>0,VLOOKUP(C985,Entrants!$A$2:$E$5000,2,FALSE),\"\")","v":""},{"$f":"IF(Score!B984>0,VLOOKUP(C985,Entrants!$A$2:$E$5000,4,FALSE),\"\")","v":""},{"$f":"IF(Score!C984>0,Score!C984,\"\")","v":""}]
[{"$f":"IF(Score!B985>0,Score!A985,\"\")","v":""},{"$f":"IF(Score!B985>0,IF(COUNTIF($E$3:E986,E986)>7,\"\",MAX($B$3:B985)+1),\"\")","v":""},{"$f":"IF(Score!B985>0,Score!B985,\"\")","v":""},{"$f":"IF(Score!B985>0,VLOOKUP(C986,Entrants!$A$2:$E$5000,3,FALSE),\"\")","v":""},{"$f":"IF(Score!B985>0,VLOOKUP(C986,Entrants!$A$2:$E$5000,2,FALSE),\"\")","v":""},{"$f":"IF(Score!B985>0,VLOOKUP(C986,Entrants!$A$2:$E$5000,4,FALSE),\"\")","v":""},{"$f":"IF(Score!C985>0,Score!C985,\"\")","v":""}]
[{"$f":"IF(Score!B986>0,Score!A986,\"\")","v":""},{"$f":"IF(Score!B986>0,IF(COUNTIF($E$3:E987,E987)>7,\"\",MAX($B$3:B986)+1),\"\")","v":""},{"$f":"IF(Score!B986>0,Score!B986,\"\")","v":""},{"$f":"IF(Score!B986>0,VLOOKUP(C987,Entrants!$A$2:$E$5000,3,FALSE),\"\")","v":""},{"$f":"IF(Score!B986>0,VLOOKUP(C987,Entrants!$A$2:$E$5000,2,FALSE),\"\")","v":""},{"$f":"IF(Score!B986>0,VLOOKUP(C987,Entrants!$A$2:$E$5000,4,FALSE),\"\")","v":""},{"$f":"IF(Score!C986>0,Score!C986,\"\")","v":""}]
[{"$f":"IF(Score!B987>0,Score!A987,\"\")","v":""},{"$f":"IF(Score!B987>0,IF(COUNTIF($E$3:E988,E988)>7,\"\",MAX($B$3:B987)+1),\"\")","v":""},{"$f":"IF(Score!B987>0,Score!B987,\"\")","v":""},{"$f":"IF(Score!B987>0,VLOOKUP(C988,Entrants!$A$2:$E$5000,3,FALSE),\"\")","v":""},{"$f":"IF(Score!B987>0,VLOOKUP(C988,Entrants!$A$2:$E$5000,2,FALSE),\"\")","v":""},{"$f":"IF(Score!B987>0,VLOOKUP(C988,Entrants!$A$2:$E$5000,4,FALSE),\"\")","v":""},{"$f":"IF(Score!C987>0,Score!C987,\"\")","v":""}]
[{"$f":"IF(Score!B988>0,Score!A988,\"\")","v":""},{"$f":"IF(Score!B988>0,IF(COUNTIF($E$3:E989,E989)>7,\"\",MAX($B$3:B988)+1),\"\")","v":""},{"$f":"IF(Score!B988>0,Score!B988,\"\")","v":""},{"$f":"IF(Score!B988>0,VLOOKUP(C989,Entrants!$A$2:$E$5000,3,FALSE),\"\")","v":""},{"$f":"IF(Score!B988>0,VLOOKUP(C989,Entrants!$A$2:$E$5000,2,FALSE),\"\")","v":""},{"$f":"IF(Score!B988>0,VLOOKUP(C989,Entrants!$A$2:$E$5000,4,FALSE),\"\")","v":""},{"$f":"IF(Score!C988>0,Score!C988,\"\")","v":""}]
[{"$f":"IF(Score!B989>0,Score!A989,\"\")","v":""},{"$f":"IF(Score!B989>0,IF(COUNTIF($E$3:E990,E990)>7,\"\",MAX($B$3:B989)+1),\"\")","v":""},{"$f":"IF(Score!B989>0,Score!B989,\"\")","v":""},{"$f":"IF(Score!B989>0,VLOOKUP(C990,Entrants!$A$2:$E$5000,3,FALSE),\"\")","v":""},{"$f":"IF(Score!B989>0,VLOOKUP(C990,Entrants!$A$2:$E$5000,2,FALSE),\"\")","v":""},{"$f":"IF(Score!B989>0,VLOOKUP(C990,Entrants!$A$2:$E$5000,4,FALSE),\"\")","v":""},{"$f":"IF(Score!C989>0,Score!C989,\"\")","v":""}]
[{"$f":"IF(Score!B990>0,Score!A990,\"\")","v":""},{"$f":"IF(Score!B990>0,IF(COUNTIF($E$3:E991,E991)>7,\"\",MAX($B$3:B990)+1),\"\")","v":""},{"$f":"IF(Score!B990>0,Score!B990,\"\")","v":""},{"$f":"IF(Score!B990>0,VLOOKUP(C991,Entrants!$A$2:$E$5000,3,FALSE),\"\")","v":""},{"$f":"IF(Score!B990>0,VLOOKUP(C991,Entrants!$A$2:$E$5000,2,FALSE),\"\")","v":""},{"$f":"IF(Score!B990>0,VLOOKUP(C991,Entrants!$A$2:$E$5000,4,FALSE),\"\")","v":""},{"$f":"IF(Score!C990>0,Score!C990,\"\")","v":""}]
[{"$f":"IF(Score!B991>0,Score!A991,\"\")","v":""},{"$f":"IF(Score!B991>0,IF(COUNTIF($E$3:E992,E992)>7,\"\",MAX($B$3:B991)+1),\"\")","v":""},{"$f":"IF(Score!B991>0,Score!B991,\"\")","v":""},{"$f":"IF(Score!B991>0,VLOOKUP(C992,Entrants!$A$2:$E$5000,3,FALSE),\"\")","v":""},{"$f":"IF(Score!B991>0,VLOOKUP(C992,Entrants!$A$2:$E$5000,2,FALSE),\"\")","v":""},{"$f":"IF(Score!B991>0,VLOOKUP(C992,Entrants!$A$2:$E$5000,4,FALSE),\"\")","v":""},{"$f":"IF(Score!C991>0,Score!C991,\"\")","v":""}]
[{"$f":"IF(Score!B992>0,Score!A992,\"\")","v":""},{"$f":"IF(Score!B992>0,IF(COUNTIF($E$3:E993,E993)>7,\"\",MAX($B$3:B992)+1),\"\")","v":""},{"$f":"IF(Score!B992>0,Score!B992,\"\")","v":""},{"$f":"IF(Score!B992>0,VLOOKUP(C993,Entrants!$A$2:$E$5000,3,FALSE),\"\")","v":""},{"$f":"IF(Score!B992>0,VLOOKUP(C993,Entrants!$A$2:$E$5000,2,FALSE),\"\")","v":""},{"$f":"IF(Score!B992>0,VLOOKUP(C993,Entrants!$A$2:$E$5000,4,FALSE),\"\")","v":""},{"$f":"IF(Score!C992>0,Score!C992,\"\")","v":""}]
[{"$f":"IF(Score!B993>0,Score!A993,\"\")","v":""},{"$f":"IF(Score!B993>0,IF(COUNTIF($E$3:E994,E994)>7,\"\",MAX($B$3:B993)+1),\"\")","v":""},{"$f":"IF(Score!B993>0,Score!B993,\"\")","v":""},{"$f":"IF(Score!B993>0,VLOOKUP(C994,Entrants!$A$2:$E$5000,3,FALSE),\"\")","v":""},{"$f":"IF(Score!B993>0,VLOOKUP(C994,Entrants!$A$2:$E$5000,2,FALSE),\"\")","v":""},{"$f":"IF(Score!B993>0,VLOOKUP(C994,Entrants!$A$2:$E$5000,4,FALSE),\"\")","v":""},{"$f":"IF(Score!C993>0,Score!C993,\"\")","v":""}]
[{"$f":"IF(Score!B994>0,Score!A994,\"\")","v":""},{"$f":"IF(Score!B994>0,IF(COUNTIF($E$3:E995,E995)>7,\"\",MAX($B$3:B994)+1),\"\")","v":""},{"$f":"IF(Score!B994>0,Score!B994,\"\")","v":""},{"$f":"IF(Score!B994>0,VLOOKUP(C995,Entrants!$A$2:$E$5000,3,FALSE),\"\")","v":""},{"$f":"IF(Score!B994>0,VLOOKUP(C995,Entrants!$A$2:$E$5000,2,FALSE),\"\")","v":""},{"$f":"IF(Score!B994>0,VLOOKUP(C995,Entrants!$A$2:$E$5000,4,FALSE),\"\")","v":""},{"$f":"IF(Score!C994>0,Score!C994,\"\")","v":""}]
[{"$f":"IF(Score!B995>0,Score!A995,\"\")","v":""},{"$f":"IF(Score!B995>0,IF(COUNTIF($E$3:E996,E996)>7,\"\",MAX($B$3:B995)+1),\"\")","v":""},{"$f":"IF(Score!B995>0,Score!B995,\"\")","v":""},{"$f":"IF(Score!B995>0,VLOOKUP(C996,Entrants!$A$2:$E$5000,3,FALSE),\"\")","v":""},{"$f":"IF(Score!B995>0,VLOOKUP(C996,Entrants!$A$2:$E$5000,2,FALSE),\"\")","v":""},{"$f":"IF(Score!B995>0,VLOOKUP(C996,Entrants!$A$2:$E$5000,4,FALSE),\"\")","v":""},{"$f":"IF(Score!C995>0,Score!C995,\"\")","v":""}]
[{"$f":"IF(Score!B996>0,Score!A996,\"\")","v":""},{"$f":"IF(Score!B996>0,IF(COUNTIF($E$3:E997,E997)>7,\"\",MAX($B$3:B996)+1),\"\")","v":""},{"$f":"IF(Score!B996>0,Score!B996,\"\")","v":""},{"$f":"IF(Score!B996>0,VLOOKUP(C997,Entrants!$A$2:$E$5000,3,FALSE),\"\")","v":""},{"$f":"IF(Score!B996>0,VLOOKUP(C997,Entrants!$A$2:$E$5000,2,FALSE),\"\")","v":""},{"$f":"IF(Score!B996>0,VLOOKUP(C997,Entrants!$A$2:$E$5000,4,FALSE),\"\")","v":""},{"$f":"IF(Score!C996>0,Score!C996,\"\")","v":""}]
[{"$f":"IF(Score!B997>0,Score!A997,\"\")","v":""},{"$f":"IF(Score!B997>0,IF(COUNTIF($E$3:E998,E998)>7,\"\",MAX($B$3:B997)+1),\"\")","v":""},{"$f":"IF(Score!B997>0,Score!B997,\"\")","v":""},{"$f":"IF(Score!B997>0,VLOOKUP(C998,Entrants!$A$2:$E$5000,3,FALSE),\"\")","v":""},{"$f":"IF(Score!B997>0,VLOOKUP(C998,Entrants!$A$2:$E$5000,2,FALSE),\"\")","v":""},{"$f":"IF(Score!B997>0,VLOOKUP(C998,Entrants!$A$2:$E$5000,4,FALSE),\"\")","v":""},{"$f":"IF(Score!C997>0,Score!C997,\"\")","v":""}]
[{"$f":"IF(Score!B998>0,Score!A998,\"\")","v":""},{"$f":"IF(Score!B998>0,IF(COUNTIF($E$3:E999,E999)>7,\"\",MAX($B$3:B998)+1),\"\")","v":""},{"$f":"IF(Score!B998>0,Score!B998,\"\")","v":""},{"$f":"IF(Score!B998>0,VLOOKUP(C999,Entrants!$A$2:$E$5000,3,FALSE),\"\")","v":""},{"$f":"IF(Score!B998>0,VLOOKUP(C999,Entrants!$A$2:$E$5000,2,FALSE),\"\")","v":""},{"$f":"IF(Score!B998>0,VLOOKUP(C999,Entrants!$A$2:$E$5000,4,FALSE),\"\")","v":""},{"$f":"IF(Score!C998>0,Score!C998,\"\")","v":""}]
[{"$f":"IF(Score!B999>0,Score!A999,\"\")","v":""},{"$f":"IF(Score!B999>0,IF(COUNTIF($E$3:E1000,E1000)>7,\"\",MAX($B$3:B999)+1),\"\")","v":""},{"$f":"IF(Score!B999>0,Score!B999,\"\")","v":""},{"$f":"IF(Score!B999>0,VLOOKUP(C1000,Entrants!$A$2:$E$5000,3,FALSE),\"\")","v":""},{"$f":"IF(Score!B999>0,VLOOKUP(C1000,Entrants!$A$2:$E$5000,2,FALSE),\"\")","v":""},{"$f":"IF(Score!B999>0,VLOOKUP(C1000,Entrants!$A$2:$E$5000,4,FALSE),\"\")","v":""},{"$f":"IF(Score!C999>0,Score!C999,\"\")","v":""}]

{"sheet":"TeamResults","index":3,"n_rows":4,"n_cols":2,"rows_kept":4,"cut":false,"hidden":false,"merged":[[1,2,1,5],[0,0,0,6]]}
["boys 2 mile"]
[null,"Team"]
[null,"M"]
[null,"S"]