{"text_format":"1","workbook":"xlsx","n_sheets":4,"sheets":["Entrants","Score","Places","TeamResults"],"not_rendered":{"charts":0,"images":0,"macros":1,"external_links":0,"defined_names":12,"comments":0,"pivot_tables":0},"unopened":[],"bounds":{"document_bytes":16777216,"sheet_cells":100000,"rows_first":2000,"rows_last":500,"rows_between":2000,"halvings":0,"cell_chars":16384,"cell_head_chars":4096},"cells_cut":0,"cells_raw":0,"read":"whole","date_system":"1900"}

{"sheet":"Entrants","index":0,"n_rows":1000,"n_cols":4,"rows_kept":1000,"cut":false,"hidden":false,"merged":[]}
["Bib","Team","Name","Grade"]
[1,"M","Lowden"]
[2,"M","Riley"]
[3,"M","North"]
[4,"M","Munson"]
[5,"M","Muhich"]
[6,"M","Motsch"]
[7,"M","Bell"]
[8,"M","Hall"]
[9,"M","Myers"]
[10,"M","Balzer"]
[11,"M","Anderson"]
[12,"M","Hajduk"]
[13,"S","Cryer"]
[14,"M","Paugys"]
[15,"M","Boles"]
[16,"S","Miller"]
[17,"S","Chaplin"]
[18,"M","Su"]
[19,"M","Warren"]
[20,"M","Torri"]
[21,"M","Undesser"]
[22,"S","Okapal"]
[23,"M","Fawley"]
[24,"S","Graszer"]
[25,"M","Conroy, J"]
[26,"M","Johannessen"]
[27,"M","Rhoades"]
[28,"M","Conroy, S"]
[29,"M","Watson"]
[30,"M","Smith"]
[31,"M","Shrum"]
[{"$f":"IF(B33<>\"\",A32+1,\"\")","v":""}]
[""]
[""]
[""]
[""]
[""]
[""]
[""]
{"$rows_left_out":961}
{"sheet":"Score","index":1,"n_rows":1000,"n_cols":4,"rows_kept":1000,"cut":false,"hidden":false,"merged":[]}
["Place","Bib","Time"]
[1,1,"12:49.00",{"$f":"IF(C2<>\"\",INT(MID(C2,1,2))*60+INT(MID(C2,4,2))+INT(MID(C2,7,2))/100,\"\")","v":769}]
[2,2,"12:51.00",{"$f":"IF(C3<>\"\",INT(MID(C3,1,2))*60+INT(MID(C3,4,2))+INT(MID(C3,7,2))/100,\"\")","v":771}]
[3,3,"13:42.00",{"$f":"IF(C4<>\"\",INT(MID(C4,1,2))*60+INT(MID(C4,4,2))+INT(MID(C4,7,2))/100,\"\")","v":822}]
[4,4,"13:48.00",828]
[5,5,"13:56.00",836]
[6,6,"13:57.00",837]
[7,7,"14:02.00",842]
[8,8,"14:11.00",851]
[9,9,"14:21.00",861]
[10,10,"14:22.00",862]
[11,11,"14:31.00",871]
[12,12,"14:45.00",885]
[13,13,"14:49.00",889]
[14,14,"14:50.00",890]
[15,15,"15:18.00",918]
[16,16,"15:26.00",926]
[17,17,"15:32.00",932]
[18,18,"15:53.00",953]
[19,19,"16:03.00",963]
[20,20,"16:31.00",991]
[21,21,"16:33.00",993]
[22,22,"17:12.00",1032]
[23,23,"17:44.00",1064]
[24,24,"17:53.00",1073]
[25,25,"17:54.00",1074]
[26,26,"18:16.00",1096]
[27,27,"18:30.00",1110]
[28,28,"18:32.00",1112]
[29,29,"19:33.00",1173]
[30,30,"20:00.00",1200]
[31,31,"20:57.00",1257]
[{"$f":"IF(B33>0,A32+1,\"\")","v":""},null,null,""]
["",null,null,""]
["",null,null,""]
["",null,null,""]
["",null,null,""]
["",null,null,""]
["",null,null,""]
["",null,null,""]
{"$rows_left_out":961}
{"sheet":"Places","index":2,"n_rows":1000,"n_cols":7,"rows_kept":1000,"cut":false,"hidden":false,"merged":[[0,0,0,6]]}
["boys 2 mile"]
["Position","Score","Bib","Name","Team","Grade","Time"]
[{"$f":"IF(Score!B2>0,Score!A2,\"\")","v":1},{"$f":"IF(Score!B2>0,IF(COUNTIF($E$3:$E$5000,E3)<5,\"\",1),\"\")","v":1},{"$f":"IF(Score!B2>0,Score!B2,\"\")","v":1},{"$f":"IF(Score!B2>0,VLOOKUP(C3,Entrants!$A$1:$E$5000,3,FALSE),\"\")","v":"Lowden"},{"$f":"IF(Score!B2>0,VLOOKUP(C3,Entrants!$A$2:$E$5000,2,FALSE),\"\")","v":"M"},{"$f":"IF(Score!B2>0,VLOOKUP(C3,Entrants!$A$2:$E$5000,4,FALSE),\"\")","v":0},{"$f":"IF(Score!C2>0,Score!C2,\"\")","v":"12:49.00"}]
[{"$f":"IF(Score!B3>0,Score!A3,\"\")","v":2},{"$f":"IF(Score!B3>0,IF(COUNTIF($E$3:$E$5000,E4)<5,\"\",IF(COUNTIF($E$3:E4,E4)>7,\"\",MAX($B$3:B3)+1)),\"\")","v":2},{"$f":"IF(Score!B3>0,Score!B3,\"\")","v":2},{"$f":"IF(Score!B3>0,VLOOKUP(C4,Entrants!$A$2:$E$5000,3,FALSE),\"\")","v":"Riley"},{"$f":"IF(Score!B3>0,VLOOKUP(C4,Entrants!$A$2:$E$5000,2,FALSE),\"\")","v":"M"},{"$f":"IF(Score!B3>0,VLOOKUP(C4,Entrants!$A$2:$E$5000,4,FALSE),\"\")","v":0},{"$f":"IF(Score!C3>0,Score!C3,\"\")","v":"12:51.00"}]
[{"$f":"IF(Score!B4>0,Score!A4,\"\")","v":3},{"$f":"IF(Score!B4>0,IF(COUNTIF($E$3:$E$5000,E5)<5,\"\",IF(COUNTIF($E$3:E5,E5)>7,\"\",MAX($B$3:B4)+1)),\"\")","v":3},{"$f":"IF(Score!B4>0,Score!B4,\"\")","v":3},{"$f":"IF(Score!B4>0,VLOOKUP(C5,Entrants!$A$2:$E$5000,3,FALSE),\"\")","v":"North"},{"$f":"IF(Score!B4>0,VLOOKUP(C5,Entrants!$A$2:$E$5000,2,FALSE),\"\")","v":"M"},{"$f":"IF(Score!B4>0,VLOOKUP(C5,Entrants!$A$2:$E$5000,4,FALSE),\"\")","v":0},{"$f":"IF(Score!C4>0,Score!C4,\"\")","v":"13:42.00"}]
[{"$f":"IF(Score!B5>0,Score!A5,\"\")","v":4},{"$f":"IF(Score!B5>0,IF(COUNTIF($E$3:$E$5000,E6)<5,\"\",IF(COUNTIF($E$3:E6,E6)>7,\"\",MAX($B$3:B5)+1)),\"\")","v":4},{"$f":"IF(Score!B5>0,Score!B5,\"\")","v":4},{"$f":"IF(Score!B5>0,VLOOKUP(C6,Entrants!$A$2:$E$5000,3,FALSE),\"\")","v":"Munson"},{"$f":"IF(Score!B5>0,VLOOKUP(C6,Entrants!$A$2:$E$5000,2,FALSE),\"\")","v":"M"},{"$f":"IF(Score!B5>0,VLOOKUP(C6,Entrants!$A$2:$E$5000,4,FALSE),\"\")","v":0},{"$f":"IF(Score!C5>0,Score!C5,\"\")","v":"13:48.00"}]
[{"$f":"IF(Score!B6>0,Score!A6,\"\")","v":5},{"$f":"IF(Score!B6>0,IF(COUNTIF($E$3:$E$5000,E7)<5,\"\",IF(COUNTIF($E$3:E7,E7)>7,\"\",MAX($B$3:B6)+1)),\"\")","v":5},{"$f":"IF(Score!B6>0,Score!B6,\"\")","v":5},{"$f":"IF(Score!B6>0,VLOOKUP(C7,Entrants!$A$2:$E$5000,3,FALSE),\"\")","v":"Muhich"},{"$f":"IF(Score!B6>0,VLOOKUP(C7,Entrants!$A$2:$E$5000,2,FALSE),\"\")","v":"M"},{"$f":"IF(Score!B6>0,VLOOKUP(C7,Entrants!$A$2:$E$5000,4,FALSE),\"\")","v":0},{"$f":"IF(Score!C6>0,Score!C6,\"\")","v":"13:56.00"}]
[{"$f":"IF(Score!B7>0,Score!A7,\"\")","v":6},{"$f":"IF(Score!B7>0,IF(COUNTIF($E$3:$E$5000,E8)<5,\"\",IF(COUNTIF($E$3:E8,E8)>7,\"\",MAX($B$3:B7)+1)),\"\")","v":6},{"$f":"IF(Score!B7>0,Score!B7,\"\")","v":6},{"$f":"IF(Score!B7>0,VLOOKUP(C8,Entrants!$A$2:$E$5000,3,FALSE),\"\")","v":"Motsch"},{"$f":"IF(Score!B7>0,VLOOKUP(C8,Entrants!$A$2:$E$5000,2,FALSE),\"\")","v":"M"},{"$f":"IF(Score!B7>0,VLOOKUP(C8,Entrants!$A$2:$E$5000,4,FALSE),\"\")","v":0},{"$f":"IF(Score!C7>0,Score!C7,\"\")","v":"13:57.00"}]
[{"$f":"IF(Score!B8>0,Score!A8,\"\")","v":7},{"$f":"IF(Score!B8>0,IF(COUNTIF($E$3:$E$5000,E9)<5,\"\",IF(COUNTIF($E$3:E9,E9)>7,\"\",MAX($B$3:B8)+1)),\"\")","v":7},{"$f":"IF(Score!B8>0,Score!B8,\"\")","v":7},{"$f":"IF(Score!B8>0,VLOOKUP(C9,Entrants!$A$2:$E$5000,3,FALSE),\"\")","v":"Bell"},{"$f":"IF(Score!B8>0,VLOOKUP(C9,Entrants!$A$2:$E$5000,2,FALSE),\"\")","v":"M"},{"$f":"IF(Score!B8>0,VLOOKUP(C9,Entrants!$A$2:$E$5000,4,FALSE),\"\")","v":0},{"$f":"IF(Score!C8>0,Score!C8,\"\")","v":"14:02.00"}]
[{"$f":"IF(Score!B9>0,Score!A9,\"\")","v":8},{"$f":"IF(Score!B9>0,IF(COUNTIF($E$3:$E$5000,E10)<5,\"\",IF(COUNTIF($E$3:E10,E10)>7,\"\",MAX($B$3:B9)+1)),\"\")","v":""},{"$f":"IF(Score!B9>0,Score!B9,\"\")","v":8},{"$f":"IF(Score!B9>0,VLOOKUP(C10,Entrants!$A$2:$E$5000,3,FALSE),\"\")","v":"Hall"},{"$f":"IF(Score!B9>0,VLOOKUP(C10,Entrants!$A$2:$E$5000,2,FALSE),\"\")","v":"M"},{"$f":"IF(Score!B9>0,VLOOKUP(C10,Entrants!$A$2:$E$5000,4,FALSE),\"\")","v":0},{"$f":"IF(Score!C9>0,Score!C9,\"\")","v":"14:11.00"}]
[{"$f":"IF(Score!B10>0,Score!A10,\"\")","v":9},{"$f":"IF(Score!B10>0,IF(COUNTIF($E$3:$E$5000,E11)<5,\"\",IF(COUNTIF($E$3:E11,E11)>7,\"\",MAX($B$3:B10)+1)),\"\")","v":""},{"$f":"IF(Score!B10>0,Score!B10,\"\")","v":9},{"$f":"IF(Score!B10>0,VLOOKUP(C11,Entrants!$A$2:$E$5000,3,FALSE),\"\")","v":"Myers"},{"$f":"IF(Score!B10>0,VLOOKUP(C11,Entrants!$A$2:$E$5000,2,FALSE),\"\")","v":"M"},{"$f":"IF(Score!B10>0,VLOOKUP(C11,Entrants!$A$2:$E$5000,4,FALSE),\"\")","v":0},{"$f":"IF(Score!C10>0,Score!C10,\"\")","v":"14:21.00"}]
[{"$f":"IF(Score!B11>0,Score!A11,\"\")","v":10},{"$f":"IF(Score!B11>0,IF(COUNTIF($E$3:$E$5000,E12)<5,\"\",IF(COUNTIF($E$3:E12,E12)>7,\"\",MAX($B$3:B11)+1)),\"\")","v":""},{"$f":"IF(Score!B11>0,Score!B11,\"\")","v":10},{"$f":"IF(Score!B11>0,VLOOKUP(C12,Entrants!$A$2:$E$5000,3,FALSE),\"\")","v":"Balzer"},{"$f":"IF(Score!B11>0,VLOOKUP(C12,Entrants!$A$2:$E$5000,2,FALSE),\"\")","v":"M"},{"$f":"IF(Score!B11>0,VLOOKUP(C12,Entrants!$A$2:$E$5000,4,FALSE),\"\")","v":0},{"$f":"IF(Score!C11>0,Score!C11,\"\")","v":"14:22.00"}]
[{"$f":"IF(Score!B12>0,Score!A12,\"\")","v":11},{"$f":"IF(Score!B12>0,IF(COUNTIF($E$3:$E$5000,E13)<5,\"\",IF(COUNTIF($E$3:E13,E13)>7,\"\",MAX($B$3:B12)+1)),\"\")","v":""},{"$f":"IF(Score!B12>0,Score!B12,\"\")","v":11},{"$f":"IF(Score!B12>0,VLOOKUP(C13,Entrants!$A$2:$E$5000,3,FALSE),\"\")","v":"Anderson"},{"$f":"IF(Score!B12>0,VLOOKUP(C13,Entrants!$A$2:$E$5000,2,FALSE),\"\")","v":"M"},{"$f":"IF(Score!B12>0,VLOOKUP(C13,Entrants!$A$2:$E$5000,4,FALSE),\"\")","v":0},{"$f":"IF(Score!C12>0,Score!C12,\"\")","v":"14:31.00"}]
[{"$f":"IF(Score!B13>0,Score!A13,\"\")","v":12},{"$f":"IF(Score!B13>0,IF(COUNTIF($E$3:$E$5000,E14)<5,\"\",IF(COUNTIF($E$3:E14,E14)>7,\"\",MAX($B$3:B13)+1)),\"\")","v":""},{"$f":"IF(Score!B13>0,Score!B13,\"\")","v":12},{"$f":"IF(Score!B13>0,VLOOKUP(C14,Entrants!$A$2:$E$5000,3,FALSE),\"\")","v":"Hajduk"},{"$f":"IF(Score!B13>0,VLOOKUP(C14,Entrants!$A$2:$E$5000,2,FALSE),\"\")","v":"M"},{"$f":"IF(Score!B13>0,VLOOKUP(C14,Entrants!$A$2:$E$5000,4,FALSE),\"\")","v":0},{"$f":"IF(Score!C13>0,Score!C13,\"\")","v":"14:45.00"}]
[{"$f":"IF(Score!B14>0,Score!A14,\"\")","v":13},{"$f":"IF(Score!B14>0,IF(COUNTIF($E$3:$E$5000,E15)<5,\"\",IF(COUNTIF($E$3:E15,E15)>7,\"\",MAX($B$3:B14)+1)),\"\")","v":8},{"$f":"IF(Score!B14>0,Score!B14,\"\")","v":13},{"$f":"IF(Score!B14>0,VLOOKUP(C15,Entrants!$A$2:$E$5000,3,FALSE),\"\")","v":"Cryer"},{"$f":"IF(Score!B14>0,VLOOKUP(C15,Entrants!$A$2:$E$5000,2,FALSE),\"\")","v":"S"},{"$f":"IF(Score!B14>0,VLOOKUP(C15,Entrants!$A$2:$E$5000,4,FALSE),\"\")","v":0},{"$f":"IF(Score!C14>0,Score!C14,\"\")","v":"14:49.00"}]
[{"$f":"IF(Score!B15>0,Score!A15,\"\")","v":14},{"$f":"IF(Score!B15>0,IF(COUNTIF($E$3:$E$5000,E16)<5,\"\",IF(COUNTIF($E$3:E16,E16)>7,\"\",MAX($B$3:B15)+1)),\"\")","v":""},{"$f":"IF(Score!B15>0,Score!B15,\"\")","v":14},{"$f":"IF(Score!B15>0,VLOOKUP(C16,Entrants!$A$2:$E$5000,3,FALSE),\"\")","v":"Paugys"},{"$f":"IF(Score!B15>0,VLOOKUP(C16,Entrants!$A$2:$E$5000,2,FALSE),\"\")","v":"M"},{"$f":"IF(Score!B15>0,VLOOKUP(C16,Entrants!$A$2:$E$5000,4,FALSE),\"\")","v":0},{"$f":"IF(Score!C15>0,Score!C15,\"\")","v":"14:50.00"}]
[{"$f":"IF(Score!B16>0,Score!A16,\"\")","v":15},{"$f":"IF(Score!B16>0,IF(COUNTIF($E$3:$E$5000,E17)<5,\"\",IF(COUNTIF($E$3:E17,E17)>7,\"\",MAX($B$3:B16)+1)),\"\")","v":""},{"$f":"IF(Score!B16>0,Score!B16,\"\")","v":15},{"$f":"IF(Score!B16>0,VLOOKUP(C17,Entrants!$A$2:$E$5000,3,FALSE),\"\")","v":"Boles"},{"$f":"IF(Score!B16>0,VLOOKUP(C17,Entrants!$A$2:$E$5000,2,FALSE),\"\")","v":"M"},{"$f":"IF(Score!B16>0,VLOOKUP(C17,Entrants!$A$2:$E$5000,4,FALSE),\"\")","v":0},{"$f":"IF(Score!C16>0,Score!C16,\"\")","v":"15:18.00"}]
[{"$f":"IF(Score!B17>0,Score!A17,\"\")","v":16},{"$f":"IF(Score!B17>0,IF(COUNTIF($E$3:$E$5000,E18)<5,\"\",IF(COUNTIF($E$3:E18,E18)>7,\"\",MAX($B$3:B17)+1)),\"\")","v":9},{"$f":"IF(Score!B17>0,Score!B17,\"\")","v":16},{"$f":"IF(Score!B17>0,VLOOKUP(C18,Entrants!$A$2:$E$5000,3,FALSE),\"\")","v":"Miller"},{"$f":"IF(Score!B17>0,VLOOKUP(C18,Entrants!$A$2:$E$5000,2,FALSE),\"\")","v":"S"},{"$f":"IF(Score!B17>0,VLOOKUP(C18,Entrants!$A$2:$E$5000,4,FALSE),\"\")","v":0},{"$f":"IF(Score!C17>0,Score!C17,\"\")","v":"15:26.00"}]
[{"$f":"IF(Score!B18>0,Score!A18,\"\")","v":17},{"$f":"IF(Score!B18>0,IF(COUNTIF($E$3:$E$5000,E19)<5,\"\",IF(COUNTIF($E$3:E19,E19)>7,\"\",MAX($B$3:B18)+1)),\"\")","v":10},{"$f":"IF(Score!B18>0,Score!B18,\"\")","v":17},{"$f":"IF(Score!B18>0,VLOOKUP(C19,Entrants!$A$2:$E$5000,3,FALSE),\"\")","v":"Chaplin"},{"$f":"IF(Score!B18>0,VLOOKUP(C19,Entrants!$A$2:$E$5000,2,FALSE),\"\")","v":"S"},{"$f":"IF(Score!B18>0,VLOOKUP(C19,Entrants!$A$2:$E$5000,4,FALSE),\"\")","v":0},{"$f":"IF(Score!C18>0,Score!C18,\"\")","v":"15:32.00"}]
[{"$f":"IF(Score!B19>0,Score!A19,\"\")","v":18},{"$f":"IF(Score!B19>0,IF(COUNTIF($E$3:$E$5000,E20)<5,\"\",IF(COUNTIF($E$3:E20,E20)>7,\"\",MAX($B$3:B19)+1)),\"\")","v":""},{"$f":"IF(Score!B19>0,Score!B19,\"\")","v":18},{"$f":"IF(Score!B19>0,VLOOKUP(C20,Entrants!$A$2:$E$5000,3,FALSE),\"\")","v":"Su"},{"$f":"IF(Score!B19>0,VLOOKUP(C20,Entrants!$A$2:$E$5000,2,FALSE),\"\")","v":"M"},{"$f":"IF(Score!B19>0,VLOOKUP(C20,Entrants!$A$2:$E$5000,4,FALSE),\"\")","v":0},{"$f":"IF(Score!C19>0,Score!C19,\"\")","v":"15:53.00"}]
[{"$f":"IF(Score!B20>0,Score!A20,\"\")","v":19},{"$f":"IF(Score!B20>0,IF(COUNTIF($E$3:$E$5000,E21)<5,\"\",IF(COUNTIF($E$3:E21,E21)>7,\"\",MAX($B$3:B20)+1)),\"\")","v":""},{"$f":"IF(Score!B20>0,Score!B20,\"\")","v":19},{"$f":"IF(Score!B20>0,VLOOKUP(C21,Entrants!$A$2:$E$5000,3,FALSE),\"\")","v":"Warren"},{"$f":"IF(Score!B20>0,VLOOKUP(C21,Entrants!$A$2:$E$5000,2,FALSE),\"\")","v":"M"},{"$f":"IF(Score!B20>0,VLOOKUP(C21,Entrants!$A$2:$E$5000,4,FALSE),\"\")","v":0},{"$f":"IF(Score!C20>0,Score!C20,\"\")","v":"16:03.00"}]
[{"$f":"IF(Score!B21>0,Score!A21,\"\")","v":20},{"$f":"IF(Score!B21>0,IF(COUNTIF($E$3:$E$5000,E22)<5,\"\",IF(COUNTIF($E$3:E22,E22)>7,\"\",MAX($B$3:B21)+1)),\"\")","v":""},{"$f":"IF(Score!B21>0,Score!B21,\"\")","v":20},{"$f":"IF(Score!B21>0,VLOOKUP(C22,Entrants!$A$2:$E$5000,3,FALSE),\"\")","v":"Torri"},{"$f":"IF(Score!B21>0,VLOOKUP(C22,Entrants!$A$2:$E$5000,2,FALSE),\"\")","v":"M"},{"$f":"IF(Score!B21>0,VLOOKUP(C22,Entrants!$A$2:$E$5000,4,FALSE),\"\")","v":0},{"$f":"IF(Score!C21>0,Score!C21,\"\")","v":"16:31.00"}]
[{"$f":"IF(Score!B22>0,Score!A22,\"\")","v":21},{"$f":"IF(Score!B22>0,IF(COUNTIF($E$3:$E$5000,E23)<5,\"\",IF(COUNTIF($E$3:E23,E23)>7,\"\",MAX($B$3:B22)+1)),\"\")","v":""},{"$f":"IF(Score!B22>0,Score!B22,\"\")","v":21},{"$f":"IF(Score!B22>0,VLOOKUP(C23,Entrants!$A$2:$E$5000,3,FALSE),\"\")","v":"Undesser"},{"$f":"IF(Score!B22>0,VLOOKUP(C23,Entrants!$A$2:$E$5000,2,FALSE),\"\")","v":"M"},{"$f":"IF(Score!B22>0,VLOOKUP(C23,Entrants!$A$2:$E$5000,4,FALSE),\"\")","v":0},{"$f":"IF(Score!C22>0,Score!C22,\"\")","v":"16:33.00"}]
[{"$f":"IF(Score!B23>0,Score!A23,\"\")","v":22},{"$f":"IF(Score!B23>0,IF(COUNTIF($E$3:$E$5000,E24)<5,\"\",IF(COUNTIF($E$3:E24,E24)>7,\"\",MAX($B$3:B23)+1)),\"\")","v":11},{"$f":"IF(Score!B23>0,Score!B23,\"\")","v":22},{"$f":"IF(Score!B23>0,VLOOKUP(C24,Entrants!$A$2:$E$5000,3,FALSE),\"\")","v":"Okapal"},{"$f":"IF(Score!B23>0,VLOOKUP(C24,Entrants!$A$2:$E$5000,2,FALSE),\"\")","v":"S"},{"$f":"IF(Score!B23>0,VLOOKUP(C24,Entrants!$A$2:$E$5000,4,FALSE),\"\")","v":0},{"$f":"IF(Score!C23>0,Score!C23,\"\")","v":"17:12.00"}]
[{"$f":"IF(Score!B24>0,Score!A24,\"\")","v":23},{"$f":"IF(Score!B24>0,IF(COUNTIF($E$3:$E$5000,E25)<5,\"\",IF(COUNTIF($E$3:E25,E25)>7,\"\",MAX($B$3:B24)+1)),\"\")","v":""},{"$f":"IF(Score!B24>0,Score!B24,\"\")","v":23},{"$f":"IF(Score!B24>0,VLOOKUP(C25,Entrants!$A$2:$E$5000,3,FALSE),\"\")","v":"Fawley"},{"$f":"IF(Score!B24>0,VLOOKUP(C25,Entrants!$A$2:$E$5000,2,FALSE),\"\")","v":"M"},{"$f":"IF(Score!B24>0,VLOOKUP(C25,Entrants!$A$2:$E$5000,4,FALSE),\"\")","v":0},{"$f":"IF(Score!C24>0,Score!C24,\"\")","v":"17:44.00"}]
[{"$f":"IF(Score!B25>0,Score!A25,\"\")","v":24},{"$f":"IF(Score!B25>0,IF(COUNTIF($E$3:$E$5000,E26)<5,\"\",IF(COUNTIF($E$3:E26,E26)>7,\"\",MAX($B$3:B25)+1)),\"\")","v":12},{"$f":"IF(Score!B25>0,Score!B25,\"\")","v":24},{"$f":"IF(Score!B25>0,VLOOKUP(C26,Entrants!$A$2:$E$5000,3,FALSE),\"\")","v":"Graszer"},{"$f":"IF(Score!B25>0,VLOOKUP(C26,Entrants!$A$2:$E$5000,2,FALSE),\"\")","v":"S"},{"$f":"IF(Score!B25>0,VLOOKUP(C26,Entrants!$A$2:$E$5000,4,FALSE),\"\")","v":0},{"$f":"IF(Score!C25>0,Score!C25,\"\")","v":"17:53.00"}]
[{"$f":"IF(Score!B26>0,Score!A26,\"\")","v":25},{"$f":"IF(Score!B26>0,IF(COUNTIF($E$3:$E$5000,E27)<5,\"\",IF(COUNTIF($E$3:E27,E27)>7,\"\",MAX($B$3:B26)+1)),\"\")","v":""},{"$f":"IF(Score!B26>0,Score!B26,\"\")","v":25},{"$f":"IF(Score!B26>0,VLOOKUP(C27,Entrants!$A$2:$E$5000,3,FALSE),\"\")","v":"Conroy, J"},{"$f":"IF(Score!B26>0,VLOOKUP(C27,Entrants!$A$2:$E$5000,2,FALSE),\"\")","v":"M"},{"$f":"IF(Score!B26>0,VLOOKUP(C27,Entrants!$A$2:$E$5000,4,FALSE),\"\")","v":0},{"$f":"IF(Score!C26>0,Score!C26,\"\")","v":"17:54.00"}]
[{"$f":"IF(Score!B27>0,Score!A27,\"\")","v":26},{"$f":"IF(Score!B27>0,IF(COUNTIF($E$3:$E$5000,E28)<5,\"\",IF(COUNTIF($E$3:E28,E28)>7,\"\",MAX($B$3:B27)+1)),\"\")","v":""},{"$f":"IF(Score!B27>0,Score!B27,\"\")","v":26},{"$f":"IF(Score!B27>0,VLOOKUP(C28,Entrants!$A$2:$E$5000,3,FALSE),\"\")","v":"Johannessen"},{"$f":"IF(Score!B27>0,VLOOKUP(C28,Entrants!$A$2:$E$5000,2,FALSE),\"\")","v":"M"},{"$f":"IF(Score!B27>0,VLOOKUP(C28,Entrants!$A$2:$E$5000,4,FALSE),\"\")","v":0},{"$f":"IF(Score!C27>0,Score!C27,\"\")","v":"18:16.00"}]
[{"$f":"IF(Score!B28>0,Score!A28,\"\")","v":27},{"$f":"IF(Score!B28>0,IF(COUNTIF($E$3:$E$5000,E29)<5,\"\",IF(COUNTIF($E$3:E29,E29)>7,\"\",MAX($B$3:B28)+1)),\"\")","v":""},{"$f":"IF(Score!B28>0,Score!B28,\"\")","v":27},{"$f":"IF(Score!B28>0,VLOOKUP(C29,Entrants!$A$2:$E$5000,3,FALSE),\"\")","v":"Rhoades"},{"$f":"IF(Score!B28>0,VLOOKUP(C29,Entrants!$A$2:$E$5000,2,FALSE),\"\")","v":"M"},{"$f":"IF(Score!B28>0,VLOOKUP(C29,Entrants!$A$2:$E$5000,4,FALSE),\"\")","v":0},{"$f":"IF(Score!C28>0,Score!C28,\"\")","v":"18:30.00"}]
[{"$f":"IF(Score!B29>0,Score!A29,\"\")","v":28},{"$f":"IF(Score!B29>0,IF(COUNTIF($E$3:$E$5000,E30)<5,\"\",IF(COUNTIF($E$3:E30,E30)>7,\"\",MAX($B$3:B29)+1)),\"\")","v":""},{"$f":"IF(Score!B29>0,Score!B29,\"\")","v":28},{"$f":"IF(Score!B29>0,VLOOKUP(C30,Entrants!$A$2:$E$5000,3,FALSE),\"\")","v":"Conroy, S"},{"$f":"IF(Score!B29>0,VLOOKUP(C30,Entrants!$A$2:$E$5000,2,FALSE),\"\")","v":"M"},{"$f":"IF(Score!B29>0,VLOOKUP(C30,Entrants!$A$2:$E$5000,4,FALSE),\"\")","v":0},{"$f":"IF(Score!C29>0,Score!C29,\"\")","v":"18:32.00"}]
[{"$f":"IF(Score!B30>0,Score!A30,\"\")","v":29},{"$f":"IF(Score!B30>0,IF(COUNTIF($E$3:$E$5000,E31)<5,\"\",IF(COUNTIF($E$3:E31,E31)>7,\"\",MAX($B$3:B30)+1)),\"\")","v":""},{"$f":"IF(Score!B30>0,Score!B30,\"\")","v":29},{"$f":"IF(Score!B30>0,VLOOKUP(C31,Entrants!$A$2:$E$5000,3,FALSE),\"\")","v":"Watson"},{"$f":"IF(Score!B30>0,VLOOKUP(C31,Entrants!$A$2:$E$5000,2,FALSE),\"\")","v":"M"},{"$f":"IF(Score!B30>0,VLOOKUP(C31,Entrants!$A$2:$E$5000,4,FALSE),\"\")","v":0},{"$f":"IF(Score!C30>0,Score!C30,\"\")","v":"19:33.00"}]
[{"$f":"IF(Score!B31>0,Score!A31,\"\")","v":30},{"$f":"IF(Score!B31>0,IF(COUNTIF($E$3:$E$5000,E32)<5,\"\",IF(COUNTIF($E$3:E32,E32)>7,\"\",MAX($B$3:B31)+1)),\"\")","v":""},{"$f":"IF(Score!B31>0,Score!B31,\"\")","v":30},{"$f":"IF(Score!B31>0,VLOOKUP(C32,Entrants!$A$2:$E$5000,3,FALSE),\"\")","v":"Smith"},{"$f":"IF(Score!B31>0,VLOOKUP(C32,Entrants!$A$2:$E$5000,2,FALSE),\"\")","v":"M"},{"$f":"IF(Score!B31>0,VLOOKUP(C32,Entrants!$A$2:$E$5000,4,FALSE),\"\")","v":0},{"$f":"IF(Score!C31>0,Score!C31,\"\")","v":"20:00.00"}]
[{"$f":"IF(Score!B32>0,Score!A32,\"\")","v":31},{"$f":"IF(Score!B32>0,IF(COUNTIF($E$3:$E$5000,E33)<5,\"\",IF(COUNTIF($E$3:E33,E33)>7,\"\",MAX($B$3:B32)+1)),\"\")","v":""},{"$f":"IF(Score!B32>0,Score!B32,\"\")","v":31},{"$f":"IF(Score!B32>0,VLOOKUP(C33,Entrants!$A$2:$E$5000,3,FALSE),\"\")","v":"Shrum"},{"$f":"IF(Score!B32>0,VLOOKUP(C33,Entrants!$A$2:$E$5000,2,FALSE),\"\")","v":"M"},{"$f":"IF(Score!B32>0,VLOOKUP(C33,Entrants!$A$2:$E$5000,4,FALSE),\"\")","v":0},{"$f":"IF(Score!C32>0,Score!C32,\"\")","v":"20:57.00"}]
[{"$f":"IF(Score!B33>0,Score!A33,\"\")","v":""},{"$f":"IF(Score!B33>0,IF(COUNTIF($E$3:$E$5000,E34)<5,\"\",IF(COUNTIF($E$3:E34,E34)>7,\"\",MAX($B$3:B33)+1)),\"\")","v":""},{"$f":"IF(Score!B33>0,Score!B33,\"\")","v":""},{"$f":"IF(Score!B33>0,VLOOKUP(C34,Entrants!$A$2:$E$5000,3,FALSE),\"\")","v":""},{"$f":"IF(Score!B33>0,VLOOKUP(C34,Entrants!$A$2:$E$5000,2,FALSE),\"\")","v":""},{"$f":"IF(Score!B33>0,VLOOKUP(C34,Entrants!$A$2:$E$5000,4,FALSE),\"\")","v":""},{"$f":"IF(Score!C33>0,Score!C33,\"\")","v":""}]
[{"$f":"IF(Score!B34>0,Score!A34,\"\")","v":""},{"$f":"IF(Score!B34>0,IF(COUNTIF($E$3:$E$5000,E35)<5,\"\",IF(COUNTIF($E$3:E35,E35)>7,\"\",MAX($B$3:B34)+1)),\"\")","v":""},{"$f":"IF(Score!B34>0,Score!B34,\"\")","v":""},{"$f":"IF(Score!B34>0,VLOOKUP(C35,Entrants!$A$2:$E$5000,3,FALSE),\"\")","v":""},{"$f":"IF(Score!B34>0,VLOOKUP(C35,Entrants!$A$2:$E$5000,2,FALSE),\"\")","v":""},{"$f":"IF(Score!B34>0,VLOOKUP(C35,Entrants!$A$2:$E$5000,4,FALSE),\"\")","v":""},{"$f":"IF(Score!C34>0,Score!C34,\"\")","v":""}]
[{"$f":"IF(Score!B35>0,Score!A35,\"\")","v":""},{"$f":"IF(Score!B35>0,IF(COUNTIF($E$3:$E$5000,E36)<5,\"\",IF(COUNTIF($E$3:E36,E36)>7,\"\",MAX($B$3:B35)+1)),\"\")","v":""},{"$f":"IF(Score!B35>0,Score!B35,\"\")","v":""},{"$f":"IF(Score!B35>0,VLOOKUP(C36,Entrants!$A$2:$E$5000,3,FALSE),\"\")","v":""},{"$f":"IF(Score!B35>0,VLOOKUP(C36,Entrants!$A$2:$E$5000,2,FALSE),\"\")","v":""},{"$f":"IF(Score!B35>0,VLOOKUP(C36,Entrants!$A$2:$E$5000,4,FALSE),\"\")","v":""},{"$f":"IF(Score!C35>0,Score!C35,\"\")","v":""}]
[{"$f":"IF(Score!B36>0,Score!A36,\"\")","v":""},{"$f":"IF(Score!B36>0,IF(COUNTIF($E$3:$E$5000,E37)<5,\"\",IF(COUNTIF($E$3:E37,E37)>7,\"\",MAX($B$3:B36)+1)),\"\")","v":""},{"$f":"IF(Score!B36>0,Score!B36,\"\")","v":""},{"$f":"IF(Score!B36>0,VLOOKUP(C37,Entrants!$A$2:$E$5000,3,FALSE),\"\")","v":""},{"$f":"IF(Score!B36>0,VLOOKUP(C37,Entrants!$A$2:$E$5000,2,FALSE),\"\")","v":""},{"$f":"IF(Score!B36>0,VLOOKUP(C37,Entrants!$A$2:$E$5000,4,FALSE),\"\")","v":""},{"$f":"IF(Score!C36>0,Score!C36,\"\")","v":""}]
[{"$f":"IF(Score!B37>0,Score!A37,\"\")","v":""},{"$f":"IF(Score!B37>0,IF(COUNTIF($E$3:$E$5000,E38)<5,\"\",IF(COUNTIF($E$3:E38,E38)>7,\"\",MAX($B$3:B37)+1)),\"\")","v":""},{"$f":"IF(Score!B37>0,Score!B37,\"\")","v":""},{"$f":"IF(Score!B37>0,VLOOKUP(C38,Entrants!$A$2:$E$5000,3,FALSE),\"\")","v":""},{"$f":"IF(Score!B37>0,VLOOKUP(C38,Entrants!$A$2:$E$5000,2,FALSE),\"\")","v":""},{"$f":"IF(Score!B37>0,VLOOKUP(C38,Entrants!$A$2:$E$5000,4,FALSE),\"\")","v":""},{"$f":"IF(Score!C37>0,Score!C37,\"\")","v":""}]
[{"$f":"IF(Score!B38>0,Score!A38,\"\")","v":""},{"$f":"IF(Score!B38>0,IF(COUNTIF($E$3:$E$5000,E39)<5,\"\",IF(COUNTIF($E$3:E39,E39)>7,\"\",MAX($B$3:B38)+1)),\"\")","v":""},{"$f":"IF(Score!B38>0,Score!B38,\"\")","v":""},{"$f":"IF(Score!B38>0,VLOOKUP(C39,Entrants!$A$2:$E$5000,3,FALSE),\"\")","v":""},{"$f":"IF(Score!B38>0,VLOOKUP(C39,Entrants!$A$2:$E$5000,2,FALSE),\"\")","v":""},{"$f":"IF(Score!B38>0,VLOOKUP(C39,Entrants!$A$2:$E$5000,4,FALSE),\"\")","v":""},{"$f":"IF(Score!C38>0,Score!C38,\"\")","v":""}]
[{"$f":"IF(Score!B39>0,Score!A39,\"\")","v":""},{"$f":"IF(Score!B39>0,IF(COUNTIF($E$3:$E$5000,E40)<5,\"\",IF(COUNTIF($E$3:E40,E40)>7,\"\",MAX($B$3:B39)+1)),\"\")","v":""},{"$f":"IF(Score!B39>0,Score!B39,\"\")","v":""},{"$f":"IF(Score!B39>0,VLOOKUP(C40,Entrants!$A$2:$E$5000,3,FALSE),\"\")","v":""},{"$f":"IF(Score!B39>0,VLOOKUP(C40,Entrants!$A$2:$E$5000,2,FALSE),\"\")","v":""},{"$f":"IF(Score!B39>0,VLOOKUP(C40,Entrants!$A$2:$E$5000,4,FALSE),\"\")","v":""},{"$f":"IF(Score!C39>0,Score!C39,\"\")","v":""}]
{"$rows_left_out":961}
{"sheet":"TeamResults","index":3,"n_rows":4,"n_cols":2,"rows_kept":4,"cut":false,"hidden":false,"merged":[[1,2,1,5],[0,0,0,6]]}
["boys 2 mile"]
[null,"Team"]
[null,"M"]
[null,"S"]